Build: #195 failed

Job: Run Data Flow Acceptance Tests for Kafka failed

Stages & jobs

  1. Test Stage - Kafka

  2. Test Stage - Rabbit

Build log

The build generated 954 lines of output. Download or view full build log

13-Dec-2019 00:31:06 Build Spring Cloud Data Flow Acceptance Tests - Local + SCDF-2.0.4.BS + Skipper 2.0.4.BS (12 am) - Run Data Flow Acceptance Tests for Kafka #195 (SCDT-LOCAL20XSKIPPER20X-KAFKA-195) started building on agent bamboo-21.af.pivotal.io
13-Dec-2019 00:31:06 Remote agent on host bamboo-21.af.pivotal.io
13-Dec-2019 00:31:06 Build working directory is /opt/bamboo-home/xml-data/build-dir/SCDT-LOCAL20XSKIPPER20X-KAFKA
13-Dec-2019 00:31:06 Executing build Spring Cloud Data Flow Acceptance Tests - Local + SCDF-2.0.4.BS + Skipper 2.0.4.BS (12 am) - Run Data Flow Acceptance Tests for Kafka #195 (SCDT-LOCAL20XSKIPPER20X-KAFKA-195)
13-Dec-2019 00:31:06 Starting task 'Checkout Default Repository' of type 'com.atlassian.bamboo.plugins.vcs:task.vcs.checkout'
13-Dec-2019 00:31:06 Checking out into /opt/bamboo-home/xml-data/build-dir/SCDT-LOCAL20XSKIPPER20X-KAFKA
13-Dec-2019 00:31:06 Updating source code to revision: de5f215a8ff95acbff6f531ccc41df40caef3fbd
13-Dec-2019 00:31:06 Creating local git repository in '/opt/bamboo-home/xml-data/build-dir/SCDT-LOCAL20XSKIPPER20X-KAFKA/.git'.
13-Dec-2019 00:31:06 Initialized empty Git repository in /opt/bamboo-home/xml-data/build-dir/SCDT-LOCAL20XSKIPPER20X-KAFKA/.git/
13-Dec-2019 00:31:06 Fetching 'refs/heads/master' from 'https://github.com/spring-cloud/spring-cloud-dataflow-acceptance-tests.git'.
13-Dec-2019 00:31:08 From https://github.com/spring-cloud/spring-cloud-dataflow-acceptance-tests
13-Dec-2019 00:31:08 * [new branch]      master     -> master
13-Dec-2019 00:31:08 Checking out revision de5f215a8ff95acbff6f531ccc41df40caef3fbd.
13-Dec-2019 00:31:08 Already on 'master'
13-Dec-2019 00:31:08 Updated source code to revision: de5f215a8ff95acbff6f531ccc41df40caef3fbd
13-Dec-2019 00:31:08 Finished task 'Checkout Default Repository' with result: Success
13-Dec-2019 00:31:08 Running pre-build action: Artifactory Release Staging
13-Dec-2019 00:31:08 Running pre-build action: VCS Version Collector
13-Dec-2019 00:31:08 Starting task 'Execute Acceptance Tests' of type 'com.atlassian.bamboo.plugins.scripttask:task.builder.script'
13-Dec-2019 00:31:08
Beginning to execute external process for build 'Spring Cloud Data Flow Acceptance Tests - Local + SCDF-2.0.4.BS + Skipper 2.0.4.BS (12 am) - Run Data Flow Acceptance Tests for Kafka #195 (SCDT-LOCAL20XSKIPPER20X-KAFKA-195)'
... running command line:
/opt/bamboo-home/temp/SCDT-LOCAL20XSKIPPER20X-KAFKA-195-ScriptBuildTask-8121642362856737832.sh
... in: /opt/bamboo-home/xml-data/build-dir/SCDT-LOCAL20XSKIPPER20X-KAFKA
... using extra environment variables:
bamboo_planRepository_1_branch=master
bamboo_********_username_password=********
bamboo_signing_store_password=********
bamboo_capability_system_builder_ant_Ant_1_9=/opt/ant-1.9
bamboo_capability_system_builder_ant_Ant_1_8=/opt/ant-1.8
bamboo_planRepository_1_branchDisplayName=master
bamboo_repository_274694331_git_username=spring-buildmaster
bamboo_artifactory_override_resolve_repo=libs-milestone
bamboo_capability_system_builder_node_Node_js_10_16=/opt/node-10.16/bin/node
bamboo_repository_revision_number=de5f215a8ff95acbff6f531ccc41df40caef3fbd
bamboo_RIAK_BIN=/usr/sbin/riak
bamboo_buildKey=SCDT-LOCAL20XSKIPPER20X-KAFKA
bamboo_repository_274694331_branch_name=master
bamboo_ge_cache_username=ci
bamboo_bintray_password=********
bamboo_sonar_token_password=********
bamboo_shortJobName=Run Data Flow Acceptance Tests for Kafka
bamboo_artifactory_override_resolver_password=********
bamboo_sonatype_token=RSJChaox
bamboo_capability_system_builder_gradle___gradlew=./gradlew
bamboo_buildResultsUrl=https://build.spring.io/browse/SCDT-LOCAL20XSKIPPER20X-KAFKA-195
bamboo_capability_system_builder_mvn3_Maven_3_3=/opt/maven-3.3
bamboo_capability_system_builder_mvn3_Maven_3_2=/opt/maven-3.2
bamboo_capability_system_builder_mvn3_Maven_3_1=/opt/maven-3.1
bamboo_planRepository_repositoryUrl=https://github.com/spring-cloud/spring-cloud-dataflow-acceptance-tests.git
bamboo_capability_system_builder_mvn3_Maven_3_6=/opt/maven-3.6
bamboo_agentId=286195722
bamboo_capability_system_builder_mvn3_Maven_3_5=/opt/maven-3.5
bamboo_capability_system_builder_mvn3_Maven_3_0=/opt/maven-3.0
bamboo_planRepository_revision=de5f215a8ff95acbff6f531ccc41df40caef3fbd
bamboo_planRepository_previousRevision=ccc77f664d11e18a3b7f2fa17f012d09d08432a9
bamboo_capability_remote_build=true
bamboo_repository_branch_name=master
bamboo_sonatype_token_password=********
bamboo_sonatype_user=springsource
bamboo_repository_274694331_name=Git
bamboo_scdf_acceptance_tests_password=********
bamboo_APPLE_AC_PASSWORD=********
JAVA_HOME=/opt/jdk-8
bamboo_repository_274694331_git_branch=master
bamboo_planRepository_branch=master
bamboo_capability_system_jdk_JDK_13=/opt/jdk-13
bamboo_planRepository_1_type=gitv2
bamboo_planRepository_branchName=master
bamboo_capability_system_jdk_JDK_12=/opt/jdk-12
bamboo_capability_system_builder_gradlew_gradlew=./
bamboo_capability_system_builder_ant_Ant_1_10=/opt/ant-1.10
bamboo_sonar_password=********
bamboo_hg_cache_directory=/opt/bamboo-home/xml-data/build-dir/_hg-repositories-cache
bamboo_planRepository_1_username=spring-buildmaster
bamboo_repository_274694331_git_repositoryUrl=https://github.com/spring-cloud/spring-cloud-dataflow-acceptance-tests.git
bamboo_planRepository_type=gitv2
bamboo_git_cache_directory=/opt/bamboo-home/xml-data/build-dir/_git-repositories-cache
bamboo_artifactory_username=buildmaster
bamboo_tmp_directory=/opt/bamboo-home/temp
bamboo_planKey=SCDT-LOCAL20XSKIPPER20X
bamboo_planRepository_username=spring-buildmaster
bamboo_JDK8_HOME=/opt/jdk-8
bamboo_repository_274694331_previous_revision_number=ccc77f664d11e18a3b7f2fa17f012d09d08432a9
bamboo_planRepository_1_branchName=master
bamboo_sonar_version=6.7.7
bamboo_sonar_jdbc_password=********
bamboo_bintray_api_key_password=********
bamboo_capability_system_jdk_JDK_1_11=/opt/jdk-11
bamboo_resultsUrl=https://build.spring.io/browse/SCDT-LOCAL20XSKIPPER20X-KAFKA-195
bamboo_APPLE_AC_USERNAME_PASSWORD=********
bamboo_capability_system_jdk_JDK_1_10=/opt/jdk-10
bamboo_build_working_directory=/opt/bamboo-home/xml-data/build-dir/SCDT-LOCAL20XSKIPPER20X-KAFKA
bamboo_planRepository_1_name=Git
bamboo_capability_system_os=ubuntu1804
bamboo_nexusPush_stagingProfile=buildmaster
bamboo_shortPlanName=Local + SCDF-2.0.4.BS + Skipper 2.0.4.BS (12 am)
bamboo_planRepository_name=Git
bamboo_buildNumber=195
bamboo_planName=Spring Cloud Data Flow Acceptance Tests - Local + SCDF-2.0.4.BS + Skipper 2.0.4.BS (12 am)
bamboo_JDK7_HOME=/opt/jdk-7
bamboo_shortPlanKey=LOCAL20XSKIPPER20X
bamboo_shortJobKey=KAFKA
bamboo_artifactory_password=********
bamboo_buildTimeStamp=2019-12-13T00:00:56.786Z
bamboo_repository_previous_revision_number=ccc77f664d11e18a3b7f2fa17f012d09d08432a9
bamboo_sonar_username=buildmaster
bamboo_********_password=********
bamboo_repository_git_branch=master
bamboo_buildResultKey=SCDT-LOCAL20XSKIPPER20X-KAFKA-195
bamboo_nexusPush_close=true
bamboo_artifactory_override_resolver_username=buildmaster
bamboo_buildPlanName=Spring Cloud Data Flow Acceptance Tests - Local + SCDF-2.0.4.BS + Skipper 2.0.4.BS (12 am) - Run Data Flow Acceptance Tests for Kafka
bamboo_repository_274694331_revision_number=de5f215a8ff95acbff6f531ccc41df40caef3fbd
bamboo_planRepository_1_revision=de5f215a8ff95acbff6f531ccc41df40caef3fbd
bamboo_repository_name=Git
bamboo_signing_key_password=********
bamboo_capability_system_builder_groovy_Groovy_2_5=/opt/groovy-2.5
bamboo_buildFailed=false
bamboo_capability_system_docker_executable=/usr/bin/docker
bamboo_capability_system_jdk_OpenJDK_7=/opt/jdk-7
bamboo_capability_system_builder_groovy_Groovy_2_4=/opt/groovy-2.4
bamboo_artifactory_override_deployer_username=buildmaster
bamboo_capability_system_builder_command_Bash=/bin/bash
bamboo_agentWorkingDirectory=/opt/bamboo-home/xml-data/build-dir
bamboo_capability_system_git_executable=/usr/bin/git
bamboo_repository_git_username=spring-buildmaster
bamboo_planRepository_1_previousRevision=ccc77f664d11e18a3b7f2fa17f012d09d08432a9
bamboo_capability_os_family=unix
bamboo_planRepository_branchDisplayName=master
bamboo_capability_system_builder_maven_Artifactory_Maven_3_6=/opt/maven-3.6
bamboo_capability_system_builder_maven_Artifactory_Maven_3_5=/opt/maven-3.5
bamboo_capability_system_builder_maven_Artifactory_Maven_3_3=/opt/maven-3.3
bamboo_capability_system_builder_maven_Artifactory_Maven_3_2=/opt/maven-3.2
bamboo_s3_properties=/home/bamboo/tools/s3.properties
bamboo_capability_system_builder_maven_Artifactory_Maven_3_1=/opt/maven-3.1
bamboo_artifactory_override_deploy_repo=libs-snapshot-local
bamboo_capability_system_builder_maven_Artifactory_Maven_3_0=/opt/maven-3.0
bamboo_plan_storageTag=plan-274497908
bamboo_bintray_username_password=********
bamboo_repository_git_repositoryUrl=https://github.com/spring-cloud/spring-cloud-dataflow-acceptance-tests.git
bamboo_working_directory=/opt/bamboo-home/xml-data/build-dir/SCDT-LOCAL20XSKIPPER20X-KAFKA
bamboo_planRepository_1_repositoryUrl=https://github.com/spring-cloud/spring-cloud-dataflow-acceptance-tests.git
bamboo_capability_system_jdk_JDK_1_8=/opt/jdk-8
bamboo_artifactory_override_deployer_password=********
bamboo_capability_system_jdk_JDK_1_9=/opt/jdk-9
bamboo_capability_system_jdk_JDK_1_6=/opt/jdk-6
bamboo_sonatype_password=********
bamboo_capability_system_jdk_JDK_1_7=/opt/jdk-7
bamboo_sonar_ip=10.194.6.9
bamboo_ge_cache_password=********
13-Dec-2019 00:31:08 CLEANING UP RESOURCES BEFORE TESTS
13-Dec-2019 00:31:08 Setting the environment variables
13-Dec-2019 00:31:08 Export the unset env. variables from /opt/bamboo-home/xml-data/build-dir/SCDT-LOCAL20XSKIPPER20X-KAFKA/local/init/env.properties :
13-Dec-2019 00:31:08    SPRING_CLOUD_DATAFLOW_SERVER_DOWNLOAD_URL = https://repo.spring.io/libs-snapshot/org/springframework/cloud/spring-cloud-dataflow-server-local//spring-cloud-dataflow-server-local-.jar
13-Dec-2019 00:31:08    SPRING_CLOUD_SKIPPER_SERVER_DOWNLOAD_URL = https://repo.spring.io/libs-snapshot/org/springframework/cloud/spring-cloud-skipper-server//spring-cloud-skipper-server-.jar
13-Dec-2019 00:31:08    SPRING_DATASOURCE_USERNAME = spring
13-Dec-2019 00:31:08    SPRING_DATASOURCE_PASSWORD = cloud
13-Dec-2019 00:31:08    SPRING_SCHEMA_NAME = dataflow
13-Dec-2019 00:31:08    DOCKER_SERVER = localhost
13-Dec-2019 00:31:08 Setting retries to 60 and WAIT_TIME to 5
13-Dec-2019 00:31:08 Export the unset env. variables from /opt/bamboo-home/xml-data/build-dir/SCDT-LOCAL20XSKIPPER20X-KAFKA/local/binder/rabbit/env.properties :
13-Dec-2019 00:31:08    STREAM_REGISTRATION_RESOURCE = https://dataflow.spring.io/latest-stream-applications-rabbit-maven
13-Dec-2019 00:31:08    TASK_REGISTRATION_RESOURCE = https://dataflow.spring.io/latest-task-applications-maven
13-Dec-2019 00:31:08 SCDF SERVER URI: http://localhost:9393
13-Dec-2019 00:31:08 Clean up, clean up, everybody everywhere; clean up clean up, everybody do your share!
13-Dec-2019 00:31:08 Clean up servers
13-Dec-2019 00:31:09 No stopped containers
13-Dec-2019 00:31:10 No stopped containers
13-Dec-2019 00:31:11 No stopped containers
13-Dec-2019 00:31:11 FINISHED CLEANING UP RESOURCES
13-Dec-2019 00:31:11 Setting the environment variables
13-Dec-2019 00:31:11 Export the unset env. variables from /opt/bamboo-home/xml-data/build-dir/SCDT-LOCAL20XSKIPPER20X-KAFKA/local/init/env.properties :
13-Dec-2019 00:31:11    SPRING_CLOUD_DATAFLOW_SERVER_DOWNLOAD_URL = https://repo.spring.io/libs-snapshot/org/springframework/cloud/spring-cloud-dataflow-server/2.0.4.BUILD-SNAPSHOT/spring-cloud-dataflow-server-2.0.4.BUILD-SNAPSHOT.jar
13-Dec-2019 00:31:11    SPRING_CLOUD_SKIPPER_SERVER_DOWNLOAD_URL = https://repo.spring.io/libs-snapshot/org/springframework/cloud/spring-cloud-skipper-server/2.0.4.BUILD-SNAPSHOT/spring-cloud-skipper-server-2.0.4.BUILD-SNAPSHOT.jar
13-Dec-2019 00:31:11    SPRING_DATASOURCE_USERNAME = spring
13-Dec-2019 00:31:11    SPRING_DATASOURCE_PASSWORD = cloud
13-Dec-2019 00:31:11    SPRING_SCHEMA_NAME = dataflow
13-Dec-2019 00:31:11    DOCKER_SERVER = localhost
13-Dec-2019 00:31:11 Setting retries to 60 and WAIT_TIME to 5
13-Dec-2019 00:31:11 cleaning up any previous mysql docker containers...
13-Dec-2019 00:31:11 done cleaning up.
13-Dec-2019 00:31:11 Could not find a local mysql server, trying docker.
13-Dec-2019 00:31:11 Pulling mysql (mysql:5.7)...
13-Dec-2019 00:31:12 5.7: Pulling from library/mysql
13-Dec-2019 00:31:20 Digest: sha256:5779c71a4730da36f013a23a437b5831198e68e634575f487d37a0639470e3a8
13-Dec-2019 00:31:20 Status: Downloaded newer image for mysql:5.7
13-Dec-2019 00:31:20 Creating mysql_mysql_1 ...
13-Dec-2019 00:31:20
13-Dec-2019 00:31:20 Creating mysql_mysql_1 ... done
13-Dec-2019 00:31:21 mysql running on localhost:3306
13-Dec-2019 00:31:21 Service host is localhost
13-Dec-2019 00:31:21 Creating kafka compose file on /opt/bamboo-home/xml-data/build-dir/SCDT-LOCAL20XSKIPPER20X-KAFKA/local/binder/kafka/docker-compose.yml
13-Dec-2019 00:31:21 cleaning up any previous kafka docker containers...
13-Dec-2019 00:31:21 done cleaning up
13-Dec-2019 00:31:21 Could not find a local kafka server, trying docker.
13-Dec-2019 00:31:21 Pulling zookeeper (wurstmeister/zookeeper:)...
13-Dec-2019 00:31:22 latest: Pulling from wurstmeister/zookeeper
13-Dec-2019 00:31:33 Digest: sha256:7a7fd44a72104bfbd24a77844bad5fabc86485b036f988ea927d1780782a6680
13-Dec-2019 00:31:33 Status: Downloaded newer image for wurstmeister/zookeeper:latest
13-Dec-2019 00:31:33 Pulling kafka (wurstmeister/kafka:2.11-0.11.0.3)...
13-Dec-2019 00:31:34 2.11-0.11.0.3: Pulling from wurstmeister/kafka
13-Dec-2019 00:31:42 Digest: sha256:04df57268bb64654df6487b3f345748fd8412a9c01953a4c1d15c2e41d413113
13-Dec-2019 00:31:42 Status: Downloaded newer image for wurstmeister/kafka:2.11-0.11.0.3
13-Dec-2019 00:31:42 Creating kafka_kafka_1 ...
13-Dec-2019 00:31:42 Creating kafka_zookeeper_1 ...
13-Dec-2019 00:31:44
13-Dec-2019 00:31:44 Creating kafka_zookeeper_1 ... done
13-Dec-2019 00:31:45
13-Dec-2019 00:31:45 Creating kafka_kafka_1     ... done
13-Dec-2019 00:31:45 kafka running on localhost:9092
13-Dec-2019 00:31:45 Export the unset env. variables from /opt/bamboo-home/xml-data/build-dir/SCDT-LOCAL20XSKIPPER20X-KAFKA/local/binder/kafka/env.properties :
13-Dec-2019 00:31:45    STREAM_REGISTRATION_RESOURCE = https://dataflow.spring.io/latest-stream-applications-kafka-maven
13-Dec-2019 00:31:45    TASK_REGISTRATION_RESOURCE = https://dataflow.spring.io/latest-task-applications-maven
13-Dec-2019 00:31:45 cleaning up any previous redis docker containers...
13-Dec-2019 00:31:45 done cleaning up.
13-Dec-2019 00:31:46 redis found on localhost
13-Dec-2019 00:31:46 SKIPPER SERVER URI: http://localhost:7577
13-Dec-2019 00:31:46 Downloading server from https://repo.spring.io/libs-snapshot/org/springframework/cloud/spring-cloud-skipper-server/2.0.4.BUILD-SNAPSHOT/spring-cloud-skipper-server-2.0.4.BUILD-SNAPSHOT.jar
13-Dec-2019 00:31:49 2019-12-13 00:31:49 URL:https://repo.spring.io/libs-snapshot/org/springframework/cloud/spring-cloud-skipper-server/2.0.4.BUILD-SNAPSHOT/spring-cloud-skipper-server-2.0.4.BUILD-SNAPSHOT.jar [84387317/84387317] -> "/opt/bamboo-home/xml-data/build-dir/SCDT-LOCAL20XSKIPPER20X-KAFKA/local/skipper-server/skipper-server.jar" [1]
13-Dec-2019 00:31:49 executing [nohup /opt/jdk-8/bin/java  -Dlogging.level.org.springframework.cloud.deployer.spi.local.LocalAppDeployer=DEBUG -Xmx1024m -Xss1024k -jar /opt/bamboo-home/xml-data/build-dir/SCDT-LOCAL20XSKIPPER20X-KAFKA/local/skipper-server/skipper-server.jar  --spring.datasource.driver-class-name=org.mariadb.jdbc.Driver --spring.datasource.url=jdbc:mysql://localhost/dataflow --spring.datasource.username=spring --spring.datasource.password=cloud  --spring.cloud.dataflow.applicationProperties.stream.spring.cloud.stream.kafka.binder.brokers=localhost --spring.cloud.dataflow.applicationProperties.stream.spring.cloud.stream.kafka.binder.zkNodes=localhost  --spring.redis.host=127.0.0.1 --spring.cloud.skipper.server.platform.local.accounts.default.workingDirectoriesRoot=/opt/bamboo-home/xml-data/build-dir/SCDT-LOCAL20XSKIPPER20X-KAFKA/local/skipper-server/app-logs > /opt/bamboo-home/xml-data/build-dir/SCDT-LOCAL20XSKIPPER20X-KAFKA/local/skipper-server/skipper-server.log &]
13-Dec-2019 00:31:49 [/opt/bamboo-home/xml-data/build-dir/SCDT-LOCAL20XSKIPPER20X-KAFKA/local/skipper-server] process pid is [26061]
13-Dec-2019 00:31:49 System props are []
13-Dec-2019 00:31:49 Logs are under [/opt/bamboo-home/xml-data/build-dir/SCDT-LOCAL20XSKIPPER20X-KAFKA/local/skipper-server/skipper-server.log] or from nohup [/opt/bamboo-home/xml-data/build-dir/SCDT-LOCAL20XSKIPPER20X-KAFKA/local/skipper-server/nohup.log]
13-Dec-2019 00:31:49 Failed to connect to localhost:7577. Attempt  #1/60... will try again in [5] seconds
13-Dec-2019 00:31:54 Failed to connect to localhost:7577. Attempt  #2/60... will try again in [5] seconds
13-Dec-2019 00:31:59 Failed to connect to localhost:7577. Attempt  #3/60... will try again in [5] seconds
13-Dec-2019 00:32:04 Failed to connect to localhost:7577. Attempt  #4/60... will try again in [5] seconds
13-Dec-2019 00:32:10 SCDF SERVER URI: http://localhost:9393
13-Dec-2019 00:32:10 Downloading server from https://repo.spring.io/libs-snapshot/org/springframework/cloud/spring-cloud-dataflow-server/2.0.4.BUILD-SNAPSHOT/spring-cloud-dataflow-server-2.0.4.BUILD-SNAPSHOT.jar
13-Dec-2019 00:32:14 2019-12-13 00:32:14 URL:https://repo.spring.io/libs-snapshot/org/springframework/cloud/spring-cloud-dataflow-server/2.0.4.BUILD-SNAPSHOT/spring-cloud-dataflow-server-2.0.4.BUILD-SNAPSHOT.jar [87897631/87897631] -> "/opt/bamboo-home/xml-data/build-dir/SCDT-LOCAL20XSKIPPER20X-KAFKA/local/server/scdf-server.jar" [1]
13-Dec-2019 00:32:14 SPRING_PROFILES_ACTIVE []
13-Dec-2019 00:32:14 executing [nohup /opt/jdk-8/bin/java  -Xmx1024m -Xss1024k -jar /opt/bamboo-home/xml-data/build-dir/SCDT-LOCAL20XSKIPPER20X-KAFKA/local/server/scdf-server.jar  --spring.datasource.driver-class-name=org.mariadb.jdbc.Driver --spring.datasource.url=jdbc:mysql://localhost/dataflow --spring.datasource.username=spring --spring.datasource.password=cloud  --spring.cloud.dataflow.applicationProperties.stream.spring.cloud.stream.kafka.binder.brokers=localhost --spring.cloud.dataflow.applicationProperties.stream.spring.cloud.stream.kafka.binder.zkNodes=localhost  --spring.redis.host=127.0.0.1 --spring.cloud.skipper.server.platform.local.accounts.default.workingDirectoriesRoot=/opt/bamboo-home/xml-data/build-dir/SCDT-LOCAL20XSKIPPER20X-KAFKA/local/skipper-server/app-logs --spring.cloud.dataflow.features.skipper-enabled=true > /opt/bamboo-home/xml-data/build-dir/SCDT-LOCAL20XSKIPPER20X-KAFKA/local/server/scdf-server.log &]
13-Dec-2019 00:32:14 [/opt/bamboo-home/xml-data/build-dir/SCDT-LOCAL20XSKIPPER20X-KAFKA/local/server] process pid is [26142]
13-Dec-2019 00:32:14 System props are []
13-Dec-2019 00:32:14 Logs are under [/opt/bamboo-home/xml-data/build-dir/SCDT-LOCAL20XSKIPPER20X-KAFKA/local/server/scdf-server.log] or from nohup [/opt/bamboo-home/xml-data/build-dir/SCDT-LOCAL20XSKIPPER20X-KAFKA/local/server/nohup.log]
13-Dec-2019 00:32:14 Failed to connect to localhost:9393. Attempt  #1/60... will try again in [5] seconds
13-Dec-2019 00:32:19 Failed to connect to localhost:9393. Attempt  #2/60... will try again in [5] seconds
13-Dec-2019 00:32:24 Failed to connect to localhost:9393. Attempt  #3/60... will try again in [5] seconds
13-Dec-2019 00:32:30 SCDF SERVER ABOUT:
13-Dec-2019 00:32:30 --2019-12-13 00:32:30--  http://localhost:9393/about
13-Dec-2019 00:32:30 Resolving localhost (localhost)... ::1, 127.0.0.1
13-Dec-2019 00:32:30 Connecting to localhost (localhost)|::1|:9393... connected.
13-Dec-2019 00:32:31 HTTP request sent, awaiting response... 200
13-Dec-2019 00:32:31 Length: unspecified [application/hal+json]
13-Dec-2019 00:32:31 Saving to: ‘STDOUT’
13-Dec-2019 00:32:31
13-Dec-2019 00:32:31      0K .                                                       196M=0s
13-Dec-2019 00:32:31
13-Dec-2019 00:32:31 2019-12-13 00:32:31 (196 MB/s) - written to stdout [1681]
13-Dec-2019 00:32:31
13-Dec-2019 00:32:31 {
13-Dec-2019 00:32:31     "_links": {
13-Dec-2019 00:32:31         "self": {
13-Dec-2019 00:32:31             "href": "http://localhost:9393/about"
13-Dec-2019 00:32:31         }
13-Dec-2019 00:32:31     },
13-Dec-2019 00:32:31     "featureInfo": {
13-Dec-2019 00:32:31         "analyticsEnabled": true,
13-Dec-2019 00:32:31         "grafanaEnabled": false,
13-Dec-2019 00:32:31         "schedulesEnabled": false,
13-Dec-2019 00:32:31         "streamsEnabled": true,
13-Dec-2019 00:32:31         "tasksEnabled": true
13-Dec-2019 00:32:31     },
13-Dec-2019 00:32:31     "grafanaInfo": {
13-Dec-2019 00:32:31         "refreshInterval": 15,
13-Dec-2019 00:32:31         "url": ""
13-Dec-2019 00:32:31     },
13-Dec-2019 00:32:31     "runtimeEnvironment": {
13-Dec-2019 00:32:31         "appDeployer": {
13-Dec-2019 00:32:31             "deployerImplementationVersion": "2.0.4.BUILD-SNAPSHOT",
13-Dec-2019 00:32:31             "deployerName": "Spring Cloud Skipper Server",
13-Dec-2019 00:32:31             "deployerSpiVersion": "2.0.3.RELEASE",
13-Dec-2019 00:32:31             "javaVersion": "1.8.0_232",
13-Dec-2019 00:32:31             "platformApiVersion": "",
13-Dec-2019 00:32:31             "platformClientVersion": "",
13-Dec-2019 00:32:31             "platformHostVersion": "",
13-Dec-2019 00:32:31             "platformSpecificInfo": {
13-Dec-2019 00:32:31                 "default": "local"
13-Dec-2019 00:32:31             },
13-Dec-2019 00:32:31             "platformType": "Skipper Managed",
13-Dec-2019 00:32:31             "springBootVersion": "2.1.3.RELEASE",
13-Dec-2019 00:32:31             "springVersion": "5.1.5.RELEASE"
13-Dec-2019 00:32:31         },
13-Dec-2019 00:32:31         "taskLaunchers": [
13-Dec-2019 00:32:31             {
13-Dec-2019 00:32:31                 "deployerImplementationVersion": "2.0.3.RELEASE",
13-Dec-2019 00:32:31                 "deployerName": "LocalTaskLauncher",
13-Dec-2019 00:32:31                 "deployerSpiVersion": "2.0.2.RELEASE",
13-Dec-2019 00:32:31                 "javaVersion": "1.8.0_232",
13-Dec-2019 00:32:31                 "platformApiVersion": "Linux 4.15.0-66-generic",
13-Dec-2019 00:32:31                 "platformClientVersion": "4.15.0-66-generic",
13-Dec-2019 00:32:31                 "platformHostVersion": "4.15.0-66-generic",
13-Dec-2019 00:32:31                 "platformSpecificInfo": {},
13-Dec-2019 00:32:31                 "platformType": "Local",
13-Dec-2019 00:32:31                 "springBootVersion": "2.1.3.RELEASE",
13-Dec-2019 00:32:31                 "springVersion": "5.1.5.RELEASE"
13-Dec-2019 00:32:31             }
13-Dec-2019 00:32:31         ]
13-Dec-2019 00:32:31     },
13-Dec-2019 00:32:31     "securityInfo": {
13-Dec-2019 00:32:31         "authenticated": false,
13-Dec-2019 00:32:31         "authenticationEnabled": false,
13-Dec-2019 00:32:31         "roles": [],
13-Dec-2019 00:32:31         "username": null
13-Dec-2019 00:32:31     },
13-Dec-2019 00:32:31     "versionInfo": {
13-Dec-2019 00:32:31         "core": {
13-Dec-2019 00:32:31             "name": "Spring Cloud Data Flow Core",
13-Dec-2019 00:32:31             "version": "2.0.4.BUILD-SNAPSHOT"
13-Dec-2019 00:32:31         },
13-Dec-2019 00:32:31         "dashboard": {
13-Dec-2019 00:32:31             "name": "Spring Cloud Dataflow UI",
13-Dec-2019 00:32:31             "version": "2.0.3.RELEASE"
13-Dec-2019 00:32:31         },
13-Dec-2019 00:32:31         "implementation": {
13-Dec-2019 00:32:31             "name": "spring-cloud-dataflow-server",
13-Dec-2019 00:32:31             "version": "2.0.4.BUILD-SNAPSHOT"
13-Dec-2019 00:32:31         },
13-Dec-2019 00:32:31         "shell": {
13-Dec-2019 00:32:31             "name": "Spring Cloud Data Flow Shell",
13-Dec-2019 00:32:31             "url": "https://repo.spring.io/libs-snapshot/org/springframework/cloud/spring-cloud-dataflow-shell/2.0.4.BUILD-SNAPSHOT/spring-cloud-dataflow-shell-2.0.4.BUILD-SNAPSHOT.jar",
13-Dec-2019 00:32:31             "version": "2.0.4.BUILD-SNAPSHOT"
13-Dec-2019 00:32:31         }
13-Dec-2019 00:32:31     }
13-Dec-2019 00:32:31 }
13-Dec-2019 00:32:31 SKIPPER SERVER ABOUT:
13-Dec-2019 00:32:31 --2019-12-13 00:32:31--  http://localhost:7577/api/about
13-Dec-2019 00:32:31 Resolving localhost (localhost)... ::1, 127.0.0.1
13-Dec-2019 00:32:31 Connecting to localhost (localhost)|::1|:7577... connected.
13-Dec-2019 00:32:31 HTTP request sent, awaiting response... 200
13-Dec-2019 00:32:31 Length: unspecified [application/hal+json]
13-Dec-2019 00:32:31 Saving to: ‘STDOUT’
13-Dec-2019 00:32:31
13-Dec-2019 00:32:31      0K                                                        62.1M=0s
13-Dec-2019 00:32:31
13-Dec-2019 00:32:31 2019-12-13 00:32:31 (62.1 MB/s) - written to stdout [426]
13-Dec-2019 00:32:31
13-Dec-2019 00:32:31 {
13-Dec-2019 00:32:31     "versionInfo": {
13-Dec-2019 00:32:31         "server": {
13-Dec-2019 00:32:31             "name": "Spring Cloud Skipper Server",
13-Dec-2019 00:32:31             "version": "2.0.4.BUILD-SNAPSHOT"
13-Dec-2019 00:32:31         },
13-Dec-2019 00:32:31         "shell": {
13-Dec-2019 00:32:31             "name": "Spring Cloud Skipper Shell",
13-Dec-2019 00:32:31             "url": "https://repo.spring.io/libs-snapshot/org/springframework/cloud/spring-cloud-skipper-shell/2.0.4.BUILD-SNAPSHOT/spring-cloud-skipper-shell-2.0.4.BUILD-SNAPSHOT.jar",
13-Dec-2019 00:32:31             "version": "2.0.4.BUILD-SNAPSHOT"
13-Dec-2019 00:32:31         }
13-Dec-2019 00:32:31     }
13-Dec-2019 00:32:31 }
13-Dec-2019 00:32:32 [INFO] Scanning for projects...
13-Dec-2019 00:32:32 [INFO] Downloading: https://repo.spring.io/libs-snapshot-local/org/apache/maven/plugins/maven-metadata.xml
13-Dec-2019 00:32:32 [INFO] Downloading: https://repo.spring.io/libs-snapshot-local/org/codehaus/mojo/maven-metadata.xml
13-Dec-2019 00:32:32 [INFO] Downloading: https://repo.spring.io/libs-milestone-local/org/codehaus/mojo/maven-metadata.xml
13-Dec-2019 00:32:32 [INFO] Downloading: https://repo.spring.io/libs-milestone-local/org/apache/maven/plugins/maven-metadata.xml
13-Dec-2019 00:32:33 [INFO] Downloading: https://repo.spring.io/libs-snapshot-local/org/apache/maven/plugins/maven-surefire-report-plugin/maven-metadata.xml
13-Dec-2019 00:32:33 [INFO] Downloading: https://repo.spring.io/libs-milestone-local/org/apache/maven/plugins/maven-surefire-report-plugin/maven-metadata.xml
13-Dec-2019 00:32:33 [INFO]                                                                         
13-Dec-2019 00:32:33 [INFO] ------------------------------------------------------------------------
13-Dec-2019 00:32:33 [INFO] Building Data Flow Acceptance Tests 1.1.0.BUILD-SNAPSHOT
13-Dec-2019 00:32:33 [INFO] ------------------------------------------------------------------------
13-Dec-2019 00:32:33 [INFO] Downloading: https://repo.spring.io/libs-snapshot-local/org/springframework/cloud/spring-cloud-dataflow-rest-client/1.7.0.BUILD-SNAPSHOT/maven-metadata.xml
13-Dec-2019 00:32:33 [INFO] Downloaded: https://repo.spring.io/libs-snapshot-local/org/springframework/cloud/spring-cloud-dataflow-rest-client/1.7.0.BUILD-SNAPSHOT/maven-metadata.xml (2 KB at 6.8 KB/sec)
13-Dec-2019 00:32:33 [INFO] Downloading: https://repo.spring.io/libs-snapshot-local/org/springframework/cloud/spring-cloud-dataflow-parent/1.7.0.BUILD-SNAPSHOT/maven-metadata.xml
13-Dec-2019 00:32:34 [INFO] Downloaded: https://repo.spring.io/libs-snapshot-local/org/springframework/cloud/spring-cloud-dataflow-parent/1.7.0.BUILD-SNAPSHOT/maven-metadata.xml (646 B at 3.9 KB/sec)
13-Dec-2019 00:32:34 [INFO] Downloading: https://repo.spring.io/libs-snapshot-local/org/springframework/cloud/spring-cloud-dataflow-dependencies/1.7.0.BUILD-SNAPSHOT/maven-metadata.xml
13-Dec-2019 00:32:34 [INFO] Downloaded: https://repo.spring.io/libs-snapshot-local/org/springframework/cloud/spring-cloud-dataflow-dependencies/1.7.0.BUILD-SNAPSHOT/maven-metadata.xml (652 B at 3.9 KB/sec)
13-Dec-2019 00:32:34 [INFO] Downloading: https://repo.spring.io/libs-snapshot-local/org/springframework/cloud/spring-cloud-dataflow-rest-resource/1.7.0.BUILD-SNAPSHOT/maven-metadata.xml
13-Dec-2019 00:32:34 [INFO] Downloaded: https://repo.spring.io/libs-snapshot-local/org/springframework/cloud/spring-cloud-dataflow-rest-resource/1.7.0.BUILD-SNAPSHOT/maven-metadata.xml (2 KB at 7.7 KB/sec)
13-Dec-2019 00:32:34 [INFO] Downloading: https://repo.spring.io/libs-snapshot-local/org/springframework/cloud/spring-cloud-dataflow-core/1.7.0.BUILD-SNAPSHOT/maven-metadata.xml
13-Dec-2019 00:32:34 [INFO] Downloaded: https://repo.spring.io/libs-snapshot-local/org/springframework/cloud/spring-cloud-dataflow-core/1.7.0.BUILD-SNAPSHOT/maven-metadata.xml (2 KB at 7.7 KB/sec)
13-Dec-2019 00:32:34 [INFO]
13-Dec-2019 00:32:34 [INFO] --- maven-checkstyle-plugin:2.17:check (checkstyle-validation) @ spring-cloud-dataflow-acceptance-tests ---
13-Dec-2019 00:32:35 [INFO]
13-Dec-2019 00:32:35 [INFO] --- maven-resources-plugin:2.6:resources (default-resources) @ spring-cloud-dataflow-acceptance-tests ---
13-Dec-2019 00:32:35 [INFO] Using 'UTF-8' encoding to copy filtered resources.
13-Dec-2019 00:32:35 [INFO] skip non existing resourceDirectory /opt/bamboo-home/xml-data/build-dir/SCDT-LOCAL20XSKIPPER20X-KAFKA/src/main/resources
13-Dec-2019 00:32:35 [INFO] skip non existing resourceDirectory /opt/bamboo-home/xml-data/build-dir/SCDT-LOCAL20XSKIPPER20X-KAFKA/src/main/resources
13-Dec-2019 00:32:35 [INFO]
13-Dec-2019 00:32:35 [INFO] --- maven-compiler-plugin:3.1:compile (default-compile) @ spring-cloud-dataflow-acceptance-tests ---
13-Dec-2019 00:32:35 [INFO] Changes detected - recompiling the module!
13-Dec-2019 00:32:35 [INFO] Compiling 8 source files to /opt/bamboo-home/xml-data/build-dir/SCDT-LOCAL20XSKIPPER20X-KAFKA/target/classes
13-Dec-2019 00:32:36 [INFO]
13-Dec-2019 00:32:36 [INFO] --- maven-resources-plugin:2.6:testResources (default-testResources) @ spring-cloud-dataflow-acceptance-tests ---
13-Dec-2019 00:32:36 [INFO] Using 'UTF-8' encoding to copy filtered resources.
13-Dec-2019 00:32:36 [INFO] Copying 1 resource
13-Dec-2019 00:32:36 [INFO]
13-Dec-2019 00:32:36 [INFO] --- maven-compiler-plugin:3.1:testCompile (default-testCompile) @ spring-cloud-dataflow-acceptance-tests ---
13-Dec-2019 00:32:36 [INFO] Changes detected - recompiling the module!
13-Dec-2019 00:32:36 [INFO] Compiling 16 source files to /opt/bamboo-home/xml-data/build-dir/SCDT-LOCAL20XSKIPPER20X-KAFKA/target/test-classes
13-Dec-2019 00:32:36 [WARNING] /opt/bamboo-home/xml-data/build-dir/SCDT-LOCAL20XSKIPPER20X-KAFKA/src/test/java/org/springframework/cloud/dataflow/acceptance/test/AbstractTaskTests.java: Some input files use unchecked or unsafe operations.
13-Dec-2019 00:32:36 [WARNING] /opt/bamboo-home/xml-data/build-dir/SCDT-LOCAL20XSKIPPER20X-KAFKA/src/test/java/org/springframework/cloud/dataflow/acceptance/test/AbstractTaskTests.java: Recompile with -Xlint:unchecked for details.
13-Dec-2019 00:32:36 [INFO]
13-Dec-2019 00:32:36 [INFO] --- maven-surefire-plugin:2.18.1:test (default-test) @ spring-cloud-dataflow-acceptance-tests ---
13-Dec-2019 00:32:36 [INFO] Surefire report directory: /opt/bamboo-home/xml-data/build-dir/SCDT-LOCAL20XSKIPPER20X-KAFKA/target/surefire-reports
13-Dec-2019 00:32:36
13-Dec-2019 00:32:36 -------------------------------------------------------
13-Dec-2019 00:32:36 T E S T S
13-Dec-2019 00:32:36 -------------------------------------------------------
13-Dec-2019 00:32:37 2019-12-13 00:32:37.265  INFO   --- [           main] .b.t.c.SpringBootTestContextBootstrapper : Neither @ContextConfiguration nor @ContextHierarchy found for test class [org.springframework.cloud.dataflow.acceptance.test.AnalyticsTests], using SpringBootContextLoader
13-Dec-2019 00:32:37 2019-12-13 00:32:37.307  INFO   --- [           main] .b.t.c.SpringBootTestContextBootstrapper : Loaded default TestExecutionListener class names from location [META-INF/spring.factories]: [org.springframework.boot.test.mock.mockito.MockitoTestExecutionListener, org.springframework.boot.test.mock.mockito.ResetMocksTestExecutionListener, org.springframework.boot.test.autoconfigure.restdocs.RestDocsTestExecutionListener, org.springframework.boot.test.autoconfigure.web.client.MockRestServiceServerResetTestExecutionListener, org.springframework.boot.test.autoconfigure.web.servlet.MockMvcPrintOnlyOnFailureTestExecutionListener, org.springframework.boot.test.autoconfigure.web.servlet.WebDriverTestExecutionListener, org.springframework.test.context.web.ServletTestExecutionListener, org.springframework.test.context.support.DirtiesContextBeforeModesTestExecutionListener, org.springframework.test.context.support.DependencyInjectionTestExecutionListener, org.springframework.test.context.support.DirtiesContextTestExecutionListener, org.springframework.test.context.transaction.TransactionalTestExecutionListener, org.springframework.test.context.jdbc.SqlScriptsTestExecutionListener]
13-Dec-2019 00:32:37 2019-12-13 00:32:37.323  INFO   --- [           main] .b.t.c.SpringBootTestContextBootstrapper : Using TestExecutionListeners: [org.springframework.test.context.web.ServletTestExecutionListener@4b5d6a01, org.springframework.test.context.support.DirtiesContextBeforeModesTestExecutionListener@4a22f9e2, org.springframework.boot.test.autoconfigure.SpringBootDependencyInjectionTestExecutionListener@3c419631, org.springframework.test.context.support.DirtiesContextTestExecutionListener@418e7838, org.springframework.test.context.transaction.TransactionalTestExecutionListener@61230f6a, org.springframework.test.context.jdbc.SqlScriptsTestExecutionListener@3c130745, org.springframework.boot.test.mock.mockito.MockitoTestExecutionListener@cd3fee8, org.springframework.boot.test.autoconfigure.web.servlet.MockMvcPrintOnlyOnFailureTestExecutionListener@3e2e18f2, org.springframework.boot.test.autoconfigure.web.client.MockRestServiceServerResetTestExecutionListener@470f1802, org.springframework.boot.test.mock.mockito.ResetMocksTestExecutionListener@63021689, org.springframework.boot.test.autoconfigure.web.servlet.WebDriverTestExecutionListener@703580bf, org.springframework.boot.test.autoconfigure.restdocs.RestDocsTestExecutionListener@3e92efc3]
13-Dec-2019 00:32:37 2019-12-13 00:32:37.325  INFO   --- [           main] .b.t.c.SpringBootTestContextBootstrapper : Neither @ContextConfiguration nor @ContextHierarchy found for test class [org.springframework.cloud.dataflow.acceptance.test.WoodChuckTests], using SpringBootContextLoader
13-Dec-2019 00:32:37 2019-12-13 00:32:37.337  INFO   --- [           main] .b.t.c.SpringBootTestContextBootstrapper : Loaded default TestExecutionListener class names from location [META-INF/spring.factories]: [org.springframework.boot.test.mock.mockito.MockitoTestExecutionListener, org.springframework.boot.test.mock.mockito.ResetMocksTestExecutionListener, org.springframework.boot.test.autoconfigure.restdocs.RestDocsTestExecutionListener, org.springframework.boot.test.autoconfigure.web.client.MockRestServiceServerResetTestExecutionListener, org.springframework.boot.test.autoconfigure.web.servlet.MockMvcPrintOnlyOnFailureTestExecutionListener, org.springframework.boot.test.autoconfigure.web.servlet.WebDriverTestExecutionListener, org.springframework.test.context.web.ServletTestExecutionListener, org.springframework.test.context.support.DirtiesContextBeforeModesTestExecutionListener, org.springframework.test.context.support.DependencyInjectionTestExecutionListener, org.springframework.test.context.support.DirtiesContextTestExecutionListener, org.springframework.test.context.transaction.TransactionalTestExecutionListener, org.springframework.test.context.jdbc.SqlScriptsTestExecutionListener]
13-Dec-2019 00:32:37 2019-12-13 00:32:37.340  INFO   --- [           main] .b.t.c.SpringBootTestContextBootstrapper : Using TestExecutionListeners: [org.springframework.test.context.web.ServletTestExecutionListener@7ec7ffd3, org.springframework.test.context.support.DirtiesContextBeforeModesTestExecutionListener@5b239d7d, org.springframework.boot.test.autoconfigure.SpringBootDependencyInjectionTestExecutionListener@6572421, org.springframework.test.context.support.DirtiesContextTestExecutionListener@6b81ce95, org.springframework.test.context.transaction.TransactionalTestExecutionListener@2a798d51, org.springframework.test.context.jdbc.SqlScriptsTestExecutionListener@6d763516, org.springframework.boot.test.mock.mockito.MockitoTestExecutionListener@52bf72b5, org.springframework.boot.test.autoconfigure.web.servlet.MockMvcPrintOnlyOnFailureTestExecutionListener@37afeb11, org.springframework.boot.test.autoconfigure.web.client.MockRestServiceServerResetTestExecutionListener@515aebb0, org.springframework.boot.test.mock.mockito.ResetMocksTestExecutionListener@dd8ba08, org.springframework.boot.test.autoconfigure.web.servlet.WebDriverTestExecutionListener@245b4bdc, org.springframework.boot.test.autoconfigure.restdocs.RestDocsTestExecutionListener@6c64cb25]
13-Dec-2019 00:32:37 2019-12-13 00:32:37.341  INFO   --- [           main] .b.t.c.SpringBootTestContextBootstrapper : Neither @ContextConfiguration nor @ContextHierarchy found for test class [org.springframework.cloud.dataflow.acceptance.test.HttpSourceTests], using SpringBootContextLoader
13-Dec-2019 00:32:37 2019-12-13 00:32:37.350  INFO   --- [           main] .b.t.c.SpringBootTestContextBootstrapper : Loaded default TestExecutionListener class names from location [META-INF/spring.factories]: [org.springframework.boot.test.mock.mockito.MockitoTestExecutionListener, org.springframework.boot.test.mock.mockito.ResetMocksTestExecutionListener, org.springframework.boot.test.autoconfigure.restdocs.RestDocsTestExecutionListener, org.springframework.boot.test.autoconfigure.web.client.MockRestServiceServerResetTestExecutionListener, org.springframework.boot.test.autoconfigure.web.servlet.MockMvcPrintOnlyOnFailureTestExecutionListener, org.springframework.boot.test.autoconfigure.web.servlet.WebDriverTestExecutionListener, org.springframework.test.context.web.ServletTestExecutionListener, org.springframework.test.context.support.DirtiesContextBeforeModesTestExecutionListener, org.springframework.test.context.support.DependencyInjectionTestExecutionListener, org.springframework.test.context.support.DirtiesContextTestExecutionListener, org.springframework.test.context.transaction.TransactionalTestExecutionListener, org.springframework.test.context.jdbc.SqlScriptsTestExecutionListener]
13-Dec-2019 00:32:37 2019-12-13 00:32:37.354  INFO   --- [           main] .b.t.c.SpringBootTestContextBootstrapper : Using TestExecutionListeners: [org.springframework.test.context.web.ServletTestExecutionListener@40a4337a, org.springframework.test.context.support.DirtiesContextBeforeModesTestExecutionListener@6025e1b6, org.springframework.boot.test.autoconfigure.SpringBootDependencyInjectionTestExecutionListener@22ff4249, org.springframework.test.context.support.DirtiesContextTestExecutionListener@2d1ef81a, org.springframework.test.context.transaction.TransactionalTestExecutionListener@4c402120, org.springframework.test.context.jdbc.SqlScriptsTestExecutionListener@327514f, org.springframework.boot.test.mock.mockito.MockitoTestExecutionListener@5b12b668, org.springframework.boot.test.autoconfigure.web.servlet.MockMvcPrintOnlyOnFailureTestExecutionListener@1165b38, org.springframework.boot.test.autoconfigure.web.client.MockRestServiceServerResetTestExecutionListener@4c12331b, org.springframework.boot.test.mock.mockito.ResetMocksTestExecutionListener@7586beff, org.springframework.boot.test.autoconfigure.web.servlet.WebDriverTestExecutionListener@3b69e7d1, org.springframework.boot.test.autoconfigure.restdocs.RestDocsTestExecutionListener@815b41f]
13-Dec-2019 00:32:37 2019-12-13 00:32:37.369  INFO   --- [           main] .b.t.c.SpringBootTestContextBootstrapper : Neither @ContextConfiguration nor @ContextHierarchy found for test class [org.springframework.cloud.dataflow.acceptance.test.TickTockTests], using SpringBootContextLoader
13-Dec-2019 00:32:37 2019-12-13 00:32:37.377  INFO   --- [           main] .b.t.c.SpringBootTestContextBootstrapper : Loaded default TestExecutionListener class names from location [META-INF/spring.factories]: [org.springframework.boot.test.mock.mockito.MockitoTestExecutionListener, org.springframework.boot.test.mock.mockito.ResetMocksTestExecutionListener, org.springframework.boot.test.autoconfigure.restdocs.RestDocsTestExecutionListener, org.springframework.boot.test.autoconfigure.web.client.MockRestServiceServerResetTestExecutionListener, org.springframework.boot.test.autoconfigure.web.servlet.MockMvcPrintOnlyOnFailureTestExecutionListener, org.springframework.boot.test.autoconfigure.web.servlet.WebDriverTestExecutionListener, org.springframework.test.context.web.ServletTestExecutionListener, org.springframework.test.context.support.DirtiesContextBeforeModesTestExecutionListener, org.springframework.test.context.support.DependencyInjectionTestExecutionListener, org.springframework.test.context.support.DirtiesContextTestExecutionListener, org.springframework.test.context.transaction.TransactionalTestExecutionListener, org.springframework.test.context.jdbc.SqlScriptsTestExecutionListener]
13-Dec-2019 00:32:37 2019-12-13 00:32:37.380  INFO   --- [           main] .b.t.c.SpringBootTestContextBootstrapper : Using TestExecutionListeners: [org.springframework.test.context.web.ServletTestExecutionListener@55b53d44, org.springframework.test.context.support.DirtiesContextBeforeModesTestExecutionListener@482bce4f, org.springframework.boot.test.autoconfigure.SpringBootDependencyInjectionTestExecutionListener@366647c2, org.springframework.test.context.support.DirtiesContextTestExecutionListener@6a6afff2, org.springframework.test.context.transaction.TransactionalTestExecutionListener@1649b0e6, org.springframework.test.context.jdbc.SqlScriptsTestExecutionListener@865dd6, org.springframework.boot.test.mock.mockito.MockitoTestExecutionListener@4da4253, org.springframework.boot.test.autoconfigure.web.servlet.MockMvcPrintOnlyOnFailureTestExecutionListener@3972a855, org.springframework.boot.test.autoconfigure.web.client.MockRestServiceServerResetTestExecutionListener@62e7f11d, org.springframework.boot.test.mock.mockito.ResetMocksTestExecutionListener@503d687a, org.springframework.boot.test.autoconfigure.web.servlet.WebDriverTestExecutionListener@6a370f4, org.springframework.boot.test.autoconfigure.restdocs.RestDocsTestExecutionListener@2abf4075]
13-Dec-2019 00:32:37 2019-12-13 00:32:37.388  INFO   --- [           main] .b.t.c.SpringBootTestContextBootstrapper : Neither @ContextConfiguration nor @ContextHierarchy found for test class [org.springframework.cloud.dataflow.acceptance.test.TransformTests], using SpringBootContextLoader
13-Dec-2019 00:32:37 2019-12-13 00:32:37.396  INFO   --- [           main] .b.t.c.SpringBootTestContextBootstrapper : Loaded default TestExecutionListener class names from location [META-INF/spring.factories]: [org.springframework.boot.test.mock.mockito.MockitoTestExecutionListener, org.springframework.boot.test.mock.mockito.ResetMocksTestExecutionListener, org.springframework.boot.test.autoconfigure.restdocs.RestDocsTestExecutionListener, org.springframework.boot.test.autoconfigure.web.client.MockRestServiceServerResetTestExecutionListener, org.springframework.boot.test.autoconfigure.web.servlet.MockMvcPrintOnlyOnFailureTestExecutionListener, org.springframework.boot.test.autoconfigure.web.servlet.WebDriverTestExecutionListener, org.springframework.test.context.web.ServletTestExecutionListener, org.springframework.test.context.support.DirtiesContextBeforeModesTestExecutionListener, org.springframework.test.context.support.DependencyInjectionTestExecutionListener, org.springframework.test.context.support.DirtiesContextTestExecutionListener, org.springframework.test.context.transaction.TransactionalTestExecutionListener, org.springframework.test.context.jdbc.SqlScriptsTestExecutionListener]
13-Dec-2019 00:32:37 2019-12-13 00:32:37.399  INFO   --- [           main] .b.t.c.SpringBootTestContextBootstrapper : Using TestExecutionListeners: [org.springframework.test.context.web.ServletTestExecutionListener@51e69659, org.springframework.test.context.support.DirtiesContextBeforeModesTestExecutionListener@47e2e487, org.springframework.boot.test.autoconfigure.SpringBootDependencyInjectionTestExecutionListener@201a4587, org.springframework.test.context.support.DirtiesContextTestExecutionListener@61001b64, org.springframework.test.context.transaction.TransactionalTestExecutionListener@4310d43, org.springframework.test.context.jdbc.SqlScriptsTestExecutionListener@54a7079e, org.springframework.boot.test.mock.mockito.MockitoTestExecutionListener@26e356f0, org.springframework.boot.test.autoconfigure.web.servlet.MockMvcPrintOnlyOnFailureTestExecutionListener@47d9a273, org.springframework.boot.test.autoconfigure.web.client.MockRestServiceServerResetTestExecutionListener@4b8ee4de, org.springframework.boot.test.mock.mockito.ResetMocksTestExecutionListener@27f981c6, org.springframework.boot.test.autoconfigure.web.servlet.WebDriverTestExecutionListener@1b11171f, org.springframework.boot.test.autoconfigure.restdocs.RestDocsTestExecutionListener@1151e434]
13-Dec-2019 00:32:37 2019-12-13 00:32:37.411  INFO   --- [           main] .b.t.c.SpringBootTestContextBootstrapper : Neither @ContextConfiguration nor @ContextHierarchy found for test class [org.springframework.cloud.dataflow.acceptance.test.NamedChannelTests], using SpringBootContextLoader
13-Dec-2019 00:32:37 2019-12-13 00:32:37.418  INFO   --- [           main] .b.t.c.SpringBootTestContextBootstrapper : Loaded default TestExecutionListener class names from location [META-INF/spring.factories]: [org.springframework.boot.test.mock.mockito.MockitoTestExecutionListener, org.springframework.boot.test.mock.mockito.ResetMocksTestExecutionListener, org.springframework.boot.test.autoconfigure.restdocs.RestDocsTestExecutionListener, org.springframework.boot.test.autoconfigure.web.client.MockRestServiceServerResetTestExecutionListener, org.springframework.boot.test.autoconfigure.web.servlet.MockMvcPrintOnlyOnFailureTestExecutionListener, org.springframework.boot.test.autoconfigure.web.servlet.WebDriverTestExecutionListener, org.springframework.test.context.web.ServletTestExecutionListener, org.springframework.test.context.support.DirtiesContextBeforeModesTestExecutionListener, org.springframework.test.context.support.DependencyInjectionTestExecutionListener, org.springframework.test.context.support.DirtiesContextTestExecutionListener, org.springframework.test.context.transaction.TransactionalTestExecutionListener, org.springframework.test.context.jdbc.SqlScriptsTestExecutionListener]
13-Dec-2019 00:32:37 2019-12-13 00:32:37.420  INFO   --- [           main] .b.t.c.SpringBootTestContextBootstrapper : Using TestExecutionListeners: [org.springframework.test.context.web.ServletTestExecutionListener@70cf32e3, org.springframework.test.context.support.DirtiesContextBeforeModesTestExecutionListener@5a59ca5e, org.springframework.boot.test.autoconfigure.SpringBootDependencyInjectionTestExecutionListener@4bdeaabb, org.springframework.test.context.support.DirtiesContextTestExecutionListener@6c4906d3, org.springframework.test.context.transaction.TransactionalTestExecutionListener@65987993, org.springframework.test.context.jdbc.SqlScriptsTestExecutionListener@71075444, org.springframework.boot.test.mock.mockito.MockitoTestExecutionListener@4f32a3ad, org.springframework.boot.test.autoconfigure.web.servlet.MockMvcPrintOnlyOnFailureTestExecutionListener@6b695b06, org.springframework.boot.test.autoconfigure.web.client.MockRestServiceServerResetTestExecutionListener@4d1bf319, org.springframework.boot.test.mock.mockito.ResetMocksTestExecutionListener@6f53b8a, org.springframework.boot.test.autoconfigure.web.servlet.WebDriverTestExecutionListener@5c80cf32, org.springframework.boot.test.autoconfigure.restdocs.RestDocsTestExecutionListener@7d900ecf]
13-Dec-2019 00:32:37 Running org.springframework.cloud.dataflow.acceptance.test.AnalyticsTests
13-Dec-2019 00:32:37 2019-12-13 00:32:37.442  INFO   --- [           main] .b.t.c.SpringBootTestContextBootstrapper : Neither @ContextConfiguration nor @ContextHierarchy found for test class [org.springframework.cloud.dataflow.acceptance.test.AnalyticsTests], using SpringBootContextLoader
13-Dec-2019 00:32:37 2019-12-13 00:32:37.461  INFO   --- [           main] .b.t.c.SpringBootTestContextBootstrapper : Loaded default TestExecutionListener class names from location [META-INF/spring.factories]: [org.springframework.boot.test.mock.mockito.MockitoTestExecutionListener, org.springframework.boot.test.mock.mockito.ResetMocksTestExecutionListener, org.springframework.boot.test.autoconfigure.restdocs.RestDocsTestExecutionListener, org.springframework.boot.test.autoconfigure.web.client.MockRestServiceServerResetTestExecutionListener, org.springframework.boot.test.autoconfigure.web.servlet.MockMvcPrintOnlyOnFailureTestExecutionListener, org.springframework.boot.test.autoconfigure.web.servlet.WebDriverTestExecutionListener, org.springframework.test.context.web.ServletTestExecutionListener, org.springframework.test.context.support.DirtiesContextBeforeModesTestExecutionListener, org.springframework.test.context.support.DependencyInjectionTestExecutionListener, org.springframework.test.context.support.DirtiesContextTestExecutionListener, org.springframework.test.context.transaction.TransactionalTestExecutionListener, org.springframework.test.context.jdbc.SqlScriptsTestExecutionListener]
13-Dec-2019 00:32:37 2019-12-13 00:32:37.467  INFO   --- [           main] .b.t.c.SpringBootTestContextBootstrapper : Using TestExecutionListeners: [org.springframework.test.context.web.ServletTestExecutionListener@77659b30, org.springframework.test.context.support.DirtiesContextBeforeModesTestExecutionListener@456d6c1e, org.springframework.boot.test.autoconfigure.SpringBootDependencyInjectionTestExecutionListener@1e13529a, org.springframework.test.context.support.DirtiesContextTestExecutionListener@1ec9bd38, org.springframework.test.context.transaction.TransactionalTestExecutionListener@452e19ca, org.springframework.test.context.jdbc.SqlScriptsTestExecutionListener@6b0d80ed, org.springframework.boot.test.mock.mockito.MockitoTestExecutionListener@6f8e8894, org.springframework.boot.test.autoconfigure.web.servlet.MockMvcPrintOnlyOnFailureTestExecutionListener@3cfdd820, org.springframework.boot.test.autoconfigure.web.client.MockRestServiceServerResetTestExecutionListener@928763c, org.springframework.boot.test.mock.mockito.ResetMocksTestExecutionListener@e25951c, org.springframework.boot.test.autoconfigure.web.servlet.WebDriverTestExecutionListener@15f47664, org.springframework.boot.test.autoconfigure.restdocs.RestDocsTestExecutionListener@471a9022]
13-Dec-2019 00:32:38 2019-12-13 00:32:38.017  INFO 26290 --- [           main] s.c.a.AnnotationConfigApplicationContext : Refreshing org.springframework.context.annotation.AnnotationConfigApplicationContext@2fa7ae9: startup date [Fri Dec 13 00:32:38 UTC 2019]; root of context hierarchy
13-Dec-2019 00:32:38 2019-12-13 00:32:38.256  INFO 26290 --- [           main] trationDelegate$BeanPostProcessorChecker : Bean 'configurationPropertiesRebinderAutoConfiguration' of type [class org.springframework.cloud.autoconfigure.ConfigurationPropertiesRebinderAutoConfiguration$$EnhancerBySpringCGLIB$$219d8b3d] is not eligible for getting processed by all BeanPostProcessors (for example: not eligible for auto-proxying)
13-Dec-2019 00:32:38
13-Dec-2019 00:32:38   .   ____          _            __ _ _
13-Dec-2019 00:32:38 /\\ / ___'_ __ _ _(_)_ __  __ _ \ \ \ \
13-Dec-2019 00:32:38 ( ( )\___ | '_ | '_| | '_ \/ _` | \ \ \ \
13-Dec-2019 00:32:38 \\/  ___)| |_)| | | | | || (_| |  ) ) ) )
13-Dec-2019 00:32:38   '  |____| .__|_| |_|_| |_\__, | / / / /
13-Dec-2019 00:32:38 =========|_|==============|___/=/_/_/_/
13-Dec-2019 00:32:38 :: Spring Boot ::        (v1.4.1.RELEASE)
13-Dec-2019 00:32:38
13-Dec-2019 00:32:38 2019-12-13 00:32:38.570  INFO 26290 --- [           main] c.c.c.ConfigServicePropertySourceLocator : Fetching config from server at: http://localhost:8888
13-Dec-2019 00:32:38 2019-12-13 00:32:38.650  WARN 26290 --- [           main] c.c.c.ConfigServicePropertySourceLocator : Could not locate PropertySource: I/O error on GET request for "http://localhost:8888//blah": Connection refused (Connection refused); nested exception is java.net.ConnectException: Connection refused (Connection refused)
13-Dec-2019 00:32:38 2019-12-13 00:32:38.657  INFO 26290 --- [           main] o.s.c.d.acceptance.test.AnalyticsTests   : The following profiles are active: blah
13-Dec-2019 00:32:38 2019-12-13 00:32:38.851  INFO 26290 --- [           main] o.s.c.d.acceptance.test.AnalyticsTests   : Started AnalyticsTests in 1.318 seconds (JVM running for 2.013)
13-Dec-2019 00:32:39 2019-12-13 00:32:39.099  INFO 26290 --- [           main] junit.logTestName                        : Starting Test analyticsTest(org.springframework.cloud.dataflow.acceptance.test.AnalyticsTests)
13-Dec-2019 00:32:39 2019-12-13 00:32:39.104  INFO 26290 --- [           main] o.s.c.d.acceptance.test.AnalyticsTests   : Importing stream apps from uri resource: https://dataflow.spring.io/kafka-maven-latest
13-Dec-2019 00:32:41 2019-12-13 00:32:41.370  INFO 26290 --- [           main] junit.logTestName                        : Finished Test analyticsTest(org.springframework.cloud.dataflow.acceptance.test.AnalyticsTests)
13-Dec-2019 00:32:41 2019-12-13 00:32:41.371  INFO 26290 --- [           main] o.s.c.d.acceptance.test.AnalyticsTests   : Destroy all streams
13-Dec-2019 00:32:41 Tests run: 1, Failures: 0, Errors: 0, Skipped: 1, Time elapsed: 3.948 sec - in org.springframework.cloud.dataflow.acceptance.test.AnalyticsTests
13-Dec-2019 00:32:41 Running org.springframework.cloud.dataflow.acceptance.test.WoodChuckTests
13-Dec-2019 00:32:41 2019-12-13 00:32:41.396  INFO 26290 --- [           main] .b.t.c.SpringBootTestContextBootstrapper : Neither @ContextConfiguration nor @ContextHierarchy found for test class [org.springframework.cloud.dataflow.acceptance.test.WoodChuckTests], using SpringBootContextLoader
13-Dec-2019 00:32:41 2019-12-13 00:32:41.417  INFO 26290 --- [           main] .b.t.c.SpringBootTestContextBootstrapper : Loaded default TestExecutionListener class names from location [META-INF/spring.factories]: [org.springframework.boot.test.mock.mockito.MockitoTestExecutionListener, org.springframework.boot.test.mock.mockito.ResetMocksTestExecutionListener, org.springframework.boot.test.autoconfigure.restdocs.RestDocsTestExecutionListener, org.springframework.boot.test.autoconfigure.web.client.MockRestServiceServerResetTestExecutionListener, org.springframework.boot.test.autoconfigure.web.servlet.MockMvcPrintOnlyOnFailureTestExecutionListener, org.springframework.boot.test.autoconfigure.web.servlet.WebDriverTestExecutionListener, org.springframework.test.context.web.ServletTestExecutionListener, org.springframework.test.context.support.DirtiesContextBeforeModesTestExecutionListener, org.springframework.test.context.support.DependencyInjectionTestExecutionListener, org.springframework.test.context.support.DirtiesContextTestExecutionListener, org.springframework.test.context.transaction.TransactionalTestExecutionListener, org.springframework.test.context.jdbc.SqlScriptsTestExecutionListener]
13-Dec-2019 00:32:41 2019-12-13 00:32:41.419  INFO 26290 --- [           main] .b.t.c.SpringBootTestContextBootstrapper : Using TestExecutionListeners: [org.springframework.test.context.web.ServletTestExecutionListener@3968bc60, org.springframework.test.context.support.DirtiesContextBeforeModesTestExecutionListener@26f46fa6, org.springframework.boot.test.autoconfigure.SpringBootDependencyInjectionTestExecutionListener@227a47, org.springframework.test.context.support.DirtiesContextTestExecutionListener@9596ce8, org.springframework.test.context.transaction.TransactionalTestExecutionListener@75ae4a1f, org.springframework.test.context.jdbc.SqlScriptsTestExecutionListener@70228253, org.springframework.boot.test.mock.mockito.MockitoTestExecutionListener@63c12e52, org.springframework.boot.test.autoconfigure.web.servlet.MockMvcPrintOnlyOnFailureTestExecutionListener@21bd20ee, org.springframework.boot.test.autoconfigure.web.client.MockRestServiceServerResetTestExecutionListener@26c47874, org.springframework.boot.test.mock.mockito.ResetMocksTestExecutionListener@421056e5, org.springframework.boot.test.autoconfigure.web.servlet.WebDriverTestExecutionListener@2849434b, org.springframework.boot.test.autoconfigure.restdocs.RestDocsTestExecutionListener@60bbacfc]
13-Dec-2019 00:32:41 2019-12-13 00:32:41.537  INFO 26290 --- [           main] junit.logTestName                        : Starting Test testPartitioning(org.springframework.cloud.dataflow.acceptance.test.WoodChuckTests)
13-Dec-2019 00:32:41 2019-12-13 00:32:41.548  INFO 26290 --- [           main] o.s.c.d.acceptance.test.WoodChuckTests   : Creating stream 'WOODCHUCK-TEST'
13-Dec-2019 00:32:41 2019-12-13 00:32:41.702  INFO 26290 --- [           main] o.s.c.d.acceptance.test.WoodChuckTests   : Deploying stream 'WOODCHUCK-TEST' with properties: {app.*.spring.cloud.streamapp.security.enabled=false, app.log.logging.pattern.level=WOODCHUCK-${INSTANCE_INDEX:${CF_INSTANCE_INDEX:${spring.cloud.stream.instanceIndex:0}}} %5p, app.*.logging.file=${PID}-test.log, app.splitter.producer.partitionKeyExpression=payload, app.*.endpoints.logfile.sensitive=false, app.log.spring.cloud.stream.kafka.bindings.input.consumer.autoRebalanceEnabled=false, app.*.management.endpoints.web.exposure.include=*, deployer.log.count=2}
13-Dec-2019 00:32:48 2019-12-13 00:32:48.695  INFO 26290 --- [           main] o.s.c.d.acceptance.test.WoodChuckTests   : Checking: Stream=WOODCHUCK-TEST, status = deploying, status description = The stream is being deployed.
13-Dec-2019 00:32:48 2019-12-13 00:32:48.695  INFO 26290 --- [           main] o.s.c.d.acceptance.test.WoodChuckTests   : Sleeping to check status of Stream=WOODCHUCK-TEST
13-Dec-2019 00:32:58 2019-12-13 00:32:58.889  INFO 26290 --- [           main] o.s.c.d.acceptance.test.WoodChuckTests   : Checking: Stream=WOODCHUCK-TEST, status = deploying, status description = The stream is being deployed.
13-Dec-2019 00:32:58 2019-12-13 00:32:58.889  INFO 26290 --- [           main] o.s.c.d.acceptance.test.WoodChuckTests   : Sleeping to check status of Stream=WOODCHUCK-TEST
13-Dec-2019 00:33:09 2019-12-13 00:33:09.016  INFO 26290 --- [           main] o.s.c.d.acceptance.test.WoodChuckTests   : Checking: Stream=WOODCHUCK-TEST, status = deploying, status description = The stream is being deployed.
13-Dec-2019 00:33:09 2019-12-13 00:33:09.016  INFO 26290 --- [           main] o.s.c.d.acceptance.test.WoodChuckTests   : Sleeping to check status of Stream=WOODCHUCK-TEST
13-Dec-2019 00:33:19 2019-12-13 00:33:19.059  INFO 26290 --- [           main] o.s.c.d.acceptance.test.WoodChuckTests   : Checking: Stream=WOODCHUCK-TEST, status = deployed, status description = The stream has been successfully deployed
13-Dec-2019 00:33:19 2019-12-13 00:33:19.109  INFO 26290 --- [           main] o.s.c.d.acceptance.test.WoodChuckTests   : Sleeping to check status of Stream=WOODCHUCK-TEST
13-Dec-2019 00:33:29 2019-12-13 00:33:29.110  INFO 26290 --- [           main] o.s.c.d.acceptance.test.WoodChuckTests   : Stream 'WOODCHUCK-TEST' started with status: deployed
13-Dec-2019 00:33:29 2019-12-13 00:33:29.110  INFO 26290 --- [           main] o.s.c.d.acceptance.test.WoodChuckTests   : App 'log' has instances: {WOODCHUCK-TEST.log-v1-0=http://10.194.6.131:55812, WOODCHUCK-TEST.log-v1-1=http://10.194.6.131:44331}
13-Dec-2019 00:33:29 2019-12-13 00:33:29.110  INFO 26290 --- [           main] o.s.c.d.acceptance.test.WoodChuckTests   : App 'http' has instances: {WOODCHUCK-TEST.http-v1-0=http://10.194.6.131:23974}
13-Dec-2019 00:33:29 2019-12-13 00:33:29.110  INFO 26290 --- [           main] o.s.c.d.acceptance.test.WoodChuckTests   : App 'splitter' has instances: {WOODCHUCK-TEST.splitter-v1-0=http://10.194.6.131:48403}
13-Dec-2019 00:33:29 2019-12-13 00:33:29.111  INFO 26290 --- [           main] o.s.c.d.acceptance.test.WoodChuckTests   : Looking for 'Started HttpSource' in logfile for http
13-Dec-2019 00:33:39 2019-12-13 00:33:39.111  INFO 26290 --- [           main] o.s.c.d.acceptance.test.WoodChuckTests   : Requesting log for app WOODCHUCK-TEST.http-v1-0
13-Dec-2019 00:33:39 2019-12-13 00:33:39.391  INFO 26290 --- [           main] o.s.c.d.acceptance.test.WoodChuckTests   : Retrieved logfile from 'http://10.194.6.131:23974/actuator/logfile
13-Dec-2019 00:33:39 2019-12-13 00:33:39.399  INFO 26290 --- [           main] o.s.c.d.acceptance.test.WoodChuckTests   : Matched all 'Started HttpSource' in logfile for app http (source WOODCHUCK-TEST.http-v1-0)
13-Dec-2019 00:33:39 2019-12-13 00:33:39.399  INFO 26290 --- [           main] o.s.c.d.acceptance.test.WoodChuckTests   : Looking for 'Started SplitterProcessor' in logfile for splitter
13-Dec-2019 00:33:49 2019-12-13 00:33:49.400  INFO 26290 --- [           main] o.s.c.d.acceptance.test.WoodChuckTests   : Requesting log for app WOODCHUCK-TEST.splitter-v1-0
13-Dec-2019 00:33:49 2019-12-13 00:33:49.538  INFO 26290 --- [           main] o.s.c.d.acceptance.test.WoodChuckTests   : Retrieved logfile from 'http://10.194.6.131:48403/actuator/logfile
13-Dec-2019 00:33:49 2019-12-13 00:33:49.538  INFO 26290 --- [           main] o.s.c.d.acceptance.test.WoodChuckTests   : Matched all 'Started SplitterProcessor' in logfile for app splitter (source WOODCHUCK-TEST.splitter-v1-0)
13-Dec-2019 00:33:49 2019-12-13 00:33:49.538  INFO 26290 --- [           main] o.s.c.d.acceptance.test.WoodChuckTests   : Looking for 'Started LogSink' in logfile for log
13-Dec-2019 00:33:59 2019-12-13 00:33:59.538  INFO 26290 --- [           main] o.s.c.d.acceptance.test.WoodChuckTests   : Requesting log for app WOODCHUCK-TEST.log-v1-0
13-Dec-2019 00:33:59 2019-12-13 00:33:59.674  INFO 26290 --- [           main] o.s.c.d.acceptance.test.WoodChuckTests   : Retrieved logfile from 'http://10.194.6.131:55812/actuator/logfile
13-Dec-2019 00:33:59 2019-12-13 00:33:59.674  INFO 26290 --- [           main] o.s.c.d.acceptance.test.WoodChuckTests   : Requesting log for app WOODCHUCK-TEST.log-v1-1
13-Dec-2019 00:34:00 2019-12-13 00:34:00.008  INFO 26290 --- [           main] o.s.c.d.acceptance.test.WoodChuckTests   : Retrieved logfile from 'http://10.194.6.131:44331/actuator/logfile
13-Dec-2019 00:34:00 2019-12-13 00:34:00.008  INFO 26290 --- [           main] o.s.c.d.acceptance.test.WoodChuckTests   : Matched all 'Started LogSink' in logfile for app log (source WOODCHUCK-TEST.log-v1-0)
13-Dec-2019 00:34:00 2019-12-13 00:34:00.270  INFO 26290 --- [           main] o.s.c.d.acceptance.test.WoodChuckTests   : Looking for 'WOODCHUCK-0,How,chuck' in logfile for log
13-Dec-2019 00:34:10 2019-12-13 00:34:10.271  INFO 26290 --- [           main] o.s.c.d.acceptance.test.WoodChuckTests   : Requesting log for app WOODCHUCK-TEST.log-v1-0
13-Dec-2019 00:34:10 2019-12-13 00:34:10.278  INFO 26290 --- [           main] o.s.c.d.acceptance.test.WoodChuckTests   : Retrieved logfile from 'http://10.194.6.131:55812/actuator/logfile
13-Dec-2019 00:34:10 2019-12-13 00:34:10.278  INFO 26290 --- [           main] o.s.c.d.acceptance.test.WoodChuckTests   : Requesting log for app WOODCHUCK-TEST.log-v1-1
13-Dec-2019 00:34:10 2019-12-13 00:34:10.287  INFO 26290 --- [           main] o.s.c.d.acceptance.test.WoodChuckTests   : Retrieved logfile from 'http://10.194.6.131:44331/actuator/logfile
13-Dec-2019 00:34:10 2019-12-13 00:34:10.287  INFO 26290 --- [           main] o.s.c.d.acceptance.test.WoodChuckTests   : Matched all 'WOODCHUCK-0,How,chuck' in logfile for app log (source WOODCHUCK-TEST.log-v1-0)
13-Dec-2019 00:34:10 2019-12-13 00:34:10.287  INFO 26290 --- [           main] o.s.c.d.acceptance.test.WoodChuckTests   : Looking for 'WOODCHUCK-1,much,wood,would,if,a,woodchuck,could' in logfile for log
13-Dec-2019 00:34:20 2019-12-13 00:34:20.287  INFO 26290 --- [           main] o.s.c.d.acceptance.test.WoodChuckTests   : Requesting log for app WOODCHUCK-TEST.log-v1-0
13-Dec-2019 00:34:20 2019-12-13 00:34:20.296  INFO 26290 --- [           main] o.s.c.d.acceptance.test.WoodChuckTests   : Retrieved logfile from 'http://10.194.6.131:55812/actuator/logfile
13-Dec-2019 00:34:20 2019-12-13 00:34:20.297  INFO 26290 --- [           main] o.s.c.d.acceptance.test.WoodChuckTests   : Requesting log for app WOODCHUCK-TEST.log-v1-1
13-Dec-2019 00:34:20 2019-12-13 00:34:20.305  INFO 26290 --- [           main] o.s.c.d.acceptance.test.WoodChuckTests   : Retrieved logfile from 'http://10.194.6.131:44331/actuator/logfile
13-Dec-2019 00:34:20 2019-12-13 00:34:20.306  INFO 26290 --- [           main] o.s.c.d.acceptance.test.WoodChuckTests   : Matched all 'WOODCHUCK-1,much,wood,would,if,a,woodchuck,could' in logfile for app log (source WOODCHUCK-TEST.log-v1-1)
13-Dec-2019 00:34:20 2019-12-13 00:34:20.310  INFO 26290 --- [           main] junit.logTestName                        : Test testPartitioning(org.springframework.cloud.dataflow.acceptance.test.WoodChuckTests) Succeeded
13-Dec-2019 00:34:20 2019-12-13 00:34:20.310  INFO 26290 --- [           main] junit.logTestName                        : Finished Test testPartitioning(org.springframework.cloud.dataflow.acceptance.test.WoodChuckTests)
13-Dec-2019 00:34:20 2019-12-13 00:34:20.310  INFO 26290 --- [           main] o.s.c.d.acceptance.test.WoodChuckTests   : Destroy all streams
13-Dec-2019 00:34:20 Tests run: 1, Failures: 0, Errors: 0, Skipped: 0, Time elapsed: 99.212 sec - in org.springframework.cloud.dataflow.acceptance.test.WoodChuckTests
13-Dec-2019 00:34:20 Running org.springframework.cloud.dataflow.acceptance.test.HttpSourceTests
13-Dec-2019 00:34:20 2019-12-13 00:34:20.669  INFO 26290 --- [           main] .b.t.c.SpringBootTestContextBootstrapper : Neither @ContextConfiguration nor @ContextHierarchy found for test class [org.springframework.cloud.dataflow.acceptance.test.HttpSourceTests], using SpringBootContextLoader
13-Dec-2019 00:34:20 2019-12-13 00:34:20.676  INFO 26290 --- [           main] .b.t.c.SpringBootTestContextBootstrapper : Loaded default TestExecutionListener class names from location [META-INF/spring.factories]: [org.springframework.boot.test.mock.mockito.MockitoTestExecutionListener, org.springframework.boot.test.mock.mockito.ResetMocksTestExecutionListener, org.springframework.boot.test.autoconfigure.restdocs.RestDocsTestExecutionListener, org.springframework.boot.test.autoconfigure.web.client.MockRestServiceServerResetTestExecutionListener, org.springframework.boot.test.autoconfigure.web.servlet.MockMvcPrintOnlyOnFailureTestExecutionListener, org.springframework.boot.test.autoconfigure.web.servlet.WebDriverTestExecutionListener, org.springframework.test.context.web.ServletTestExecutionListener, org.springframework.test.context.support.DirtiesContextBeforeModesTestExecutionListener, org.springframework.test.context.support.DependencyInjectionTestExecutionListener, org.springframework.test.context.support.DirtiesContextTestExecutionListener, org.springframework.test.context.transaction.TransactionalTestExecutionListener, org.springframework.test.context.jdbc.SqlScriptsTestExecutionListener]
13-Dec-2019 00:34:20 2019-12-13 00:34:20.696  INFO 26290 --- [           main] .b.t.c.SpringBootTestContextBootstrapper : Using TestExecutionListeners: [org.springframework.test.context.web.ServletTestExecutionListener@423b2b62, org.springframework.test.context.support.DirtiesContextBeforeModesTestExecutionListener@2b7962a2, org.springframework.boot.test.autoconfigure.SpringBootDependencyInjectionTestExecutionListener@6ad16c5d, org.springframework.test.context.support.DirtiesContextTestExecutionListener@74ea46e2, org.springframework.test.context.transaction.TransactionalTestExecutionListener@6f911326, org.springframework.test.context.jdbc.SqlScriptsTestExecutionListener@f1d0004, org.springframework.boot.test.mock.mockito.MockitoTestExecutionListener@6e4f263e, org.springframework.boot.test.autoconfigure.web.servlet.MockMvcPrintOnlyOnFailureTestExecutionListener@48b4a043, org.springframework.boot.test.autoconfigure.web.client.MockRestServiceServerResetTestExecutionListener@2f5b8250, org.springframework.boot.test.mock.mockito.ResetMocksTestExecutionListener@4821aa9f, org.springframework.boot.test.autoconfigure.web.servlet.WebDriverTestExecutionListener@5f481b73, org.springframework.boot.test.autoconfigure.restdocs.RestDocsTestExecutionListener@32130e61]
13-Dec-2019 00:34:20 2019-12-13 00:34:20.817  INFO 26290 --- [           main] junit.logTestName                        : Starting Test httpSourceTests(org.springframework.cloud.dataflow.acceptance.test.HttpSourceTests)
13-Dec-2019 00:34:20 2019-12-13 00:34:20.823  INFO 26290 --- [           main] o.s.c.d.acceptance.test.HttpSourceTests  : Creating stream 'HTTP-TEST'
13-Dec-2019 00:34:20 2019-12-13 00:34:20.865  INFO 26290 --- [           main] o.s.c.d.acceptance.test.HttpSourceTests  : Deploying stream 'HTTP-TEST' with properties: {app.*.spring.cloud.streamapp.security.enabled=false, app.*.logging.file=${PID}-test.log, app.*.endpoints.logfile.sensitive=false, app.*.management.endpoints.web.exposure.include=*}
13-Dec-2019 00:34:21 2019-12-13 00:34:21.550  INFO 26290 --- [           main] o.s.c.d.acceptance.test.HttpSourceTests  : Checking: Stream=HTTP-TEST, status = deploying, status description = The stream is being deployed.
13-Dec-2019 00:34:21 2019-12-13 00:34:21.550  INFO 26290 --- [           main] o.s.c.d.acceptance.test.HttpSourceTests  : Sleeping to check status of Stream=HTTP-TEST
13-Dec-2019 00:34:31 2019-12-13 00:34:31.616  INFO 26290 --- [           main] o.s.c.d.acceptance.test.HttpSourceTests  : Checking: Stream=HTTP-TEST, status = deploying, status description = The stream is being deployed.
13-Dec-2019 00:34:31 2019-12-13 00:34:31.616  INFO 26290 --- [           main] o.s.c.d.acceptance.test.HttpSourceTests  : Sleeping to check status of Stream=HTTP-TEST
13-Dec-2019 00:34:41 2019-12-13 00:34:41.649  INFO 26290 --- [           main] o.s.c.d.acceptance.test.HttpSourceTests  : Checking: Stream=HTTP-TEST, status = deployed, status description = The stream has been successfully deployed
13-Dec-2019 00:34:41 2019-12-13 00:34:41.684  INFO 26290 --- [           main] o.s.c.d.acceptance.test.HttpSourceTests  : Sleeping to check status of Stream=HTTP-TEST
13-Dec-2019 00:34:51 2019-12-13 00:34:51.685  INFO 26290 --- [           main] o.s.c.d.acceptance.test.HttpSourceTests  : Stream 'HTTP-TEST' started with status: deployed
13-Dec-2019 00:34:51 2019-12-13 00:34:51.685  INFO 26290 --- [           main] o.s.c.d.acceptance.test.HttpSourceTests  : App 'log' has instances: {HTTP-TEST.log-v1-0=http://10.194.6.131:47194}
13-Dec-2019 00:34:51 2019-12-13 00:34:51.686  INFO 26290 --- [           main] o.s.c.d.acceptance.test.HttpSourceTests  : App 'http' has instances: {HTTP-TEST.http-v1-0=http://10.194.6.131:42017}
13-Dec-2019 00:34:51 2019-12-13 00:34:51.691  INFO 26290 --- [           main] o.s.c.d.acceptance.test.HttpSourceTests  : Looking for 'Started HttpSource' in logfile for http
13-Dec-2019 00:35:01 2019-12-13 00:35:01.692  INFO 26290 --- [           main] o.s.c.d.acceptance.test.HttpSourceTests  : Requesting log for app HTTP-TEST.http-v1-0
13-Dec-2019 00:35:01 2019-12-13 00:35:01.951  INFO 26290 --- [           main] o.s.c.d.acceptance.test.HttpSourceTests  : Retrieved logfile from 'http://10.194.6.131:42017/actuator/logfile
13-Dec-2019 00:35:01 2019-12-13 00:35:01.952  INFO 26290 --- [           main] o.s.c.d.acceptance.test.HttpSourceTests  : Matched all 'Started HttpSource' in logfile for app http (source HTTP-TEST.http-v1-0)
13-Dec-2019 00:35:01 2019-12-13 00:35:01.953  INFO 26290 --- [           main] o.s.c.d.acceptance.test.HttpSourceTests  : Looking for 'Started LogSink' in logfile for log
13-Dec-2019 00:35:11 2019-12-13 00:35:11.954  INFO 26290 --- [           main] o.s.c.d.acceptance.test.HttpSourceTests  : Requesting log for app HTTP-TEST.log-v1-0
13-Dec-2019 00:35:12 2019-12-13 00:35:12.074  INFO 26290 --- [           main] o.s.c.d.acceptance.test.HttpSourceTests  : Retrieved logfile from 'http://10.194.6.131:47194/actuator/logfile
13-Dec-2019 00:35:12 2019-12-13 00:35:12.074  INFO 26290 --- [           main] o.s.c.d.acceptance.test.HttpSourceTests  : Matched all 'Started LogSink' in logfile for app log (source HTTP-TEST.log-v1-0)
13-Dec-2019 00:35:12 2019-12-13 00:35:12.268  INFO 26290 --- [           main] o.s.c.d.acceptance.test.HttpSourceTests  : Looking for '3cf8884f-259c-46c0-9e18-46bc056f30aa' in logfile for log
13-Dec-2019 00:35:22 2019-12-13 00:35:22.269  INFO 26290 --- [           main] o.s.c.d.acceptance.test.HttpSourceTests  : Requesting log for app HTTP-TEST.log-v1-0
13-Dec-2019 00:35:22 2019-12-13 00:35:22.277  INFO 26290 --- [           main] o.s.c.d.acceptance.test.HttpSourceTests  : Retrieved logfile from 'http://10.194.6.131:47194/actuator/logfile
13-Dec-2019 00:35:22 2019-12-13 00:35:22.278  INFO 26290 --- [           main] o.s.c.d.acceptance.test.HttpSourceTests  : Matched all '3cf8884f-259c-46c0-9e18-46bc056f30aa' in logfile for app log (source HTTP-TEST.log-v1-0)
13-Dec-2019 00:35:22 2019-12-13 00:35:22.279  INFO 26290 --- [           main] junit.logTestName                        : Test httpSourceTests(org.springframework.cloud.dataflow.acceptance.test.HttpSourceTests) Succeeded
13-Dec-2019 00:35:22 2019-12-13 00:35:22.279  INFO 26290 --- [           main] junit.logTestName                        : Finished Test httpSourceTests(org.springframework.cloud.dataflow.acceptance.test.HttpSourceTests)
13-Dec-2019 00:35:22 2019-12-13 00:35:22.279  INFO 26290 --- [           main] o.s.c.d.acceptance.test.HttpSourceTests  : Destroy all streams
13-Dec-2019 00:35:22 Tests run: 1, Failures: 0, Errors: 0, Skipped: 0, Time elapsed: 61.851 sec - in org.springframework.cloud.dataflow.acceptance.test.HttpSourceTests
13-Dec-2019 00:35:22 Running org.springframework.cloud.dataflow.acceptance.test.TimestampTaskTests
13-Dec-2019 00:35:22 2019-12-13 00:35:22.532  INFO 26290 --- [           main] o.s.c.support.GenericApplicationContext  : Refreshing org.springframework.context.support.GenericApplicationContext@1645f294: startup date [Fri Dec 13 00:35:22 UTC 2019]; root of context hierarchy
13-Dec-2019 00:35:22 2019-12-13 00:35:22.664  INFO 26290 --- [           main] junit.logTestName                        : Starting Test timeStampTests(org.springframework.cloud.dataflow.acceptance.test.TimestampTaskTests)
13-Dec-2019 00:35:22 2019-12-13 00:35:22.665  INFO 26290 --- [           main] o.s.c.d.a.test.AbstractTaskTests         : Importing task apps from uri resource: https://dataflow.spring.io/task-maven-latest
13-Dec-2019 00:35:23 2019-12-13 00:35:23.265  INFO 26290 --- [           main] o.s.c.d.a.test.AbstractTaskTests         : Done importing task apps.
13-Dec-2019 00:35:33 2019-12-13 00:35:33.642  INFO 26290 --- [           main] junit.logTestName                        : Test timeStampTests(org.springframework.cloud.dataflow.acceptance.test.TimestampTaskTests) Succeeded
13-Dec-2019 00:35:33 2019-12-13 00:35:33.643  INFO 26290 --- [           main] junit.logTestName                        : Finished Test timeStampTests(org.springframework.cloud.dataflow.acceptance.test.TimestampTaskTests)
13-Dec-2019 00:35:33 2019-12-13 00:35:33.713  INFO 26290 --- [           main] junit.logTestName                        : Starting Test timeStampTestsMultipleLaunch(org.springframework.cloud.dataflow.acceptance.test.TimestampTaskTests)
13-Dec-2019 00:35:54 2019-12-13 00:35:54.178  INFO 26290 --- [           main] junit.logTestName                        : Test timeStampTestsMultipleLaunch(org.springframework.cloud.dataflow.acceptance.test.TimestampTaskTests) Succeeded
13-Dec-2019 00:35:54 2019-12-13 00:35:54.178  INFO 26290 --- [           main] junit.logTestName                        : Finished Test timeStampTestsMultipleLaunch(org.springframework.cloud.dataflow.acceptance.test.TimestampTaskTests)
13-Dec-2019 00:35:54 Tests run: 2, Failures: 0, Errors: 0, Skipped: 0, Time elapsed: 31.656 sec - in org.springframework.cloud.dataflow.acceptance.test.TimestampTaskTests
13-Dec-2019 00:35:54 Running org.springframework.cloud.dataflow.acceptance.test.TickTockTests
13-Dec-2019 00:35:54 2019-12-13 00:35:54.179  INFO 26290 --- [           main] .b.t.c.SpringBootTestContextBootstrapper : Neither @ContextConfiguration nor @ContextHierarchy found for test class [org.springframework.cloud.dataflow.acceptance.test.TickTockTests], using SpringBootContextLoader
13-Dec-2019 00:35:54 2019-12-13 00:35:54.187  INFO 26290 --- [           main] .b.t.c.SpringBootTestContextBootstrapper : Loaded default TestExecutionListener class names from location [META-INF/spring.factories]: [org.springframework.boot.test.mock.mockito.MockitoTestExecutionListener, org.springframework.boot.test.mock.mockito.ResetMocksTestExecutionListener, org.springframework.boot.test.autoconfigure.restdocs.RestDocsTestExecutionListener, org.springframework.boot.test.autoconfigure.web.client.MockRestServiceServerResetTestExecutionListener, org.springframework.boot.test.autoconfigure.web.servlet.MockMvcPrintOnlyOnFailureTestExecutionListener, org.springframework.boot.test.autoconfigure.web.servlet.WebDriverTestExecutionListener, org.springframework.test.context.web.ServletTestExecutionListener, org.springframework.test.context.support.DirtiesContextBeforeModesTestExecutionListener, org.springframework.test.context.support.DependencyInjectionTestExecutionListener, org.springframework.test.context.support.DirtiesContextTestExecutionListener, org.springframework.test.context.transaction.TransactionalTestExecutionListener, org.springframework.test.context.jdbc.SqlScriptsTestExecutionListener]
13-Dec-2019 00:35:54 2019-12-13 00:35:54.191  INFO 26290 --- [           main] .b.t.c.SpringBootTestContextBootstrapper : Using TestExecutionListeners: [org.springframework.test.context.web.ServletTestExecutionListener@806996, org.springframework.test.context.support.DirtiesContextBeforeModesTestExecutionListener@78b612c6, org.springframework.boot.test.autoconfigure.SpringBootDependencyInjectionTestExecutionListener@257e0827, org.springframework.test.context.support.DirtiesContextTestExecutionListener@22752544, org.springframework.test.context.transaction.TransactionalTestExecutionListener@21ba2445, org.springframework.test.context.jdbc.SqlScriptsTestExecutionListener@69d23296, org.springframework.boot.test.mock.mockito.MockitoTestExecutionListener@3c3820bb, org.springframework.boot.test.autoconfigure.web.servlet.MockMvcPrintOnlyOnFailureTestExecutionListener@376c7d7d, org.springframework.boot.test.autoconfigure.web.client.MockRestServiceServerResetTestExecutionListener@4784efd9, org.springframework.boot.test.mock.mockito.ResetMocksTestExecutionListener@3fba233d, org.springframework.boot.test.autoconfigure.web.servlet.WebDriverTestExecutionListener@427ae189, org.springframework.boot.test.autoconfigure.restdocs.RestDocsTestExecutionListener@16a9eb2e]
13-Dec-2019 00:35:54 2019-12-13 00:35:54.286  INFO 26290 --- [           main] junit.logTestName                        : Starting Test tickTockUpdateRollbackTests(org.springframework.cloud.dataflow.acceptance.test.TickTockTests)
13-Dec-2019 00:35:54 2019-12-13 00:35:54.315  INFO 26290 --- [           main] o.s.c.d.acceptance.test.TickTockTests    : Creating stream 'TICKTOCK'
13-Dec-2019 00:35:54 2019-12-13 00:35:54.344  INFO 26290 --- [           main] o.s.c.d.acceptance.test.TickTockTests    : Deploying stream 'TICKTOCK' with properties: {app.*.spring.cloud.streamapp.security.enabled=false, app.*.logging.file=${PID}-test.log, app.*.endpoints.logfile.sensitive=false, app.log.log.expression='TICKTOCK - TIMESTAMP: '.concat(payload), app.*.management.endpoints.web.exposure.include=*}
13-Dec-2019 00:35:54 2019-12-13 00:35:54.870  INFO 26290 --- [           main] o.s.c.d.acceptance.test.TickTockTests    : Checking: Stream=TICKTOCK, status = deploying, status description = The stream is being deployed.
13-Dec-2019 00:35:54 2019-12-13 00:35:54.870  INFO 26290 --- [           main] o.s.c.d.acceptance.test.TickTockTests    : Sleeping to check status of Stream=TICKTOCK
13-Dec-2019 00:36:04 2019-12-13 00:36:04.918  INFO 26290 --- [           main] o.s.c.d.acceptance.test.TickTockTests    : Checking: Stream=TICKTOCK, status = deploying, status description = The stream is being deployed.
13-Dec-2019 00:36:04 2019-12-13 00:36:04.918  INFO 26290 --- [           main] o.s.c.d.acceptance.test.TickTockTests    : Sleeping to check status of Stream=TICKTOCK
13-Dec-2019 00:36:14 2019-12-13 00:36:14.946  INFO 26290 --- [           main] o.s.c.d.acceptance.test.TickTockTests    : Checking: Stream=TICKTOCK, status = deployed, status description = The stream has been successfully deployed
13-Dec-2019 00:36:14 2019-12-13 00:36:14.977  INFO 26290 --- [           main] o.s.c.d.acceptance.test.TickTockTests    : Sleeping to check status of Stream=TICKTOCK
13-Dec-2019 00:36:24 2019-12-13 00:36:24.978  INFO 26290 --- [           main] o.s.c.d.acceptance.test.TickTockTests    : Stream 'TICKTOCK' started with status: deployed
13-Dec-2019 00:36:24 2019-12-13 00:36:24.978  INFO 26290 --- [           main] o.s.c.d.acceptance.test.TickTockTests    : App 'log' has instances: {TICKTOCK.log-v1-0=http://10.194.6.131:30774}
13-Dec-2019 00:36:24 2019-12-13 00:36:24.978  INFO 26290 --- [           main] o.s.c.d.acceptance.test.TickTockTests    : App 'time' has instances: {TICKTOCK.time-v1-0=http://10.194.6.131:55379}
13-Dec-2019 00:36:24 2019-12-13 00:36:24.978  INFO 26290 --- [           main] o.s.c.d.acceptance.test.TickTockTests    : Looking for 'Started TimeSource' in logfile for time
13-Dec-2019 00:36:34 2019-12-13 00:36:34.978  INFO 26290 --- [           main] o.s.c.d.acceptance.test.TickTockTests    : Requesting log for app TICKTOCK.time-v1-0
13-Dec-2019 00:36:35 2019-12-13 00:36:35.248  INFO 26290 --- [           main] o.s.c.d.acceptance.test.TickTockTests    : Retrieved logfile from 'http://10.194.6.131:55379/actuator/logfile
13-Dec-2019 00:36:35 2019-12-13 00:36:35.248  INFO 26290 --- [           main] o.s.c.d.acceptance.test.TickTockTests    : Matched all 'Started TimeSource' in logfile for app time (source TICKTOCK.time-v1-0)
13-Dec-2019 00:36:35 2019-12-13 00:36:35.248  INFO 26290 --- [           main] o.s.c.d.acceptance.test.TickTockTests    : Looking for 'Started LogSink' in logfile for log
13-Dec-2019 00:36:45 2019-12-13 00:36:45.248  INFO 26290 --- [           main] o.s.c.d.acceptance.test.TickTockTests    : Requesting log for app TICKTOCK.log-v1-0
13-Dec-2019 00:36:45 2019-12-13 00:36:45.371  INFO 26290 --- [           main] o.s.c.d.acceptance.test.TickTockTests    : Retrieved logfile from 'http://10.194.6.131:30774/actuator/logfile
13-Dec-2019 00:36:45 2019-12-13 00:36:45.371  INFO 26290 --- [           main] o.s.c.d.acceptance.test.TickTockTests    : Matched all 'Started LogSink' in logfile for app log (source TICKTOCK.log-v1-0)
13-Dec-2019 00:36:45 2019-12-13 00:36:45.371  INFO 26290 --- [           main] o.s.c.d.acceptance.test.TickTockTests    : Looking for 'TICKTOCK - TIMESTAMP:' in logfile for log
13-Dec-2019 00:36:55 2019-12-13 00:36:55.371  INFO 26290 --- [           main] o.s.c.d.acceptance.test.TickTockTests    : Requesting log for app TICKTOCK.log-v1-0
13-Dec-2019 00:36:55 2019-12-13 00:36:55.379  INFO 26290 --- [           main] o.s.c.d.acceptance.test.TickTockTests    : Retrieved logfile from 'http://10.194.6.131:30774/actuator/logfile
13-Dec-2019 00:36:55 2019-12-13 00:36:55.379  INFO 26290 --- [           main] o.s.c.d.acceptance.test.TickTockTests    : Matched all 'TICKTOCK - TIMESTAMP:' in logfile for app log (source TICKTOCK.log-v1-0)
13-Dec-2019 00:36:55 2019-12-13 00:36:55.380  INFO 26290 --- [           main] o.s.c.d.acceptance.test.TickTockTests    : Updating stream 'TICKTOCK'
13-Dec-2019 00:36:55 2019-12-13 00:36:55.889  INFO 26290 --- [           main] o.s.c.d.acceptance.test.TickTockTests    : Checking: Stream=TICKTOCK, status = deploying, status description = The stream is being deployed.
13-Dec-2019 00:36:55 2019-12-13 00:36:55.889  INFO 26290 --- [           main] o.s.c.d.acceptance.test.TickTockTests    : Sleeping to check status of Stream=TICKTOCK
13-Dec-2019 00:37:05 2019-12-13 00:37:05.916  INFO 26290 --- [           main] o.s.c.d.acceptance.test.TickTockTests    : Checking: Stream=TICKTOCK, status = deployed, status description = The stream has been successfully deployed
13-Dec-2019 00:37:05 2019-12-13 00:37:05.940  INFO 26290 --- [           main] o.s.c.d.acceptance.test.TickTockTests    : Sleeping to check status of Stream=TICKTOCK
13-Dec-2019 00:37:15 2019-12-13 00:37:15.940  INFO 26290 --- [           main] o.s.c.d.acceptance.test.TickTockTests    : Stream 'TICKTOCK' started with status: deployed
13-Dec-2019 00:37:15 2019-12-13 00:37:15.940  INFO 26290 --- [           main] o.s.c.d.acceptance.test.TickTockTests    : App 'log' has instances: {TICKTOCK.log-v1-0=http://10.194.6.131:30774, TICKTOCK.log-v2-0=http://10.194.6.131:41029}
13-Dec-2019 00:37:15 2019-12-13 00:37:15.940  INFO 26290 --- [           main] o.s.c.d.acceptance.test.TickTockTests    : App 'time' has instances: {TICKTOCK.time-v1-0=http://10.194.6.131:55379}
13-Dec-2019 00:37:15 2019-12-13 00:37:15.941  INFO 26290 --- [           main] o.s.c.d.acceptance.test.TickTockTests    : Looking for 'Started LogSink' in logfile for log
13-Dec-2019 00:37:25 2019-12-13 00:37:25.941  INFO 26290 --- [           main] o.s.c.d.acceptance.test.TickTockTests    : Requesting log for app TICKTOCK.log-v1-0
13-Dec-2019 00:37:25 2019-12-13 00:37:25.943  WARN 26290 --- [           main] o.s.c.d.acceptance.test.TickTockTests    : Error while trying to access logfile from 'http://10.194.6.131:30774/logfile' due to : org.springframework.web.client.ResourceAccessException: I/O error on GET request for "http://10.194.6.131:30774/logfile": Connection refused (Connection refused); nested exception is java.net.ConnectException: Connection refused (Connection refused)
13-Dec-2019 00:37:25 2019-12-13 00:37:25.943  INFO 26290 --- [           main] o.s.c.d.acceptance.test.TickTockTests    : Requesting log for app TICKTOCK.log-v2-0
13-Dec-2019 00:37:26 2019-12-13 00:37:26.091  INFO 26290 --- [           main] o.s.c.d.acceptance.test.TickTockTests    : Retrieved logfile from 'http://10.194.6.131:41029/actuator/logfile
13-Dec-2019 00:37:26 2019-12-13 00:37:26.091  INFO 26290 --- [           main] o.s.c.d.acceptance.test.TickTockTests    : Matched all 'Started LogSink' in logfile for app log (source TICKTOCK.log-v2-0)
13-Dec-2019 00:37:26 2019-12-13 00:37:26.091  INFO 26290 --- [           main] o.s.c.d.acceptance.test.TickTockTests    : Looking for 'TICKTOCK Updated - TIMESTAMP:' in logfile for log
13-Dec-2019 00:37:36 2019-12-13 00:37:36.091  INFO 26290 --- [           main] o.s.c.d.acceptance.test.TickTockTests    : Requesting log for app TICKTOCK.log-v1-0
13-Dec-2019 00:37:36 2019-12-13 00:37:36.092  WARN 26290 --- [           main] o.s.c.d.acceptance.test.TickTockTests    : Error while trying to access logfile from 'http://10.194.6.131:30774/logfile' due to : org.springframework.web.client.ResourceAccessException: I/O error on GET request for "http://10.194.6.131:30774/logfile": Connection refused (Connection refused); nested exception is java.net.ConnectException: Connection refused (Connection refused)
13-Dec-2019 00:37:36 2019-12-13 00:37:36.092  INFO 26290 --- [           main] o.s.c.d.acceptance.test.TickTockTests    : Requesting log for app TICKTOCK.log-v2-0
13-Dec-2019 00:37:36 2019-12-13 00:37:36.099  INFO 26290 --- [           main] o.s.c.d.acceptance.test.TickTockTests    : Retrieved logfile from 'http://10.194.6.131:41029/actuator/logfile
13-Dec-2019 00:37:36 2019-12-13 00:37:36.099  INFO 26290 --- [           main] o.s.c.d.acceptance.test.TickTockTests    : Matched all 'TICKTOCK Updated - TIMESTAMP:' in logfile for app log (source TICKTOCK.log-v2-0)
13-Dec-2019 00:37:36 2019-12-13 00:37:36.099  INFO 26290 --- [           main] o.s.c.d.acceptance.test.TickTockTests    : Rolling back the stream 'TICKTOCK' to the version 0
13-Dec-2019 00:37:36 2019-12-13 00:37:36.478  INFO 26290 --- [           main] o.s.c.d.acceptance.test.TickTockTests    : Checking: Stream=TICKTOCK, status = deploying, status description = The stream is being deployed.
13-Dec-2019 00:37:36 2019-12-13 00:37:36.479  INFO 26290 --- [           main] o.s.c.d.acceptance.test.TickTockTests    : Sleeping to check status of Stream=TICKTOCK
13-Dec-2019 00:37:46 2019-12-13 00:37:46.509  INFO 26290 --- [           main] o.s.c.d.acceptance.test.TickTockTests    : Checking: Stream=TICKTOCK, status = deployed, status description = The stream has been successfully deployed
13-Dec-2019 00:37:46 2019-12-13 00:37:46.530  INFO 26290 --- [           main] o.s.c.d.acceptance.test.TickTockTests    : Sleeping to check status of Stream=TICKTOCK
13-Dec-2019 00:37:56 2019-12-13 00:37:56.530  INFO 26290 --- [           main] o.s.c.d.acceptance.test.TickTockTests    : Stream 'TICKTOCK' started with status: deployed
13-Dec-2019 00:37:56 2019-12-13 00:37:56.531  INFO 26290 --- [           main] o.s.c.d.acceptance.test.TickTockTests    : App 'log' has instances: {TICKTOCK.log-v1-0=http://10.194.6.131:30774, TICKTOCK.log-v3-0=http://10.194.6.131:44424, TICKTOCK.log-v2-0=http://10.194.6.131:41029}
13-Dec-2019 00:37:56 2019-12-13 00:37:56.531  INFO 26290 --- [           main] o.s.c.d.acceptance.test.TickTockTests    : App 'time' has instances: {TICKTOCK.time-v1-0=http://10.194.6.131:55379}
13-Dec-2019 00:37:56 2019-12-13 00:37:56.531  INFO 26290 --- [           main] o.s.c.d.acceptance.test.TickTockTests    : Looking for 'TICKTOCK - TIMESTAMP:' in logfile for log
13-Dec-2019 00:38:06 2019-12-13 00:38:06.531  INFO 26290 --- [           main] o.s.c.d.acceptance.test.TickTockTests    : Requesting log for app TICKTOCK.log-v1-0
13-Dec-2019 00:38:06 2019-12-13 00:38:06.532  WARN 26290 --- [           main] o.s.c.d.acceptance.test.TickTockTests    : Error while trying to access logfile from 'http://10.194.6.131:30774/logfile' due to : org.springframework.web.client.ResourceAccessException: I/O error on GET request for "http://10.194.6.131:30774/logfile": Connection refused (Connection refused); nested exception is java.net.ConnectException: Connection refused (Connection refused)
13-Dec-2019 00:38:06 2019-12-13 00:38:06.532  INFO 26290 --- [           main] o.s.c.d.acceptance.test.TickTockTests    : Requesting log for app TICKTOCK.log-v3-0
13-Dec-2019 00:38:06 2019-12-13 00:38:06.648  INFO 26290 --- [           main] o.s.c.d.acceptance.test.TickTockTests    : Retrieved logfile from 'http://10.194.6.131:44424/actuator/logfile
13-Dec-2019 00:38:06 2019-12-13 00:38:06.649  INFO 26290 --- [           main] o.s.c.d.acceptance.test.TickTockTests    : Requesting log for app TICKTOCK.log-v2-0
13-Dec-2019 00:38:06 2019-12-13 00:38:06.650  WARN 26290 --- [           main] o.s.c.d.acceptance.test.TickTockTests    : Error while trying to access logfile from 'http://10.194.6.131:41029/logfile' due to : org.springframework.web.client.ResourceAccessException: I/O error on GET request for "http://10.194.6.131:41029/logfile": Connection refused (Connection refused); nested exception is java.net.ConnectException: Connection refused (Connection refused)
13-Dec-2019 00:38:06 2019-12-13 00:38:06.650  INFO 26290 --- [           main] o.s.c.d.acceptance.test.TickTockTests    : Matched all 'TICKTOCK - TIMESTAMP:' in logfile for app log (source TICKTOCK.log-v3-0)
13-Dec-2019 00:38:06 2019-12-13 00:38:06.651  INFO 26290 --- [           main] junit.logTestName                        : Test tickTockUpdateRollbackTests(org.springframework.cloud.dataflow.acceptance.test.TickTockTests) Succeeded
13-Dec-2019 00:38:06 2019-12-13 00:38:06.651  INFO 26290 --- [           main] junit.logTestName                        : Finished Test tickTockUpdateRollbackTests(org.springframework.cloud.dataflow.acceptance.test.TickTockTests)
13-Dec-2019 00:38:06 2019-12-13 00:38:06.651  INFO 26290 --- [           main] o.s.c.d.acceptance.test.TickTockTests    : Destroy all streams
13-Dec-2019 00:38:06 2019-12-13 00:38:06.984  INFO 26290 --- [           main] junit.logTestName                        : Starting Test tickTockTests(org.springframework.cloud.dataflow.acceptance.test.TickTockTests)
13-Dec-2019 00:38:06 2019-12-13 00:38:06.985  INFO 26290 --- [           main] o.s.c.d.acceptance.test.TickTockTests    : Creating stream 'TICKTOCK'
13-Dec-2019 00:38:07 2019-12-13 00:38:07.052  INFO 26290 --- [           main] o.s.c.d.acceptance.test.TickTockTests    : Deploying stream 'TICKTOCK' with properties: {app.*.spring.cloud.streamapp.security.enabled=false, app.*.logging.file=${PID}-test.log, app.*.endpoints.logfile.sensitive=false, app.log.log.expression='TICKTOCK - TIMESTAMP: '.concat(payload), app.*.management.endpoints.web.exposure.include=*}
13-Dec-2019 00:38:07 2019-12-13 00:38:07.596  INFO 26290 --- [           main] o.s.c.d.acceptance.test.TickTockTests    : Checking: Stream=TICKTOCK, status = deploying, status description = The stream is being deployed.
13-Dec-2019 00:38:07 2019-12-13 00:38:07.597  INFO 26290 --- [           main] o.s.c.d.acceptance.test.TickTockTests    : Sleeping to check status of Stream=TICKTOCK
13-Dec-2019 00:38:17 2019-12-13 00:38:17.648  INFO 26290 --- [           main] o.s.c.d.acceptance.test.TickTockTests    : Checking: Stream=TICKTOCK, status = deploying, status description = The stream is being deployed.
13-Dec-2019 00:38:17 2019-12-13 00:38:17.648  INFO 26290 --- [           main] o.s.c.d.acceptance.test.TickTockTests    : Sleeping to check status of Stream=TICKTOCK
13-Dec-2019 00:38:27 2019-12-13 00:38:27.675  INFO 26290 --- [           main] o.s.c.d.acceptance.test.TickTockTests    : Checking: Stream=TICKTOCK, status = deployed, status description = The stream has been successfully deployed
13-Dec-2019 00:38:27 2019-12-13 00:38:27.701  INFO 26290 --- [           main] o.s.c.d.acceptance.test.TickTockTests    : Sleeping to check status of Stream=TICKTOCK
13-Dec-2019 00:38:37 2019-12-13 00:38:37.701  INFO 26290 --- [           main] o.s.c.d.acceptance.test.TickTockTests    : Stream 'TICKTOCK' started with status: deployed
13-Dec-2019 00:38:37 2019-12-13 00:38:37.702  INFO 26290 --- [           main] o.s.c.d.acceptance.test.TickTockTests    : App 'log' has instances: {TICKTOCK.log-v4-0=http://10.194.6.131:36360}
13-Dec-2019 00:38:37 2019-12-13 00:38:37.702  INFO 26290 --- [           main] o.s.c.d.acceptance.test.TickTockTests    : App 'time' has instances: {TICKTOCK.time-v4-0=http://10.194.6.131:34408}
13-Dec-2019 00:38:37 2019-12-13 00:38:37.703  INFO 26290 --- [           main] o.s.c.d.acceptance.test.TickTockTests    : Looking for 'Started TimeSource' in logfile for time
13-Dec-2019 00:38:47 2019-12-13 00:38:47.703  INFO 26290 --- [           main] o.s.c.d.acceptance.test.TickTockTests    : Requesting log for app TICKTOCK.time-v4-0
13-Dec-2019 00:38:47 2019-12-13 00:38:47.959  INFO 26290 --- [           main] o.s.c.d.acceptance.test.TickTockTests    : Retrieved logfile from 'http://10.194.6.131:34408/actuator/logfile
13-Dec-2019 00:38:47 2019-12-13 00:38:47.959  INFO 26290 --- [           main] o.s.c.d.acceptance.test.TickTockTests    : Matched all 'Started TimeSource' in logfile for app time (source TICKTOCK.time-v4-0)
13-Dec-2019 00:38:47 2019-12-13 00:38:47.959  INFO 26290 --- [           main] o.s.c.d.acceptance.test.TickTockTests    : Looking for 'Started LogSink' in logfile for log
13-Dec-2019 00:38:57 2019-12-13 00:38:57.959  INFO 26290 --- [           main] o.s.c.d.acceptance.test.TickTockTests    : Requesting log for app TICKTOCK.log-v4-0
13-Dec-2019 00:38:58 2019-12-13 00:38:58.085  INFO 26290 --- [           main] o.s.c.d.acceptance.test.TickTockTests    : Retrieved logfile from 'http://10.194.6.131:36360/actuator/logfile
13-Dec-2019 00:38:58 2019-12-13 00:38:58.085  INFO 26290 --- [           main] o.s.c.d.acceptance.test.TickTockTests    : Matched all 'Started LogSink' in logfile for app log (source TICKTOCK.log-v4-0)
13-Dec-2019 00:38:58 2019-12-13 00:38:58.085  INFO 26290 --- [           main] o.s.c.d.acceptance.test.TickTockTests    : Looking for 'TICKTOCK - TIMESTAMP:' in logfile for log
13-Dec-2019 00:39:08 2019-12-13 00:39:08.085  INFO 26290 --- [           main] o.s.c.d.acceptance.test.TickTockTests    : Requesting log for app TICKTOCK.log-v4-0
13-Dec-2019 00:39:08 2019-12-13 00:39:08.092  INFO 26290 --- [           main] o.s.c.d.acceptance.test.TickTockTests    : Retrieved logfile from 'http://10.194.6.131:36360/actuator/logfile
13-Dec-2019 00:39:08 2019-12-13 00:39:08.093  INFO 26290 --- [           main] o.s.c.d.acceptance.test.TickTockTests    : Matched all 'TICKTOCK - TIMESTAMP:' in logfile for app log (source TICKTOCK.log-v4-0)
13-Dec-2019 00:39:08 2019-12-13 00:39:08.094  INFO 26290 --- [           main] junit.logTestName                        : Test tickTockTests(org.springframework.cloud.dataflow.acceptance.test.TickTockTests) Succeeded
13-Dec-2019 00:39:08 2019-12-13 00:39:08.094  INFO 26290 --- [           main] junit.logTestName                        : Finished Test tickTockTests(org.springframework.cloud.dataflow.acceptance.test.TickTockTests)
13-Dec-2019 00:39:08 2019-12-13 00:39:08.095  INFO 26290 --- [           main] o.s.c.d.acceptance.test.TickTockTests    : Destroy all streams
13-Dec-2019 00:39:08 2019-12-13 00:39:08.344  INFO 26290 --- [           main] junit.logTestName                        : Starting Test tickTockTestsFromConfigServer(org.springframework.cloud.dataflow.acceptance.test.TickTockTests)
13-Dec-2019 00:39:08 2019-12-13 00:39:08.348  INFO 26290 --- [           main] junit.logTestName                        : Finished Test tickTockTestsFromConfigServer(org.springframework.cloud.dataflow.acceptance.test.TickTockTests)
13-Dec-2019 00:39:08 2019-12-13 00:39:08.348  INFO 26290 --- [           main] o.s.c.d.acceptance.test.TickTockTests    : Destroy all streams
13-Dec-2019 00:39:08 Tests run: 3, Failures: 0, Errors: 0, Skipped: 1, Time elapsed: 194.173 sec - in org.springframework.cloud.dataflow.acceptance.test.TickTockTests
13-Dec-2019 00:39:08 Running org.springframework.cloud.dataflow.acceptance.test.ComposedTaskTests
13-Dec-2019 00:39:08 2019-12-13 00:39:08.412  INFO 26290 --- [           main] junit.logTestName                        : Starting Test ctrMultipleLaunchWithArguments(org.springframework.cloud.dataflow.acceptance.test.ComposedTaskTests)
13-Dec-2019 00:42:08 2019-12-13 00:42:08.900 ERROR 26290 --- [           main] junit.logTestName                        : !!! Test ctrMultipleLaunchWithArguments(org.springframework.cloud.dataflow.acceptance.test.ComposedTaskTests) Failed !!!
13-Dec-2019 00:42:08
13-Dec-2019 00:42:08 java.lang.AssertionError: null
13-Dec-2019 00:42:08         at org.junit.Assert.fail(Assert.java:86)
13-Dec-2019 00:42:08         at org.junit.Assert.assertTrue(Assert.java:41)
13-Dec-2019 00:42:08         at org.junit.Assert.assertTrue(Assert.java:52)
13-Dec-2019 00:42:08         at org.springframework.cloud.dataflow.acceptance.test.ComposedTaskTests.assertTaskExecutions(ComposedTaskTests.java:65)
13-Dec-2019 00:42:08         at org.springframework.cloud.dataflow.acceptance.test.ComposedTaskTests.ctrMultipleLaunchWithArguments(ComposedTaskTests.java:57)
13-Dec-2019 00:42:08         at sun.reflect.NativeMethodAccessorImpl.invoke0(Native Method)
13-Dec-2019 00:42:08         at sun.reflect.NativeMethodAccessorImpl.invoke(NativeMethodAccessorImpl.java:62)
13-Dec-2019 00:42:08         at sun.reflect.DelegatingMethodAccessorImpl.invoke(DelegatingMethodAccessorImpl.java:43)
13-Dec-2019 00:42:08         at java.lang.reflect.Method.invoke(Method.java:498)
13-Dec-2019 00:42:08         at org.junit.runners.model.FrameworkMethod$1.runReflectiveCall(FrameworkMethod.java:50)
13-Dec-2019 00:42:08         at org.junit.internal.runners.model.ReflectiveCallable.run(ReflectiveCallable.java:12)
13-Dec-2019 00:42:08         at org.junit.runners.model.FrameworkMethod.invokeExplosively(FrameworkMethod.java:47)
13-Dec-2019 00:42:08         at org.junit.internal.runners.statements.InvokeMethod.evaluate(InvokeMethod.java:17)
13-Dec-2019 00:42:08         at org.junit.internal.runners.statements.RunBefores.evaluate(RunBefores.java:26)
13-Dec-2019 00:42:08         at org.springframework.test.context.junit4.statements.RunBeforeTestMethodCallbacks.evaluate(RunBeforeTestMethodCallbacks.java:75)
13-Dec-2019 00:42:08         at org.junit.internal.runners.statements.RunAfters.evaluate(RunAfters.java:27)
13-Dec-2019 00:42:08         at org.springframework.test.context.junit4.statements.RunAfterTestMethodCallbacks.evaluate(RunAfterTestMethodCallbacks.java:86)
13-Dec-2019 00:42:08         at org.junit.rules.TestWatcher$1.evaluate(TestWatcher.java:55)
13-Dec-2019 00:42:08         at org.junit.rules.RunRules.evaluate(RunRules.java:20)
13-Dec-2019 00:42:08         at org.springframework.test.context.junit4.statements.SpringRepeat.evaluate(SpringRepeat.java:84)
13-Dec-2019 00:42:08         at org.junit.runners.ParentRunner.runLeaf(ParentRunner.java:325)
13-Dec-2019 00:42:08         at org.springframework.test.context.junit4.SpringJUnit4ClassRunner.runChild(SpringJUnit4ClassRunner.java:252)
13-Dec-2019 00:42:08         at org.springframework.test.context.junit4.SpringJUnit4ClassRunner.runChild(SpringJUnit4ClassRunner.java:94)
13-Dec-2019 00:42:08         at org.junit.runners.ParentRunner$3.run(ParentRunner.java:290)
13-Dec-2019 00:42:08         at org.junit.runners.ParentRunner$1.schedule(ParentRunner.java:71)
13-Dec-2019 00:42:08         at org.junit.runners.ParentRunner.runChildren(ParentRunner.java:288)
13-Dec-2019 00:42:08         at org.junit.runners.ParentRunner.access$000(ParentRunner.java:58)
13-Dec-2019 00:42:08         at org.junit.runners.ParentRunner$2.evaluate(ParentRunner.java:268)
13-Dec-2019 00:42:08         at org.springframework.test.context.junit4.statements.RunBeforeTestClassCallbacks.evaluate(RunBeforeTestClassCallbacks.java:61)
13-Dec-2019 00:42:08         at org.springframework.test.context.junit4.statements.RunAfterTestClassCallbacks.evaluate(RunAfterTestClassCallbacks.java:70)
13-Dec-2019 00:42:08         at org.junit.runners.ParentRunner.run(ParentRunner.java:363)
13-Dec-2019 00:42:08         at org.springframework.test.context.junit4.SpringJUnit4ClassRunner.run(SpringJUnit4ClassRunner.java:191)
13-Dec-2019 00:42:08         at org.apache.maven.surefire.junit4.JUnit4Provider.execute(JUnit4Provider.java:283)
13-Dec-2019 00:42:08         at org.apache.maven.surefire.junit4.JUnit4Provider.executeWithRerun(JUnit4Provider.java:173)
13-Dec-2019 00:42:08         at org.apache.maven.surefire.junit4.JUnit4Provider.executeTestSet(JUnit4Provider.java:153)
13-Dec-2019 00:42:08         at org.apache.maven.surefire.junit4.JUnit4Provider.invoke(JUnit4Provider.java:128)
13-Dec-2019 00:42:08         at org.apache.maven.surefire.booter.ForkedBooter.invokeProviderInSameClassLoader(ForkedBooter.java:203)
13-Dec-2019 00:42:08         at org.apache.maven.surefire.booter.ForkedBooter.runSuitesInProcess(ForkedBooter.java:155)
13-Dec-2019 00:42:08         at org.apache.maven.surefire.booter.ForkedBooter.main(ForkedBooter.java:103)
13-Dec-2019 00:42:08
13-Dec-2019 00:42:08 2019-12-13 00:42:08.901  INFO 26290 --- [           main] junit.logTestName                        : Finished Test ctrMultipleLaunchWithArguments(org.springframework.cloud.dataflow.acceptance.test.ComposedTaskTests)
13-Dec-2019 00:42:08 2019-12-13 00:42:08.971  INFO 26290 --- [           main] junit.logTestName                        : Starting Test ctrMultipleLaunch(org.springframework.cloud.dataflow.acceptance.test.ComposedTaskTests)
13-Dec-2019 00:45:09 2019-12-13 00:45:09.438 ERROR 26290 --- [           main] junit.logTestName                        : !!! Test ctrMultipleLaunch(org.springframework.cloud.dataflow.acceptance.test.ComposedTaskTests) Failed !!!
13-Dec-2019 00:45:09
13-Dec-2019 00:45:09 java.lang.AssertionError: null
13-Dec-2019 00:45:09         at org.junit.Assert.fail(Assert.java:86)
13-Dec-2019 00:45:09         at org.junit.Assert.assertTrue(Assert.java:41)
13-Dec-2019 00:45:09         at org.junit.Assert.assertTrue(Assert.java:52)
13-Dec-2019 00:45:09         at org.springframework.cloud.dataflow.acceptance.test.ComposedTaskTests.assertTaskExecutions(ComposedTaskTests.java:65)
13-Dec-2019 00:45:09         at org.springframework.cloud.dataflow.acceptance.test.ComposedTaskTests.ctrMultipleLaunch(ComposedTaskTests.java:47)
13-Dec-2019 00:45:09         at sun.reflect.NativeMethodAccessorImpl.invoke0(Native Method)
13-Dec-2019 00:45:09         at sun.reflect.NativeMethodAccessorImpl.invoke(NativeMethodAccessorImpl.java:62)
13-Dec-2019 00:45:09         at sun.reflect.DelegatingMethodAccessorImpl.invoke(DelegatingMethodAccessorImpl.java:43)
13-Dec-2019 00:45:09         at java.lang.reflect.Method.invoke(Method.java:498)
13-Dec-2019 00:45:09         at org.junit.runners.model.FrameworkMethod$1.runReflectiveCall(FrameworkMethod.java:50)
13-Dec-2019 00:45:09         at org.junit.internal.runners.model.ReflectiveCallable.run(ReflectiveCallable.java:12)
13-Dec-2019 00:45:09         at org.junit.runners.model.FrameworkMethod.invokeExplosively(FrameworkMethod.java:47)
13-Dec-2019 00:45:09         at org.junit.internal.runners.statements.InvokeMethod.evaluate(InvokeMethod.java:17)
13-Dec-2019 00:45:09         at org.junit.internal.runners.statements.RunBefores.evaluate(RunBefores.java:26)
13-Dec-2019 00:45:09         at org.springframework.test.context.junit4.statements.RunBeforeTestMethodCallbacks.evaluate(RunBeforeTestMethodCallbacks.java:75)
13-Dec-2019 00:45:09         at org.junit.internal.runners.statements.RunAfters.evaluate(RunAfters.java:27)
13-Dec-2019 00:45:09         at org.springframework.test.context.junit4.statements.RunAfterTestMethodCallbacks.evaluate(RunAfterTestMethodCallbacks.java:86)
13-Dec-2019 00:45:09         at org.junit.rules.TestWatcher$1.evaluate(TestWatcher.java:55)
13-Dec-2019 00:45:09         at org.junit.rules.RunRules.evaluate(RunRules.java:20)
13-Dec-2019 00:45:09         at org.springframework.test.context.junit4.statements.SpringRepeat.evaluate(SpringRepeat.java:84)
13-Dec-2019 00:45:09         at org.junit.runners.ParentRunner.runLeaf(ParentRunner.java:325)
13-Dec-2019 00:45:09         at org.springframework.test.context.junit4.SpringJUnit4ClassRunner.runChild(SpringJUnit4ClassRunner.java:252)
13-Dec-2019 00:45:09         at org.springframework.test.context.junit4.SpringJUnit4ClassRunner.runChild(SpringJUnit4ClassRunner.java:94)
13-Dec-2019 00:45:09         at org.junit.runners.ParentRunner$3.run(ParentRunner.java:290)
13-Dec-2019 00:45:09         at org.junit.runners.ParentRunner$1.schedule(ParentRunner.java:71)
13-Dec-2019 00:45:09         at org.junit.runners.ParentRunner.runChildren(ParentRunner.java:288)
13-Dec-2019 00:45:09         at org.junit.runners.ParentRunner.access$000(ParentRunner.java:58)
13-Dec-2019 00:45:09         at org.junit.runners.ParentRunner$2.evaluate(ParentRunner.java:268)
13-Dec-2019 00:45:09         at org.springframework.test.context.junit4.statements.RunBeforeTestClassCallbacks.evaluate(RunBeforeTestClassCallbacks.java:61)
13-Dec-2019 00:45:09         at org.springframework.test.context.junit4.statements.RunAfterTestClassCallbacks.evaluate(RunAfterTestClassCallbacks.java:70)
13-Dec-2019 00:45:09         at org.junit.runners.ParentRunner.run(ParentRunner.java:363)
13-Dec-2019 00:45:09         at org.springframework.test.context.junit4.SpringJUnit4ClassRunner.run(SpringJUnit4ClassRunner.java:191)
13-Dec-2019 00:45:09         at org.apache.maven.surefire.junit4.JUnit4Provider.execute(JUnit4Provider.java:283)
13-Dec-2019 00:45:09         at org.apache.maven.surefire.junit4.JUnit4Provider.executeWithRerun(JUnit4Provider.java:173)
13-Dec-2019 00:45:09         at org.apache.maven.surefire.junit4.JUnit4Provider.executeTestSet(JUnit4Provider.java:153)
13-Dec-2019 00:45:09         at org.apache.maven.surefire.junit4.JUnit4Provider.invoke(JUnit4Provider.java:128)
13-Dec-2019 00:45:09         at org.apache.maven.surefire.booter.ForkedBooter.invokeProviderInSameClassLoader(ForkedBooter.java:203)
13-Dec-2019 00:45:09         at org.apache.maven.surefire.booter.ForkedBooter.runSuitesInProcess(ForkedBooter.java:155)
13-Dec-2019 00:45:09         at org.apache.maven.surefire.booter.ForkedBooter.main(ForkedBooter.java:103)
13-Dec-2019 00:45:09
13-Dec-2019 00:45:09 2019-12-13 00:45:09.439  INFO 26290 --- [           main] junit.logTestName                        : Finished Test ctrMultipleLaunch(org.springframework.cloud.dataflow.acceptance.test.ComposedTaskTests)
13-Dec-2019 00:45:09 2019-12-13 00:45:09.498  INFO 26290 --- [           main] junit.logTestName                        : Starting Test ctrLaunch(org.springframework.cloud.dataflow.acceptance.test.ComposedTaskTests)
13-Dec-2019 00:48:09 2019-12-13 00:48:09.998 ERROR 26290 --- [           main] junit.logTestName                        : !!! Test ctrLaunch(org.springframework.cloud.dataflow.acceptance.test.ComposedTaskTests) Failed !!!
13-Dec-2019 00:48:09
13-Dec-2019 00:48:09 java.lang.AssertionError: null
13-Dec-2019 00:48:09         at org.junit.Assert.fail(Assert.java:86)
13-Dec-2019 00:48:09         at org.junit.Assert.assertTrue(Assert.java:41)
13-Dec-2019 00:48:09         at org.junit.Assert.assertTrue(Assert.java:52)
13-Dec-2019 00:48:09         at org.springframework.cloud.dataflow.acceptance.test.ComposedTaskTests.assertTaskExecutions(ComposedTaskTests.java:65)
13-Dec-2019 00:48:09         at org.springframework.cloud.dataflow.acceptance.test.ComposedTaskTests.ctrLaunch(ComposedTaskTests.java:41)
13-Dec-2019 00:48:09         at sun.reflect.NativeMethodAccessorImpl.invoke0(Native Method)
13-Dec-2019 00:48:09         at sun.reflect.NativeMethodAccessorImpl.invoke(NativeMethodAccessorImpl.java:62)
13-Dec-2019 00:48:09         at sun.reflect.DelegatingMethodAccessorImpl.invoke(DelegatingMethodAccessorImpl.java:43)
13-Dec-2019 00:48:09         at java.lang.reflect.Method.invoke(Method.java:498)
13-Dec-2019 00:48:09         at org.junit.runners.model.FrameworkMethod$1.runReflectiveCall(FrameworkMethod.java:50)
13-Dec-2019 00:48:09         at org.junit.internal.runners.model.ReflectiveCallable.run(ReflectiveCallable.java:12)
13-Dec-2019 00:48:09         at org.junit.runners.model.FrameworkMethod.invokeExplosively(FrameworkMethod.java:47)
13-Dec-2019 00:48:09         at org.junit.internal.runners.statements.InvokeMethod.evaluate(InvokeMethod.java:17)
13-Dec-2019 00:48:09         at org.junit.internal.runners.statements.RunBefores.evaluate(RunBefores.java:26)
13-Dec-2019 00:48:09         at org.springframework.test.context.junit4.statements.RunBeforeTestMethodCallbacks.evaluate(RunBeforeTestMethodCallbacks.java:75)
13-Dec-2019 00:48:09         at org.junit.internal.runners.statements.RunAfters.evaluate(RunAfters.java:27)
13-Dec-2019 00:48:09         at org.springframework.test.context.junit4.statements.RunAfterTestMethodCallbacks.evaluate(RunAfterTestMethodCallbacks.java:86)
13-Dec-2019 00:48:09         at org.junit.rules.TestWatcher$1.evaluate(TestWatcher.java:55)
13-Dec-2019 00:48:09         at org.junit.rules.RunRules.evaluate(RunRules.java:20)
13-Dec-2019 00:48:09         at org.springframework.test.context.junit4.statements.SpringRepeat.evaluate(SpringRepeat.java:84)
13-Dec-2019 00:48:09         at org.junit.runners.ParentRunner.runLeaf(ParentRunner.java:325)
13-Dec-2019 00:48:09         at org.springframework.test.context.junit4.SpringJUnit4ClassRunner.runChild(SpringJUnit4ClassRunner.java:252)
13-Dec-2019 00:48:09         at org.springframework.test.context.junit4.SpringJUnit4ClassRunner.runChild(SpringJUnit4ClassRunner.java:94)
13-Dec-2019 00:48:09         at org.junit.runners.ParentRunner$3.run(ParentRunner.java:290)
13-Dec-2019 00:48:09         at org.junit.runners.ParentRunner$1.schedule(ParentRunner.java:71)
13-Dec-2019 00:48:09         at org.junit.runners.ParentRunner.runChildren(ParentRunner.java:288)
13-Dec-2019 00:48:09         at org.junit.runners.ParentRunner.access$000(ParentRunner.java:58)
13-Dec-2019 00:48:09         at org.junit.runners.ParentRunner$2.evaluate(ParentRunner.java:268)
13-Dec-2019 00:48:09         at org.springframework.test.context.junit4.statements.RunBeforeTestClassCallbacks.evaluate(RunBeforeTestClassCallbacks.java:61)
13-Dec-2019 00:48:09         at org.springframework.test.context.junit4.statements.RunAfterTestClassCallbacks.evaluate(RunAfterTestClassCallbacks.java:70)
13-Dec-2019 00:48:09         at org.junit.runners.ParentRunner.run(ParentRunner.java:363)
13-Dec-2019 00:48:09         at org.springframework.test.context.junit4.SpringJUnit4ClassRunner.run(SpringJUnit4ClassRunner.java:191)
13-Dec-2019 00:48:09         at org.apache.maven.surefire.junit4.JUnit4Provider.execute(JUnit4Provider.java:283)
13-Dec-2019 00:48:09         at org.apache.maven.surefire.junit4.JUnit4Provider.executeWithRerun(JUnit4Provider.java:173)
13-Dec-2019 00:48:09         at org.apache.maven.surefire.junit4.JUnit4Provider.executeTestSet(JUnit4Provider.java:153)
13-Dec-2019 00:48:09         at org.apache.maven.surefire.junit4.JUnit4Provider.invoke(JUnit4Provider.java:128)
13-Dec-2019 00:48:09         at org.apache.maven.surefire.booter.ForkedBooter.invokeProviderInSameClassLoader(ForkedBooter.java:203)
13-Dec-2019 00:48:09         at org.apache.maven.surefire.booter.ForkedBooter.runSuitesInProcess(ForkedBooter.java:155)
13-Dec-2019 00:48:09         at org.apache.maven.surefire.booter.ForkedBooter.main(ForkedBooter.java:103)
13-Dec-2019 00:48:09
13-Dec-2019 00:48:10 2019-12-13 00:48:09.999  INFO 26290 --- [           main] junit.logTestName                        : Finished Test ctrLaunch(org.springframework.cloud.dataflow.acceptance.test.ComposedTaskTests)
13-Dec-2019 00:48:10 Tests run: 3, Failures: 3, Errors: 0, Skipped: 0, Time elapsed: 541.645 sec <<< FAILURE! - in org.springframework.cloud.dataflow.acceptance.test.ComposedTaskTests
13-Dec-2019 00:48:10 ctrMultipleLaunchWithArguments(org.springframework.cloud.dataflow.acceptance.test.ComposedTaskTests)  Time elapsed: 180.494 sec  <<< FAILURE!
13-Dec-2019 00:48:10 java.lang.AssertionError: null
13-Dec-2019 00:48:10         at org.junit.Assert.fail(Assert.java:86)
13-Dec-2019 00:48:10         at org.junit.Assert.assertTrue(Assert.java:41)
13-Dec-2019 00:48:10         at org.junit.Assert.assertTrue(Assert.java:52)
13-Dec-2019 00:48:10         at org.springframework.cloud.dataflow.acceptance.test.ComposedTaskTests.assertTaskExecutions(ComposedTaskTests.java:65)
13-Dec-2019 00:48:10         at org.springframework.cloud.dataflow.acceptance.test.ComposedTaskTests.ctrMultipleLaunchWithArguments(ComposedTaskTests.java:57)
13-Dec-2019 00:48:10
13-Dec-2019 00:48:10 ctrMultipleLaunch(org.springframework.cloud.dataflow.acceptance.test.ComposedTaskTests)  Time elapsed: 180.468 sec  <<< FAILURE!
13-Dec-2019 00:48:10 java.lang.AssertionError: null
13-Dec-2019 00:48:10         at org.junit.Assert.fail(Assert.java:86)
13-Dec-2019 00:48:10         at org.junit.Assert.assertTrue(Assert.java:41)
13-Dec-2019 00:48:10         at org.junit.Assert.assertTrue(Assert.java:52)
13-Dec-2019 00:48:10         at org.springframework.cloud.dataflow.acceptance.test.ComposedTaskTests.assertTaskExecutions(ComposedTaskTests.java:65)
13-Dec-2019 00:48:10         at org.springframework.cloud.dataflow.acceptance.test.ComposedTaskTests.ctrMultipleLaunch(ComposedTaskTests.java:47)
13-Dec-2019 00:48:10
13-Dec-2019 00:48:10 ctrLaunch(org.springframework.cloud.dataflow.acceptance.test.ComposedTaskTests)  Time elapsed: 180.501 sec  <<< FAILURE!
13-Dec-2019 00:48:10 java.lang.AssertionError: null
13-Dec-2019 00:48:10         at org.junit.Assert.fail(Assert.java:86)
13-Dec-2019 00:48:10         at org.junit.Assert.assertTrue(Assert.java:41)
13-Dec-2019 00:48:10         at org.junit.Assert.assertTrue(Assert.java:52)
13-Dec-2019 00:48:10         at org.springframework.cloud.dataflow.acceptance.test.ComposedTaskTests.assertTaskExecutions(ComposedTaskTests.java:65)
13-Dec-2019 00:48:10         at org.springframework.cloud.dataflow.acceptance.test.ComposedTaskTests.ctrLaunch(ComposedTaskTests.java:41)
13-Dec-2019 00:48:10
13-Dec-2019 00:48:10 Running org.springframework.cloud.dataflow.acceptance.test.TransformTests
13-Dec-2019 00:48:10 2019-12-13 00:48:10.000  INFO 26290 --- [           main] .b.t.c.SpringBootTestContextBootstrapper : Neither @ContextConfiguration nor @ContextHierarchy found for test class [org.springframework.cloud.dataflow.acceptance.test.TransformTests], using SpringBootContextLoader
13-Dec-2019 00:48:10 2019-12-13 00:48:10.006  INFO 26290 --- [           main] .b.t.c.SpringBootTestContextBootstrapper : Loaded default TestExecutionListener class names from location [META-INF/spring.factories]: [org.springframework.boot.test.mock.mockito.MockitoTestExecutionListener, org.springframework.boot.test.mock.mockito.ResetMocksTestExecutionListener, org.springframework.boot.test.autoconfigure.restdocs.RestDocsTestExecutionListener, org.springframework.boot.test.autoconfigure.web.client.MockRestServiceServerResetTestExecutionListener, org.springframework.boot.test.autoconfigure.web.servlet.MockMvcPrintOnlyOnFailureTestExecutionListener, org.springframework.boot.test.autoconfigure.web.servlet.WebDriverTestExecutionListener, org.springframework.test.context.web.ServletTestExecutionListener, org.springframework.test.context.support.DirtiesContextBeforeModesTestExecutionListener, org.springframework.test.context.support.DependencyInjectionTestExecutionListener, org.springframework.test.context.support.DirtiesContextTestExecutionListener, org.springframework.test.context.transaction.TransactionalTestExecutionListener, org.springframework.test.context.jdbc.SqlScriptsTestExecutionListener]
13-Dec-2019 00:48:10 2019-12-13 00:48:10.009  INFO 26290 --- [           main] .b.t.c.SpringBootTestContextBootstrapper : Using TestExecutionListeners: [org.springframework.test.context.web.ServletTestExecutionListener@4f3faa70, org.springframework.test.context.support.DirtiesContextBeforeModesTestExecutionListener@4832f03b, org.springframework.boot.test.autoconfigure.SpringBootDependencyInjectionTestExecutionListener@7af3874e, org.springframework.test.context.support.DirtiesContextTestExecutionListener@5a8816cc, org.springframework.test.context.transaction.TransactionalTestExecutionListener@68565bc7, org.springframework.test.context.jdbc.SqlScriptsTestExecutionListener@37baddde, org.springframework.boot.test.mock.mockito.MockitoTestExecutionListener@5115f590, org.springframework.boot.test.autoconfigure.web.servlet.MockMvcPrintOnlyOnFailureTestExecutionListener@4b31a708, org.springframework.boot.test.autoconfigure.web.client.MockRestServiceServerResetTestExecutionListener@11e355ca, org.springframework.boot.test.mock.mockito.ResetMocksTestExecutionListener@70d63e05, org.springframework.boot.test.autoconfigure.web.servlet.WebDriverTestExecutionListener@e11ecfa, org.springframework.boot.test.autoconfigure.restdocs.RestDocsTestExecutionListener@485e13d7]
13-Dec-2019 00:48:10 2019-12-13 00:48:10.068  INFO 26290 --- [           main] junit.logTestName                        : Starting Test transformTests(org.springframework.cloud.dataflow.acceptance.test.TransformTests)
13-Dec-2019 00:48:10 2019-12-13 00:48:10.069  INFO 26290 --- [           main] o.s.c.d.acceptance.test.TransformTests   : Creating stream 'TRANSFORM-TEST'
13-Dec-2019 00:48:10 2019-12-13 00:48:10.108  INFO 26290 --- [           main] o.s.c.d.acceptance.test.TransformTests   : Deploying stream 'TRANSFORM-TEST' with properties: {app.*.spring.cloud.streamapp.security.enabled=false, app.*.logging.file=${PID}-test.log, app.*.endpoints.logfile.sensitive=false, app.*.management.endpoints.web.exposure.include=*}
13-Dec-2019 00:48:10 2019-12-13 00:48:10.818  INFO 26290 --- [           main] o.s.c.d.acceptance.test.TransformTests   : Checking: Stream=TRANSFORM-TEST, status = deploying, status description = The stream is being deployed.
13-Dec-2019 00:48:10 2019-12-13 00:48:10.819  INFO 26290 --- [           main] o.s.c.d.acceptance.test.TransformTests   : Sleeping to check status of Stream=TRANSFORM-TEST
13-Dec-2019 00:48:20 2019-12-13 00:48:20.862  INFO 26290 --- [           main] o.s.c.d.acceptance.test.TransformTests   : Checking: Stream=TRANSFORM-TEST, status = deploying, status description = The stream is being deployed.
13-Dec-2019 00:48:20 2019-12-13 00:48:20.862  INFO 26290 --- [           main] o.s.c.d.acceptance.test.TransformTests   : Sleeping to check status of Stream=TRANSFORM-TEST
13-Dec-2019 00:48:30 2019-12-13 00:48:30.889  INFO 26290 --- [           main] o.s.c.d.acceptance.test.TransformTests   : Checking: Stream=TRANSFORM-TEST, status = deployed, status description = The stream has been successfully deployed
13-Dec-2019 00:48:30 2019-12-13 00:48:30.919  INFO 26290 --- [           main] o.s.c.d.acceptance.test.TransformTests   : Sleeping to check status of Stream=TRANSFORM-TEST
13-Dec-2019 00:48:40 2019-12-13 00:48:40.919  INFO 26290 --- [           main] o.s.c.d.acceptance.test.TransformTests   : Stream 'TRANSFORM-TEST' started with status: deployed
13-Dec-2019 00:48:40 2019-12-13 00:48:40.920  INFO 26290 --- [           main] o.s.c.d.acceptance.test.TransformTests   : App 'transform' has instances: {TRANSFORM-TEST.transform-v1-0=http://10.194.6.131:21217}
13-Dec-2019 00:48:40 2019-12-13 00:48:40.920  INFO 26290 --- [           main] o.s.c.d.acceptance.test.TransformTests   : App 'log' has instances: {TRANSFORM-TEST.log-v1-0=http://10.194.6.131:50497}
13-Dec-2019 00:48:40 2019-12-13 00:48:40.920  INFO 26290 --- [           main] o.s.c.d.acceptance.test.TransformTests   : App 'http' has instances: {TRANSFORM-TEST.http-v1-0=http://10.194.6.131:54935}
13-Dec-2019 00:48:40 2019-12-13 00:48:40.920  INFO 26290 --- [           main] o.s.c.d.acceptance.test.TransformTests   : Looking for 'Started HttpSource' in logfile for http
13-Dec-2019 00:48:50 2019-12-13 00:48:50.920  INFO 26290 --- [           main] o.s.c.d.acceptance.test.TransformTests   : Requesting log for app TRANSFORM-TEST.http-v1-0
13-Dec-2019 00:48:51 2019-12-13 00:48:51.178  INFO 26290 --- [           main] o.s.c.d.acceptance.test.TransformTests   : Retrieved logfile from 'http://10.194.6.131:54935/actuator/logfile
13-Dec-2019 00:48:51 2019-12-13 00:48:51.178  INFO 26290 --- [           main] o.s.c.d.acceptance.test.TransformTests   : Matched all 'Started HttpSource' in logfile for app http (source TRANSFORM-TEST.http-v1-0)
13-Dec-2019 00:48:51 2019-12-13 00:48:51.306  INFO 26290 --- [           main] o.s.c.d.acceptance.test.TransformTests   : Looking for 'Started LogSink' in logfile for log
13-Dec-2019 00:49:01 2019-12-13 00:49:01.307  INFO 26290 --- [           main] o.s.c.d.acceptance.test.TransformTests   : Requesting log for app TRANSFORM-TEST.log-v1-0
13-Dec-2019 00:49:01 2019-12-13 00:49:01.431  INFO 26290 --- [           main] o.s.c.d.acceptance.test.TransformTests   : Retrieved logfile from 'http://10.194.6.131:50497/actuator/logfile
13-Dec-2019 00:49:01 2019-12-13 00:49:01.431  INFO 26290 --- [           main] o.s.c.d.acceptance.test.TransformTests   : Matched all 'Started LogSink' in logfile for app log (source TRANSFORM-TEST.log-v1-0)
13-Dec-2019 00:49:01 2019-12-13 00:49:01.431  INFO 26290 --- [           main] o.s.c.d.acceptance.test.TransformTests   : Looking for 'ABCDEFG' in logfile for log
13-Dec-2019 00:49:11 2019-12-13 00:49:11.431  INFO 26290 --- [           main] o.s.c.d.acceptance.test.TransformTests   : Requesting log for app TRANSFORM-TEST.log-v1-0
13-Dec-2019 00:49:11 2019-12-13 00:49:11.439  INFO 26290 --- [           main] o.s.c.d.acceptance.test.TransformTests   : Retrieved logfile from 'http://10.194.6.131:50497/actuator/logfile
13-Dec-2019 00:49:11 2019-12-13 00:49:11.439  INFO 26290 --- [           main] o.s.c.d.acceptance.test.TransformTests   : Matched all 'ABCDEFG' in logfile for app log (source TRANSFORM-TEST.log-v1-0)
13-Dec-2019 00:49:11 2019-12-13 00:49:11.440  INFO 26290 --- [           main] junit.logTestName                        : Test transformTests(org.springframework.cloud.dataflow.acceptance.test.TransformTests) Succeeded
13-Dec-2019 00:49:11 2019-12-13 00:49:11.440  INFO 26290 --- [           main] junit.logTestName                        : Finished Test transformTests(org.springframework.cloud.dataflow.acceptance.test.TransformTests)
13-Dec-2019 00:49:11 2019-12-13 00:49:11.440  INFO 26290 --- [           main] o.s.c.d.acceptance.test.TransformTests   : Destroy all streams
13-Dec-2019 00:49:11 Tests run: 1, Failures: 0, Errors: 0, Skipped: 0, Time elapsed: 61.745 sec - in org.springframework.cloud.dataflow.acceptance.test.TransformTests
13-Dec-2019 00:49:11 Running org.springframework.cloud.dataflow.acceptance.test.SchedulerTests
13-Dec-2019 00:49:11 2019-12-13 00:49:11.864  INFO 26290 --- [           main] s.c.a.AnnotationConfigApplicationContext : Refreshing org.springframework.context.annotation.AnnotationConfigApplicationContext@19b206ee: startup date [Fri Dec 13 00:49:11 UTC 2019]; root of context hierarchy
13-Dec-2019 00:49:11 2019-12-13 00:49:11.889  INFO 26290 --- [           main] trationDelegate$BeanPostProcessorChecker : Bean 'configurationPropertiesRebinderAutoConfiguration' of type [class org.springframework.cloud.autoconfigure.ConfigurationPropertiesRebinderAutoConfiguration$$EnhancerBySpringCGLIB$$219d8b3d] is not eligible for getting processed by all BeanPostProcessors (for example: not eligible for auto-proxying)
13-Dec-2019 00:49:11
13-Dec-2019 00:49:11   .   ____          _            __ _ _
13-Dec-2019 00:49:11 /\\ / ___'_ __ _ _(_)_ __  __ _ \ \ \ \
13-Dec-2019 00:49:11 ( ( )\___ | '_ | '_| | '_ \/ _` | \ \ \ \
13-Dec-2019 00:49:11 \\/  ___)| |_)| | | | | || (_| |  ) ) ) )
13-Dec-2019 00:49:11   '  |____| .__|_| |_|_| |_\__, | / / / /
13-Dec-2019 00:49:11 =========|_|==============|___/=/_/_/_/
13-Dec-2019 00:49:11 :: Spring Boot ::        (v1.4.1.RELEASE)
13-Dec-2019 00:49:11
13-Dec-2019 00:49:11 2019-12-13 00:49:11.988  INFO 26290 --- [           main] c.c.c.ConfigServicePropertySourceLocator : Fetching config from server at: http://localhost:8888
13-Dec-2019 00:49:11 2019-12-13 00:49:11.991  WARN 26290 --- [           main] c.c.c.ConfigServicePropertySourceLocator : Could not locate PropertySource: I/O error on GET request for "http://localhost:8888//blah": Connection refused (Connection refused); nested exception is java.net.ConnectException: Connection refused (Connection refused)
13-Dec-2019 00:49:11 2019-12-13 00:49:11.992  INFO 26290 --- [           main] o.a.maven.surefire.booter.ForkedBooter   : The following profiles are active: blah
13-Dec-2019 00:49:11 2019-12-13 00:49:11.994  INFO 26290 --- [           main] s.c.a.AnnotationConfigApplicationContext : Refreshing org.springframework.context.annotation.AnnotationConfigApplicationContext@74606204: startup date [Fri Dec 13 00:49:11 UTC 2019]; parent: org.springframework.context.annotation.AnnotationConfigApplicationContext@19b206ee
13-Dec-2019 00:49:12 2019-12-13 00:49:12.086  INFO 26290 --- [           main] o.a.maven.surefire.booter.ForkedBooter   : Started ForkedBooter in 0.295 seconds (JVM running for 995.248)
13-Dec-2019 00:49:12 2019-12-13 00:49:12.086  INFO 26290 --- [           main] s.c.a.AnnotationConfigApplicationContext : Closing org.springframework.context.annotation.AnnotationConfigApplicationContext@74606204: startup date [Fri Dec 13 00:49:11 UTC 2019]; parent: org.springframework.context.annotation.AnnotationConfigApplicationContext@19b206ee
13-Dec-2019 00:49:12 2019-12-13 00:49:12.087 ERROR 26290 --- [           main] o.s.c.d.a.test.util.SchedulerRule        : SCHEDULER IS NOT AVAILABLE, SKIPPING TESTS
13-Dec-2019 00:49:12
13-Dec-2019 00:49:12 java.lang.IllegalArgumentException: no SchedulerOperations bean is available.  Skipping test.
13-Dec-2019 00:49:12         at org.springframework.util.Assert.notNull(Assert.java:115)
13-Dec-2019 00:49:12         at org.springframework.cloud.dataflow.acceptance.test.util.SchedulerRule.obtainResource(SchedulerRule.java:57)
13-Dec-2019 00:49:12         at org.springframework.cloud.scheduler.spi.junit.AbstractExternalResourceTestSupport.apply(AbstractExternalResourceTestSupport.java:58)
13-Dec-2019 00:49:12         at org.junit.rules.RunRules.applyAll(RunRules.java:26)
13-Dec-2019 00:49:12         at org.junit.rules.RunRules.<init>(RunRules.java:15)
13-Dec-2019 00:49:12         at org.junit.runners.ParentRunner.withClassRules(ParentRunner.java:245)
13-Dec-2019 00:49:12         at org.junit.runners.ParentRunner.classBlock(ParentRunner.java:194)
13-Dec-2019 00:49:12         at org.junit.runners.ParentRunner.run(ParentRunner.java:362)
13-Dec-2019 00:49:12         at org.springframework.test.context.junit4.SpringJUnit4ClassRunner.run(SpringJUnit4ClassRunner.java:191)
13-Dec-2019 00:49:12         at org.apache.maven.surefire.junit4.JUnit4Provider.execute(JUnit4Provider.java:283)
13-Dec-2019 00:49:12         at org.apache.maven.surefire.junit4.JUnit4Provider.executeWithRerun(JUnit4Provider.java:173)
13-Dec-2019 00:49:12         at org.apache.maven.surefire.junit4.JUnit4Provider.executeTestSet(JUnit4Provider.java:153)
13-Dec-2019 00:49:12         at org.apache.maven.surefire.junit4.JUnit4Provider.invoke(JUnit4Provider.java:128)
13-Dec-2019 00:49:12         at org.apache.maven.surefire.booter.ForkedBooter.invokeProviderInSameClassLoader(ForkedBooter.java:203)
13-Dec-2019 00:49:12         at org.apache.maven.surefire.booter.ForkedBooter.runSuitesInProcess(ForkedBooter.java:155)
13-Dec-2019 00:49:12         at org.apache.maven.surefire.booter.ForkedBooter.main(ForkedBooter.java:103)
13-Dec-2019 00:49:12
13-Dec-2019 00:49:12 Tests run: 1, Failures: 0, Errors: 0, Skipped: 1, Time elapsed: 0.329 sec - in org.springframework.cloud.dataflow.acceptance.test.SchedulerTests
13-Dec-2019 00:49:12 Running org.springframework.cloud.dataflow.acceptance.test.NamedChannelTests
13-Dec-2019 00:49:12 2019-12-13 00:49:12.088  INFO 26290 --- [           main] .b.t.c.SpringBootTestContextBootstrapper : Neither @ContextConfiguration nor @ContextHierarchy found for test class [org.springframework.cloud.dataflow.acceptance.test.NamedChannelTests], using SpringBootContextLoader
13-Dec-2019 00:49:12 2019-12-13 00:49:12.093  INFO 26290 --- [           main] .b.t.c.SpringBootTestContextBootstrapper : Loaded default TestExecutionListener class names from location [META-INF/spring.factories]: [org.springframework.boot.test.mock.mockito.MockitoTestExecutionListener, org.springframework.boot.test.mock.mockito.ResetMocksTestExecutionListener, org.springframework.boot.test.autoconfigure.restdocs.RestDocsTestExecutionListener, org.springframework.boot.test.autoconfigure.web.client.MockRestServiceServerResetTestExecutionListener, org.springframework.boot.test.autoconfigure.web.servlet.MockMvcPrintOnlyOnFailureTestExecutionListener, org.springframework.boot.test.autoconfigure.web.servlet.WebDriverTestExecutionListener, org.springframework.test.context.web.ServletTestExecutionListener, org.springframework.test.context.support.DirtiesContextBeforeModesTestExecutionListener, org.springframework.test.context.support.DependencyInjectionTestExecutionListener, org.springframework.test.context.support.DirtiesContextTestExecutionListener, org.springframework.test.context.transaction.TransactionalTestExecutionListener, org.springframework.test.context.jdbc.SqlScriptsTestExecutionListener]
13-Dec-2019 00:49:12 2019-12-13 00:49:12.094  INFO 26290 --- [           main] .b.t.c.SpringBootTestContextBootstrapper : Using TestExecutionListeners: [org.springframework.test.context.web.ServletTestExecutionListener@76cf841, org.springframework.test.context.support.DirtiesContextBeforeModesTestExecutionListener@297c9a9b, org.springframework.boot.test.autoconfigure.SpringBootDependencyInjectionTestExecutionListener@20999517, org.springframework.test.context.support.DirtiesContextTestExecutionListener@6ec63f8, org.springframework.test.context.transaction.TransactionalTestExecutionListener@66223d94, org.springframework.test.context.jdbc.SqlScriptsTestExecutionListener@2bc7db89, org.springframework.boot.test.mock.mockito.MockitoTestExecutionListener@479ac2cb, org.springframework.boot.test.autoconfigure.web.servlet.MockMvcPrintOnlyOnFailureTestExecutionListener@220c9a63, org.springframework.boot.test.autoconfigure.web.client.MockRestServiceServerResetTestExecutionListener@55b5cd2b, org.springframework.boot.test.mock.mockito.ResetMocksTestExecutionListener@40bb4f87, org.springframework.boot.test.autoconfigure.web.servlet.WebDriverTestExecutionListener@51a651c1, org.springframework.boot.test.autoconfigure.restdocs.RestDocsTestExecutionListener@173f1614]
13-Dec-2019 00:49:12 2019-12-13 00:49:12.153  INFO 26290 --- [           main] junit.logTestName                        : Starting Test testDestination(org.springframework.cloud.dataflow.acceptance.test.NamedChannelTests)
13-Dec-2019 00:49:12 2019-12-13 00:49:12.155  INFO 26290 --- [           main] o.s.c.d.a.test.NamedChannelTests         : Creating stream 'LOG-DESTINATION-SINK'
13-Dec-2019 00:49:12 2019-12-13 00:49:12.192  INFO 26290 --- [           main] o.s.c.d.a.test.NamedChannelTests         : Deploying stream 'LOG-DESTINATION-SINK' with properties: {app.*.spring.cloud.streamapp.security.enabled=false, app.*.logging.file=${PID}-test.log, app.*.endpoints.logfile.sensitive=false, app.*.management.endpoints.web.exposure.include=*}
13-Dec-2019 00:49:12 2019-12-13 00:49:12.571  INFO 26290 --- [           main] o.s.c.d.a.test.NamedChannelTests         : Checking: Stream=LOG-DESTINATION-SINK, status = deploying, status description = The stream is being deployed.
13-Dec-2019 00:49:12 2019-12-13 00:49:12.572  INFO 26290 --- [           main] o.s.c.d.a.test.NamedChannelTests         : Sleeping to check status of Stream=LOG-DESTINATION-SINK
13-Dec-2019 00:49:22 2019-12-13 00:49:22.597  INFO 26290 --- [           main] o.s.c.d.a.test.NamedChannelTests         : Checking: Stream=LOG-DESTINATION-SINK, status = deployed, status description = The stream has been successfully deployed
13-Dec-2019 00:49:22 2019-12-13 00:49:22.629  INFO 26290 --- [           main] o.s.c.d.a.test.NamedChannelTests         : Sleeping to check status of Stream=LOG-DESTINATION-SINK
13-Dec-2019 00:49:32 2019-12-13 00:49:32.630  INFO 26290 --- [           main] o.s.c.d.a.test.NamedChannelTests         : Stream 'LOG-DESTINATION-SINK' started with status: deployed
13-Dec-2019 00:49:32 2019-12-13 00:49:32.630  INFO 26290 --- [           main] o.s.c.d.a.test.NamedChannelTests         : App 'log' has instances: {LOG-DESTINATION-SINK.log-v1-0=http://10.194.6.131:60173}
13-Dec-2019 00:49:32 2019-12-13 00:49:32.630  INFO 26290 --- [           main] o.s.c.d.a.test.NamedChannelTests         : Looking for 'Started LogSink' in logfile for log
13-Dec-2019 00:49:42 2019-12-13 00:49:42.630  INFO 26290 --- [           main] o.s.c.d.a.test.NamedChannelTests         : Requesting log for app LOG-DESTINATION-SINK.log-v1-0
13-Dec-2019 00:49:42 2019-12-13 00:49:42.906  INFO 26290 --- [           main] o.s.c.d.a.test.NamedChannelTests         : Retrieved logfile from 'http://10.194.6.131:60173/actuator/logfile
13-Dec-2019 00:49:42 2019-12-13 00:49:42.907  INFO 26290 --- [           main] o.s.c.d.a.test.NamedChannelTests         : Matched all 'Started LogSink' in logfile for app log (source LOG-DESTINATION-SINK.log-v1-0)
13-Dec-2019 00:49:42 2019-12-13 00:49:42.907  INFO 26290 --- [           main] o.s.c.d.a.test.NamedChannelTests         : Creating stream 'HTTP-DESTINATION-SOURCE'
13-Dec-2019 00:49:42 2019-12-13 00:49:42.933  INFO 26290 --- [           main] o.s.c.d.a.test.NamedChannelTests         : Deploying stream 'HTTP-DESTINATION-SOURCE' with properties: {app.*.spring.cloud.streamapp.security.enabled=false, app.*.logging.file=${PID}-test.log, app.*.endpoints.logfile.sensitive=false, app.*.management.endpoints.web.exposure.include=*}
13-Dec-2019 00:49:43 2019-12-13 00:49:43.366  INFO 26290 --- [           main] o.s.c.d.a.test.NamedChannelTests         : Checking: Stream=HTTP-DESTINATION-SOURCE, status = deploying, status description = The stream is being deployed.
13-Dec-2019 00:49:43 2019-12-13 00:49:43.367  INFO 26290 --- [           main] o.s.c.d.a.test.NamedChannelTests         : Sleeping to check status of Stream=HTTP-DESTINATION-SOURCE
13-Dec-2019 00:49:53 2019-12-13 00:49:53.420  INFO 26290 --- [           main] o.s.c.d.a.test.NamedChannelTests         : Checking: Stream=HTTP-DESTINATION-SOURCE, status = deployed, status description = The stream has been successfully deployed
13-Dec-2019 00:49:53 2019-12-13 00:49:53.452  INFO 26290 --- [           main] o.s.c.d.a.test.NamedChannelTests         : Sleeping to check status of Stream=HTTP-DESTINATION-SOURCE
13-Dec-2019 00:50:03 2019-12-13 00:50:03.453  INFO 26290 --- [           main] o.s.c.d.a.test.NamedChannelTests         : Stream 'HTTP-DESTINATION-SOURCE' started with status: deployed
13-Dec-2019 00:50:03 2019-12-13 00:50:03.453  INFO 26290 --- [           main] o.s.c.d.a.test.NamedChannelTests         : App 'http' has instances: {HTTP-DESTINATION-SOURCE.http-v1-0=http://10.194.6.131:30116}
13-Dec-2019 00:50:03 2019-12-13 00:50:03.453  INFO 26290 --- [           main] o.s.c.d.a.test.NamedChannelTests         : Looking for 'Started HttpSource' in logfile for http
13-Dec-2019 00:50:13 2019-12-13 00:50:13.453  INFO 26290 --- [           main] o.s.c.d.a.test.NamedChannelTests         : Requesting log for app HTTP-DESTINATION-SOURCE.http-v1-0
13-Dec-2019 00:50:13 2019-12-13 00:50:13.714  INFO 26290 --- [           main] o.s.c.d.a.test.NamedChannelTests         : Retrieved logfile from 'http://10.194.6.131:30116/actuator/logfile
13-Dec-2019 00:50:13 2019-12-13 00:50:13.714  INFO 26290 --- [           main] o.s.c.d.a.test.NamedChannelTests         : Matched all 'Started HttpSource' in logfile for app http (source HTTP-DESTINATION-SOURCE.http-v1-0)
13-Dec-2019 00:50:13 2019-12-13 00:50:13.845  INFO 26290 --- [           main] o.s.c.d.a.test.NamedChannelTests         : Looking for 'abcdefg' in logfile for log
13-Dec-2019 00:50:23 2019-12-13 00:50:23.846  INFO 26290 --- [           main] o.s.c.d.a.test.NamedChannelTests         : Requesting log for app LOG-DESTINATION-SINK.log-v1-0
13-Dec-2019 00:50:23 2019-12-13 00:50:23.854  INFO 26290 --- [           main] o.s.c.d.a.test.NamedChannelTests         : Retrieved logfile from 'http://10.194.6.131:60173/actuator/logfile
13-Dec-2019 00:50:23 2019-12-13 00:50:23.854  INFO 26290 --- [           main] o.s.c.d.a.test.NamedChannelTests         : Matched all 'abcdefg' in logfile for app log (source LOG-DESTINATION-SINK.log-v1-0)
13-Dec-2019 00:50:23 2019-12-13 00:50:23.856  INFO 26290 --- [           main] junit.logTestName                        : Test testDestination(org.springframework.cloud.dataflow.acceptance.test.NamedChannelTests) Succeeded
13-Dec-2019 00:50:23 2019-12-13 00:50:23.856  INFO 26290 --- [           main] junit.logTestName                        : Finished Test testDestination(org.springframework.cloud.dataflow.acceptance.test.NamedChannelTests)
13-Dec-2019 00:50:23 2019-12-13 00:50:23.856  INFO 26290 --- [           main] o.s.c.d.a.test.NamedChannelTests         : Destroy all streams
13-Dec-2019 00:50:24 2019-12-13 00:50:24.177  INFO 26290 --- [           main] junit.logTestName                        : Starting Test testTap(org.springframework.cloud.dataflow.acceptance.test.NamedChannelTests)
13-Dec-2019 00:50:24 2019-12-13 00:50:24.180  INFO 26290 --- [           main] o.s.c.d.a.test.NamedChannelTests         : Creating stream 'TAPHTTP'
13-Dec-2019 00:50:24 2019-12-13 00:50:24.210  INFO 26290 --- [           main] o.s.c.d.a.test.NamedChannelTests         : Deploying stream 'TAPHTTP' with properties: {app.*.spring.cloud.streamapp.security.enabled=false, app.*.logging.file=${PID}-test.log, app.*.endpoints.logfile.sensitive=false, app.*.management.endpoints.web.exposure.include=*}
13-Dec-2019 00:50:24 2019-12-13 00:50:24.746  INFO 26290 --- [           main] o.s.c.d.a.test.NamedChannelTests         : Checking: Stream=TAPHTTP, status = deploying, status description = The stream is being deployed.
13-Dec-2019 00:50:24 2019-12-13 00:50:24.746  INFO 26290 --- [           main] o.s.c.d.a.test.NamedChannelTests         : Sleeping to check status of Stream=TAPHTTP
13-Dec-2019 00:50:34 2019-12-13 00:50:34.789  INFO 26290 --- [           main] o.s.c.d.a.test.NamedChannelTests         : Checking: Stream=TAPHTTP, status = deploying, status description = The stream is being deployed.
13-Dec-2019 00:50:34 2019-12-13 00:50:34.789  INFO 26290 --- [           main] o.s.c.d.a.test.NamedChannelTests         : Sleeping to check status of Stream=TAPHTTP
13-Dec-2019 00:50:44 2019-12-13 00:50:44.818  INFO 26290 --- [           main] o.s.c.d.a.test.NamedChannelTests         : Checking: Stream=TAPHTTP, status = deployed, status description = The stream has been successfully deployed
13-Dec-2019 00:50:44 2019-12-13 00:50:44.849  INFO 26290 --- [           main] o.s.c.d.a.test.NamedChannelTests         : Sleeping to check status of Stream=TAPHTTP
13-Dec-2019 00:50:54 2019-12-13 00:50:54.849  INFO 26290 --- [           main] o.s.c.d.a.test.NamedChannelTests         : Stream 'TAPHTTP' started with status: deployed
13-Dec-2019 00:50:54 2019-12-13 00:50:54.849  INFO 26290 --- [           main] o.s.c.d.a.test.NamedChannelTests         : App 'log' has instances: {TAPHTTP.log-v1-0=http://10.194.6.131:54969}
13-Dec-2019 00:50:54 2019-12-13 00:50:54.849  INFO 26290 --- [           main] o.s.c.d.a.test.NamedChannelTests         : App 'http' has instances: {TAPHTTP.http-v1-0=http://10.194.6.131:55611}
13-Dec-2019 00:50:54 2019-12-13 00:50:54.849  INFO 26290 --- [           main] o.s.c.d.a.test.NamedChannelTests         : Looking for 'Started HttpSource' in logfile for http
13-Dec-2019 00:51:04 2019-12-13 00:51:04.850  INFO 26290 --- [           main] o.s.c.d.a.test.NamedChannelTests         : Requesting log for app TAPHTTP.http-v1-0
13-Dec-2019 00:51:05 2019-12-13 00:51:05.125  INFO 26290 --- [           main] o.s.c.d.a.test.NamedChannelTests         : Retrieved logfile from 'http://10.194.6.131:55611/actuator/logfile
13-Dec-2019 00:51:05 2019-12-13 00:51:05.125  INFO 26290 --- [           main] o.s.c.d.a.test.NamedChannelTests         : Matched all 'Started HttpSource' in logfile for app http (source TAPHTTP.http-v1-0)
13-Dec-2019 00:51:05 2019-12-13 00:51:05.125  INFO 26290 --- [           main] o.s.c.d.a.test.NamedChannelTests         : Looking for 'Started LogSink' in logfile for log
13-Dec-2019 00:51:15 2019-12-13 00:51:15.125  INFO 26290 --- [           main] o.s.c.d.a.test.NamedChannelTests         : Requesting log for app TAPHTTP.log-v1-0
13-Dec-2019 00:51:15 2019-12-13 00:51:15.247  INFO 26290 --- [           main] o.s.c.d.a.test.NamedChannelTests         : Retrieved logfile from 'http://10.194.6.131:54969/actuator/logfile
13-Dec-2019 00:51:15 2019-12-13 00:51:15.247  INFO 26290 --- [           main] o.s.c.d.a.test.NamedChannelTests         : Matched all 'Started LogSink' in logfile for app log (source TAPHTTP.log-v1-0)
13-Dec-2019 00:51:15 2019-12-13 00:51:15.248  INFO 26290 --- [           main] o.s.c.d.a.test.NamedChannelTests         : Creating stream 'TAPSTREAM'
13-Dec-2019 00:51:15 2019-12-13 00:51:15.281  INFO 26290 --- [           main] o.s.c.d.a.test.NamedChannelTests         : Deploying stream 'TAPSTREAM' with properties: {app.*.spring.cloud.streamapp.security.enabled=false, app.*.logging.file=${PID}-test.log, app.*.endpoints.logfile.sensitive=false, app.*.management.endpoints.web.exposure.include=*}
13-Dec-2019 00:51:15 2019-12-13 00:51:15.719  INFO 26290 --- [           main] o.s.c.d.a.test.NamedChannelTests         : Checking: Stream=TAPSTREAM, status = deploying, status description = The stream is being deployed.
13-Dec-2019 00:51:15 2019-12-13 00:51:15.719  INFO 26290 --- [           main] o.s.c.d.a.test.NamedChannelTests         : Sleeping to check status of Stream=TAPSTREAM
13-Dec-2019 00:51:25 2019-12-13 00:51:25.765  INFO 26290 --- [           main] o.s.c.d.a.test.NamedChannelTests         : Checking: Stream=TAPSTREAM, status = deployed, status description = The stream has been successfully deployed
13-Dec-2019 00:51:25 2019-12-13 00:51:25.805  INFO 26290 --- [           main] o.s.c.d.a.test.NamedChannelTests         : Sleeping to check status of Stream=TAPSTREAM
13-Dec-2019 00:51:35 2019-12-13 00:51:35.806  INFO 26290 --- [           main] o.s.c.d.a.test.NamedChannelTests         : Stream 'TAPSTREAM' started with status: deployed
13-Dec-2019 00:51:35 2019-12-13 00:51:35.806  INFO 26290 --- [           main] o.s.c.d.a.test.NamedChannelTests         : App 'log' has instances: {TAPSTREAM.log-v1-0=http://10.194.6.131:49325}
13-Dec-2019 00:51:35 2019-12-13 00:51:35.806  INFO 26290 --- [           main] o.s.c.d.a.test.NamedChannelTests         : Looking for 'Started LogSink' in logfile for log
13-Dec-2019 00:51:45 2019-12-13 00:51:45.806  INFO 26290 --- [           main] o.s.c.d.a.test.NamedChannelTests         : Requesting log for app TAPSTREAM.log-v1-0
13-Dec-2019 00:51:46 2019-12-13 00:51:46.111  INFO 26290 --- [           main] o.s.c.d.a.test.NamedChannelTests         : Retrieved logfile from 'http://10.194.6.131:49325/actuator/logfile
13-Dec-2019 00:51:46 2019-12-13 00:51:46.111  INFO 26290 --- [           main] o.s.c.d.a.test.NamedChannelTests         : Matched all 'Started LogSink' in logfile for app log (source TAPSTREAM.log-v1-0)
13-Dec-2019 00:51:46 2019-12-13 00:51:46.258  INFO 26290 --- [           main] o.s.c.d.a.test.NamedChannelTests         : Looking for 'abcdefg' in logfile for log
13-Dec-2019 00:51:56 2019-12-13 00:51:56.259  INFO 26290 --- [           main] o.s.c.d.a.test.NamedChannelTests         : Requesting log for app TAPSTREAM.log-v1-0
13-Dec-2019 00:51:56 2019-12-13 00:51:56.267  INFO 26290 --- [           main] o.s.c.d.a.test.NamedChannelTests         : Retrieved logfile from 'http://10.194.6.131:49325/actuator/logfile
13-Dec-2019 00:51:56 2019-12-13 00:51:56.268  INFO 26290 --- [           main] o.s.c.d.a.test.NamedChannelTests         : Matched all 'abcdefg' in logfile for app log (source TAPSTREAM.log-v1-0)
13-Dec-2019 00:51:56 2019-12-13 00:51:56.269  INFO 26290 --- [           main] junit.logTestName                        : Test testTap(org.springframework.cloud.dataflow.acceptance.test.NamedChannelTests) Succeeded
13-Dec-2019 00:51:56 2019-12-13 00:51:56.269  INFO 26290 --- [           main] junit.logTestName                        : Finished Test testTap(org.springframework.cloud.dataflow.acceptance.test.NamedChannelTests)
13-Dec-2019 00:51:56 2019-12-13 00:51:56.269  INFO 26290 --- [           main] o.s.c.d.a.test.NamedChannelTests         : Destroy all streams
13-Dec-2019 00:51:56 2019-12-13 00:51:56.633  INFO 26290 --- [           main] junit.logTestName                        : Starting Test manyToOneTest(org.springframework.cloud.dataflow.acceptance.test.NamedChannelTests)
13-Dec-2019 00:51:56 2019-12-13 00:51:56.634  INFO 26290 --- [           main] o.s.c.d.a.test.NamedChannelTests         : Creating stream 'MANY-TO-ONE'
13-Dec-2019 00:51:56 2019-12-13 00:51:56.660  INFO 26290 --- [           main] o.s.c.d.a.test.NamedChannelTests         : Deploying stream 'MANY-TO-ONE' with properties: {app.*.spring.cloud.streamapp.security.enabled=false, app.*.logging.file=${PID}-test.log, app.*.endpoints.logfile.sensitive=false, app.*.management.endpoints.web.exposure.include=*}
13-Dec-2019 00:51:57 2019-12-13 00:51:57.007  INFO 26290 --- [           main] o.s.c.d.a.test.NamedChannelTests         : Checking: Stream=MANY-TO-ONE, status = deploying, status description = The stream is being deployed.
13-Dec-2019 00:51:57 2019-12-13 00:51:57.007  INFO 26290 --- [           main] o.s.c.d.a.test.NamedChannelTests         : Sleeping to check status of Stream=MANY-TO-ONE
13-Dec-2019 00:52:07 2019-12-13 00:52:07.029  INFO 26290 --- [           main] o.s.c.d.a.test.NamedChannelTests         : Checking: Stream=MANY-TO-ONE, status = deployed, status description = The stream has been successfully deployed
13-Dec-2019 00:52:07 2019-12-13 00:52:07.051  INFO 26290 --- [           main] o.s.c.d.a.test.NamedChannelTests         : Sleeping to check status of Stream=MANY-TO-ONE
13-Dec-2019 00:52:17 2019-12-13 00:52:17.052  INFO 26290 --- [           main] o.s.c.d.a.test.NamedChannelTests         : Stream 'MANY-TO-ONE' started with status: deployed
13-Dec-2019 00:52:17 2019-12-13 00:52:17.052  INFO 26290 --- [           main] o.s.c.d.a.test.NamedChannelTests         : App 'log' has instances: {MANY-TO-ONE.log-v1-0=http://10.194.6.131:27208}
13-Dec-2019 00:52:17 2019-12-13 00:52:17.052  INFO 26290 --- [           main] o.s.c.d.a.test.NamedChannelTests         : Looking for 'Started LogSink' in logfile for log
13-Dec-2019 00:52:27 2019-12-13 00:52:27.052  INFO 26290 --- [           main] o.s.c.d.a.test.NamedChannelTests         : Requesting log for app MANY-TO-ONE.log-v1-0
13-Dec-2019 00:52:27 2019-12-13 00:52:27.327  INFO 26290 --- [           main] o.s.c.d.a.test.NamedChannelTests         : Retrieved logfile from 'http://10.194.6.131:27208/actuator/logfile
13-Dec-2019 00:52:27 2019-12-13 00:52:27.328  INFO 26290 --- [           main] o.s.c.d.a.test.NamedChannelTests         : Matched all 'Started LogSink' in logfile for app log (source MANY-TO-ONE.log-v1-0)
13-Dec-2019 00:52:27 2019-12-13 00:52:27.328  INFO 26290 --- [           main] o.s.c.d.a.test.NamedChannelTests         : Creating stream 'HTTP-SOURCE-1'
13-Dec-2019 00:52:27 2019-12-13 00:52:27.354  INFO 26290 --- [           main] o.s.c.d.a.test.NamedChannelTests         : Deploying stream 'HTTP-SOURCE-1' with properties: {app.*.spring.cloud.streamapp.security.enabled=false, app.*.logging.file=${PID}-test.log, app.*.endpoints.logfile.sensitive=false, app.*.management.endpoints.web.exposure.include=*}
13-Dec-2019 00:52:27 2019-12-13 00:52:27.749  INFO 26290 --- [           main] o.s.c.d.a.test.NamedChannelTests         : Checking: Stream=HTTP-SOURCE-1, status = deploying, status description = The stream is being deployed.
13-Dec-2019 00:52:27 2019-12-13 00:52:27.749  INFO 26290 --- [           main] o.s.c.d.a.test.NamedChannelTests         : Sleeping to check status of Stream=HTTP-SOURCE-1
13-Dec-2019 00:52:37 2019-12-13 00:52:37.784  INFO 26290 --- [           main] o.s.c.d.a.test.NamedChannelTests         : Checking: Stream=HTTP-SOURCE-1, status = deployed, status description = The stream has been successfully deployed
13-Dec-2019 00:52:37 2019-12-13 00:52:37.810  INFO 26290 --- [           main] o.s.c.d.a.test.NamedChannelTests         : Sleeping to check status of Stream=HTTP-SOURCE-1
13-Dec-2019 00:52:47 2019-12-13 00:52:47.810  INFO 26290 --- [           main] o.s.c.d.a.test.NamedChannelTests         : Stream 'HTTP-SOURCE-1' started with status: deployed
13-Dec-2019 00:52:47 2019-12-13 00:52:47.811  INFO 26290 --- [           main] o.s.c.d.a.test.NamedChannelTests         : App 'http' has instances: {HTTP-SOURCE-1.http-v1-0=http://10.194.6.131:29769}
13-Dec-2019 00:52:47 2019-12-13 00:52:47.811  INFO 26290 --- [           main] o.s.c.d.a.test.NamedChannelTests         : Looking for 'Started HttpSource' in logfile for http
13-Dec-2019 00:52:57 2019-12-13 00:52:57.811  INFO 26290 --- [           main] o.s.c.d.a.test.NamedChannelTests         : Requesting log for app HTTP-SOURCE-1.http-v1-0
13-Dec-2019 00:52:58 2019-12-13 00:52:58.095  INFO 26290 --- [           main] o.s.c.d.a.test.NamedChannelTests         : Retrieved logfile from 'http://10.194.6.131:29769/actuator/logfile
13-Dec-2019 00:52:58 2019-12-13 00:52:58.095  INFO 26290 --- [           main] o.s.c.d.a.test.NamedChannelTests         : Matched all 'Started HttpSource' in logfile for app http (source HTTP-SOURCE-1.http-v1-0)
13-Dec-2019 00:52:58 2019-12-13 00:52:58.095  INFO 26290 --- [           main] o.s.c.d.a.test.NamedChannelTests         : Creating stream 'HTTP-SOURCE-2'
13-Dec-2019 00:52:58 2019-12-13 00:52:58.119  INFO 26290 --- [           main] o.s.c.d.a.test.NamedChannelTests         : Deploying stream 'HTTP-SOURCE-2' with properties: {app.*.spring.cloud.streamapp.security.enabled=false, app.*.logging.file=${PID}-test.log, app.*.endpoints.logfile.sensitive=false, app.*.management.endpoints.web.exposure.include=*}
13-Dec-2019 00:52:58 2019-12-13 00:52:58.554  INFO 26290 --- [           main] o.s.c.d.a.test.NamedChannelTests         : Checking: Stream=HTTP-SOURCE-2, status = deploying, status description = The stream is being deployed.
13-Dec-2019 00:52:58 2019-12-13 00:52:58.555  INFO 26290 --- [           main] o.s.c.d.a.test.NamedChannelTests         : Sleeping to check status of Stream=HTTP-SOURCE-2
13-Dec-2019 00:53:08 2019-12-13 00:53:08.602  INFO 26290 --- [           main] o.s.c.d.a.test.NamedChannelTests         : Checking: Stream=HTTP-SOURCE-2, status = deployed, status description = The stream has been successfully deployed
13-Dec-2019 00:53:08 2019-12-13 00:53:08.639  INFO 26290 --- [           main] o.s.c.d.a.test.NamedChannelTests         : Sleeping to check status of Stream=HTTP-SOURCE-2
13-Dec-2019 00:53:18 2019-12-13 00:53:18.639  INFO 26290 --- [           main] o.s.c.d.a.test.NamedChannelTests         : Stream 'HTTP-SOURCE-2' started with status: deployed
13-Dec-2019 00:53:18 2019-12-13 00:53:18.640  INFO 26290 --- [           main] o.s.c.d.a.test.NamedChannelTests         : App 'http' has instances: {HTTP-SOURCE-2.http-v1-0=http://10.194.6.131:22699}
13-Dec-2019 00:53:18 2019-12-13 00:53:18.640  INFO 26290 --- [           main] o.s.c.d.a.test.NamedChannelTests         : Looking for 'Started HttpSource' in logfile for http
13-Dec-2019 00:53:28 2019-12-13 00:53:28.640  INFO 26290 --- [           main] o.s.c.d.a.test.NamedChannelTests         : Requesting log for app HTTP-SOURCE-2.http-v1-0
13-Dec-2019 00:53:28 2019-12-13 00:53:28.915  INFO 26290 --- [           main] o.s.c.d.a.test.NamedChannelTests         : Retrieved logfile from 'http://10.194.6.131:22699/actuator/logfile
13-Dec-2019 00:53:28 2019-12-13 00:53:28.915  INFO 26290 --- [           main] o.s.c.d.a.test.NamedChannelTests         : Matched all 'Started HttpSource' in logfile for app http (source HTTP-SOURCE-2.http-v1-0)
13-Dec-2019 00:53:29 2019-12-13 00:53:29.128  INFO 26290 --- [           main] o.s.c.d.a.test.NamedChannelTests         : Looking for 'abcdefg' in logfile for log
13-Dec-2019 00:53:39 2019-12-13 00:53:39.128  INFO 26290 --- [           main] o.s.c.d.a.test.NamedChannelTests         : Requesting log for app MANY-TO-ONE.log-v1-0
13-Dec-2019 00:53:39 2019-12-13 00:53:39.137  INFO 26290 --- [           main] o.s.c.d.a.test.NamedChannelTests         : Retrieved logfile from 'http://10.194.6.131:27208/actuator/logfile
13-Dec-2019 00:53:39 2019-12-13 00:53:39.137  INFO 26290 --- [           main] o.s.c.d.a.test.NamedChannelTests         : Matched all 'abcdefg' in logfile for app log (source MANY-TO-ONE.log-v1-0)
13-Dec-2019 00:53:39 2019-12-13 00:53:39.286  INFO 26290 --- [           main] o.s.c.d.a.test.NamedChannelTests         : Looking for 'hijklmn' in logfile for log
13-Dec-2019 00:53:49 2019-12-13 00:53:49.286  INFO 26290 --- [           main] o.s.c.d.a.test.NamedChannelTests         : Requesting log for app MANY-TO-ONE.log-v1-0
13-Dec-2019 00:53:49 2019-12-13 00:53:49.293  INFO 26290 --- [           main] o.s.c.d.a.test.NamedChannelTests         : Retrieved logfile from 'http://10.194.6.131:27208/actuator/logfile
13-Dec-2019 00:53:49 2019-12-13 00:53:49.293  INFO 26290 --- [           main] o.s.c.d.a.test.NamedChannelTests         : Matched all 'hijklmn' in logfile for app log (source MANY-TO-ONE.log-v1-0)
13-Dec-2019 00:53:49 2019-12-13 00:53:49.294  INFO 26290 --- [           main] junit.logTestName                        : Test manyToOneTest(org.springframework.cloud.dataflow.acceptance.test.NamedChannelTests) Succeeded
13-Dec-2019 00:53:49 2019-12-13 00:53:49.294  INFO 26290 --- [           main] junit.logTestName                        : Finished Test manyToOneTest(org.springframework.cloud.dataflow.acceptance.test.NamedChannelTests)
13-Dec-2019 00:53:49 2019-12-13 00:53:49.294  INFO 26290 --- [           main] o.s.c.d.a.test.NamedChannelTests         : Destroy all streams
13-Dec-2019 00:53:49 Tests run: 4, Failures: 0, Errors: 0, Skipped: 1, Time elapsed: 277.563 sec - in org.springframework.cloud.dataflow.acceptance.test.NamedChannelTests
13-Dec-2019 00:53:49 Running org.springframework.cloud.dataflow.acceptance.test.util.PlatformHelperTests
13-Dec-2019 00:53:49 Tests run: 3, Failures: 0, Errors: 0, Skipped: 0, Time elapsed: 0.094 sec - in org.springframework.cloud.dataflow.acceptance.test.util.PlatformHelperTests
13-Dec-2019 00:53:49 Running org.springframework.cloud.dataflow.acceptance.test.util.ApplicationTests
13-Dec-2019 00:53:49 Tests run: 2, Failures: 0, Errors: 0, Skipped: 0, Time elapsed: 0.001 sec - in org.springframework.cloud.dataflow.acceptance.test.util.ApplicationTests
13-Dec-2019 00:53:49 2019-12-13 00:53:49.760  INFO 26290 --- [       Thread-6] o.s.c.support.GenericApplicationContext  : Closing org.springframework.context.support.GenericApplicationContext@1645f294: startup date [Fri Dec 13 00:35:22 UTC 2019]; root of context hierarchy
13-Dec-2019 00:53:49
13-Dec-2019 00:53:49 Results :
13-Dec-2019 00:53:49
13-Dec-2019 00:53:49 Failed tests:
13-Dec-2019 00:53:49   ComposedTaskTests.ctrLaunch:41->assertTaskExecutions:65 null
13-Dec-2019 00:53:49   ComposedTaskTests.ctrMultipleLaunch:47->assertTaskExecutions:65 null
13-Dec-2019 00:53:49   ComposedTaskTests.ctrMultipleLaunchWithArguments:57->assertTaskExecutions:65 null
13-Dec-2019 00:53:49
13-Dec-2019 00:53:49 Tests run: 22, Failures: 3, Errors: 0, Skipped: 4
13-Dec-2019 00:53:49
13-Dec-2019 00:53:49 [INFO] ------------------------------------------------------------------------
13-Dec-2019 00:53:49 [INFO] BUILD FAILURE
13-Dec-2019 00:53:49 [INFO] ------------------------------------------------------------------------
13-Dec-2019 00:53:49 [INFO] Total time: 21:17 min
13-Dec-2019 00:53:49 [INFO] Finished at: 2019-12-13T00:53:49+00:00
13-Dec-2019 00:53:49 [INFO] Final Memory: 51M/451M
13-Dec-2019 00:53:49 [INFO] ------------------------------------------------------------------------
13-Dec-2019 00:53:49 [ERROR] Failed to execute goal org.apache.maven.plugins:maven-surefire-plugin:2.18.1:test (default-test) on project spring-cloud-dataflow-acceptance-tests: There are test failures.
13-Dec-2019 00:53:49 [ERROR]
13-Dec-2019 00:53:49 [ERROR] Please refer to /opt/bamboo-home/xml-data/build-dir/SCDT-LOCAL20XSKIPPER20X-KAFKA/target/surefire-reports for the individual test results.
13-Dec-2019 00:53:49 [ERROR] -> [Help 1]
13-Dec-2019 00:53:49 [ERROR]
13-Dec-2019 00:53:49 [ERROR] To see the full stack trace of the errors, re-run Maven with the -e switch.
13-Dec-2019 00:53:49 [ERROR] Re-run Maven using the -X switch to enable full debug logging.
13-Dec-2019 00:53:49 [ERROR]
13-Dec-2019 00:53:49 [ERROR] For more information about the errors and possible solutions, please read the following articles:
13-Dec-2019 00:53:49 [ERROR] [Help 1] http://cwiki.apache.org/confluence/display/MAVEN/MojoFailureException
13-Dec-2019 00:53:50 Clean up, clean up, everybody everywhere; clean up clean up, everybody do your share!
13-Dec-2019 00:53:50 Clean up servers
13-Dec-2019 00:53:50 Killing process PID [26142]
13-Dec-2019 00:53:50 Killing process PID [26061]
13-Dec-2019 00:53:50 No stopped containers
13-Dec-2019 00:53:51 Stopping mysql_mysql_1 ...
13-Dec-2019 00:53:53
13-Dec-2019 00:53:53 Stopping mysql_mysql_1 ... done
13-Dec-2019 00:53:53 Removing mysql_mysql_1 ...
13-Dec-2019 00:53:53
13-Dec-2019 00:53:53 Removing mysql_mysql_1 ... done
13-Dec-2019 00:53:53 Going to remove mysql_mysql_1
13-Dec-2019 00:53:54 Stopping kafka_kafka_1     ...
13-Dec-2019 00:53:54 Stopping kafka_zookeeper_1 ...
13-Dec-2019 00:53:58
13-Dec-2019 00:53:58 Stopping kafka_kafka_1     ... done
13-Dec-2019 00:54:04
13-Dec-2019 00:54:04 Stopping kafka_zookeeper_1 ... done
13-Dec-2019 00:54:05 Removing kafka_kafka_1     ...
13-Dec-2019 00:54:05 Removing kafka_zookeeper_1 ...
13-Dec-2019 00:54:05
13-Dec-2019 00:54:05 Removing kafka_zookeeper_1 ... done
13-Dec-2019 00:54:05
13-Dec-2019 00:54:05 Removing kafka_kafka_1     ... done
13-Dec-2019 00:54:05 Going to remove kafka_kafka_1, kafka_zookeeper_1
13-Dec-2019 00:54:05
13-Dec-2019 00:54:05 Finished task 'Execute Acceptance Tests' with result: Success
13-Dec-2019 00:54:05 Starting task 'JUnit Parser' of type 'com.atlassian.bamboo.plugins.testresultparser:task.testresultparser.junit'
13-Dec-2019 00:54:05 Parsing test results under /opt/bamboo-home/xml-data/build-dir/SCDT-LOCAL20XSKIPPER20X-KAFKA...
13-Dec-2019 00:54:05 Failing task since 3 failing test cases were found.
13-Dec-2019 00:54:05 Finished task 'JUnit Parser' with result: Failed
13-Dec-2019 00:54:05 Starting task 'clean up' of type 'com.atlassian.bamboo.plugins.scripttask:task.builder.script'
13-Dec-2019 00:54:05
Beginning to execute external process for build 'Spring Cloud Data Flow Acceptance Tests - Local + SCDF-2.0.4.BS + Skipper 2.0.4.BS (12 am) - Run Data Flow Acceptance Tests for Kafka #195 (SCDT-LOCAL20XSKIPPER20X-KAFKA-195)'
... running command line:
/opt/bamboo-home/temp/SCDT-LOCAL20XSKIPPER20X-KAFKA-195-ScriptBuildTask-5930588062342544792.sh
... in: /opt/bamboo-home/xml-data/build-dir/SCDT-LOCAL20XSKIPPER20X-KAFKA
... using extra environment variables:
bamboo_planRepository_1_branch=master
bamboo_********_username_password=********
bamboo_signing_store_password=********
bamboo_capability_system_builder_ant_Ant_1_9=/opt/ant-1.9
bamboo_capability_system_builder_ant_Ant_1_8=/opt/ant-1.8
bamboo_planRepository_1_branchDisplayName=master
bamboo_repository_274694331_git_username=spring-buildmaster
bamboo_artifactory_override_resolve_repo=libs-milestone
bamboo_capability_system_builder_node_Node_js_10_16=/opt/node-10.16/bin/node
bamboo_repository_revision_number=de5f215a8ff95acbff6f531ccc41df40caef3fbd
bamboo_RIAK_BIN=/usr/sbin/riak
bamboo_buildKey=SCDT-LOCAL20XSKIPPER20X-KAFKA
bamboo_repository_274694331_branch_name=master
bamboo_ge_cache_username=ci
bamboo_bintray_password=********
bamboo_sonar_token_password=********
bamboo_shortJobName=Run Data Flow Acceptance Tests for Kafka
bamboo_artifactory_override_resolver_password=********
bamboo_sonatype_token=RSJChaox
bamboo_capability_system_builder_gradle___gradlew=./gradlew
bamboo_buildResultsUrl=https://build.spring.io/browse/SCDT-LOCAL20XSKIPPER20X-KAFKA-195
bamboo_capability_system_builder_mvn3_Maven_3_3=/opt/maven-3.3
bamboo_capability_system_builder_mvn3_Maven_3_2=/opt/maven-3.2
bamboo_capability_system_builder_mvn3_Maven_3_1=/opt/maven-3.1
bamboo_planRepository_repositoryUrl=https://github.com/spring-cloud/spring-cloud-dataflow-acceptance-tests.git
bamboo_capability_system_builder_mvn3_Maven_3_6=/opt/maven-3.6
bamboo_agentId=286195722
bamboo_capability_system_builder_mvn3_Maven_3_5=/opt/maven-3.5
bamboo_capability_system_builder_mvn3_Maven_3_0=/opt/maven-3.0
bamboo_planRepository_revision=de5f215a8ff95acbff6f531ccc41df40caef3fbd
bamboo_planRepository_previousRevision=ccc77f664d11e18a3b7f2fa17f012d09d08432a9
bamboo_capability_remote_build=true
bamboo_repository_branch_name=master
bamboo_sonatype_token_password=********
bamboo_sonatype_user=springsource
bamboo_repository_274694331_name=Git
bamboo_scdf_acceptance_tests_password=********
bamboo_APPLE_AC_PASSWORD=********
bamboo_repository_274694331_git_branch=master
bamboo_planRepository_branch=master
bamboo_capability_system_jdk_JDK_13=/opt/jdk-13
bamboo_planRepository_1_type=gitv2
bamboo_planRepository_branchName=master
bamboo_capability_system_jdk_JDK_12=/opt/jdk-12
bamboo_capability_system_builder_gradlew_gradlew=./
bamboo_capability_system_builder_ant_Ant_1_10=/opt/ant-1.10
bamboo_sonar_password=********
bamboo_hg_cache_directory=/opt/bamboo-home/xml-data/build-dir/_hg-repositories-cache
bamboo_planRepository_1_username=spring-buildmaster
bamboo_repository_274694331_git_repositoryUrl=https://github.com/spring-cloud/spring-cloud-dataflow-acceptance-tests.git
bamboo_planRepository_type=gitv2
bamboo_git_cache_directory=/opt/bamboo-home/xml-data/build-dir/_git-repositories-cache
bamboo_artifactory_username=buildmaster
bamboo_tmp_directory=/opt/bamboo-home/temp
bamboo_planKey=SCDT-LOCAL20XSKIPPER20X
bamboo_planRepository_username=spring-buildmaster
bamboo_JDK8_HOME=/opt/jdk-8
bamboo_repository_274694331_previous_revision_number=ccc77f664d11e18a3b7f2fa17f012d09d08432a9
bamboo_planRepository_1_branchName=master
bamboo_sonar_version=6.7.7
bamboo_sonar_jdbc_password=********
bamboo_bintray_api_key_password=********
bamboo_capability_system_jdk_JDK_1_11=/opt/jdk-11
bamboo_resultsUrl=https://build.spring.io/browse/SCDT-LOCAL20XSKIPPER20X-KAFKA-195
bamboo_APPLE_AC_USERNAME_PASSWORD=********
bamboo_capability_system_jdk_JDK_1_10=/opt/jdk-10
bamboo_build_working_directory=/opt/bamboo-home/xml-data/build-dir/SCDT-LOCAL20XSKIPPER20X-KAFKA
bamboo_planRepository_1_name=Git
bamboo_capability_system_os=ubuntu1804
bamboo_nexusPush_stagingProfile=buildmaster
bamboo_shortPlanName=Local + SCDF-2.0.4.BS + Skipper 2.0.4.BS (12 am)
bamboo_planRepository_name=Git
bamboo_buildNumber=195
bamboo_planName=Spring Cloud Data Flow Acceptance Tests - Local + SCDF-2.0.4.BS + Skipper 2.0.4.BS (12 am)
bamboo_JDK7_HOME=/opt/jdk-7
bamboo_build_commandline_com_atlassian_bamboo_plugins_scripttask_task_builder_script_7=/opt/bamboo-home/temp/SCDT-LOCAL20XSKIPPER20X-KAFKA-195-ScriptBuildTask-8121642362856737832.sh
bamboo_shortPlanKey=LOCAL20XSKIPPER20X
bamboo_shortJobKey=KAFKA
bamboo_artifactory_password=********
bamboo_buildTimeStamp=2019-12-13T00:00:56.786Z
bamboo_repository_previous_revision_number=ccc77f664d11e18a3b7f2fa17f012d09d08432a9
bamboo_sonar_username=buildmaster
bamboo_********_password=********
bamboo_repository_git_branch=master
bamboo_buildResultKey=SCDT-LOCAL20XSKIPPER20X-KAFKA-195
bamboo_nexusPush_close=true
bamboo_artifactory_override_resolver_username=buildmaster
bamboo_buildPlanName=Spring Cloud Data Flow Acceptance Tests - Local + SCDF-2.0.4.BS + Skipper 2.0.4.BS (12 am) - Run Data Flow Acceptance Tests for Kafka
bamboo_repository_274694331_revision_number=de5f215a8ff95acbff6f531ccc41df40caef3fbd
bamboo_planRepository_1_revision=de5f215a8ff95acbff6f531ccc41df40caef3fbd
bamboo_repository_name=Git
bamboo_signing_key_password=********
bamboo_capability_system_builder_groovy_Groovy_2_5=/opt/groovy-2.5
bamboo_buildFailed=true
bamboo_capability_system_docker_executable=/usr/bin/docker
bamboo_capability_system_jdk_OpenJDK_7=/opt/jdk-7
bamboo_capability_system_builder_groovy_Groovy_2_4=/opt/groovy-2.4
bamboo_artifactory_override_deployer_username=buildmaster
bamboo_capability_system_builder_command_Bash=/bin/bash
bamboo_jobFailed=true
bamboo_agentWorkingDirectory=/opt/bamboo-home/xml-data/build-dir
bamboo_capability_system_git_executable=/usr/bin/git
bamboo_repository_git_username=spring-buildmaster
bamboo_planRepository_1_previousRevision=ccc77f664d11e18a3b7f2fa17f012d09d08432a9
bamboo_capability_os_family=unix
bamboo_planRepository_branchDisplayName=master
bamboo_capability_system_builder_maven_Artifactory_Maven_3_6=/opt/maven-3.6
bamboo_capability_system_builder_maven_Artifactory_Maven_3_5=/opt/maven-3.5
bamboo_capability_system_builder_maven_Artifactory_Maven_3_3=/opt/maven-3.3
bamboo_capability_system_builder_maven_Artifactory_Maven_3_2=/opt/maven-3.2
bamboo_s3_properties=/home/bamboo/tools/s3.properties
bamboo_capability_system_builder_maven_Artifactory_Maven_3_1=/opt/maven-3.1
bamboo_artifactory_override_deploy_repo=libs-snapshot-local
bamboo_capability_system_builder_maven_Artifactory_Maven_3_0=/opt/maven-3.0
bamboo_plan_storageTag=plan-274497908
bamboo_bintray_username_password=********
bamboo_repository_git_repositoryUrl=https://github.com/spring-cloud/spring-cloud-dataflow-acceptance-tests.git
bamboo_working_directory=/opt/bamboo-home/xml-data/build-dir/SCDT-LOCAL20XSKIPPER20X-KAFKA
bamboo_planRepository_1_repositoryUrl=https://github.com/spring-cloud/spring-cloud-dataflow-acceptance-tests.git
bamboo_capability_system_jdk_JDK_1_8=/opt/jdk-8
bamboo_artifactory_override_deployer_password=********
bamboo_capability_system_jdk_JDK_1_9=/opt/jdk-9
bamboo_capability_system_jdk_JDK_1_6=/opt/jdk-6
bamboo_sonatype_password=********
bamboo_capability_system_jdk_JDK_1_7=/opt/jdk-7
bamboo_sonar_ip=10.194.6.9
bamboo_ge_cache_password=********
13-Dec-2019 00:54:05 CLEANING UP RESOURCES AFTER RUNNING TESTS
13-Dec-2019 00:54:05 Environment variable JAVA_HOME must be set
13-Dec-2019 00:54:05 FINISHED CLEANING UP RESOURCES
13-Dec-2019 00:54:05 Finished task 'clean up' with result: Success
13-Dec-2019 00:54:05 Running post build plugin 'Docker Container Cleanup'
13-Dec-2019 00:54:05 Running post build plugin 'NCover Results Collector'
13-Dec-2019 00:54:05 Running post build plugin 'Artifactory Release Management Staging'
13-Dec-2019 00:54:05 Running post build plugin 'Artifactory Build Info Copier'
13-Dec-2019 00:54:05 Running post build plugin 'Artifactory Gradle Properties Info Copier'
13-Dec-2019 00:54:05 Running post build plugin 'Clover Results Collector'
13-Dec-2019 00:54:05 Running post build plugin 'npm Cache Cleanup'
13-Dec-2019 00:54:05 Running post build plugin 'Artifact Copier'
13-Dec-2019 00:54:05 Publishing an artifact: App and Server Logs
13-Dec-2019 00:54:05 Finished publishing of artifact Non required job artifact: [App and Server Logs], pattern: [**/*.log] anchored at: [local] in 41.16 ms
13-Dec-2019 00:54:05 Publishing an artifact: Test Results
13-Dec-2019 00:54:05 Finished publishing of artifact Non required job artifact: [Test Results], pattern: [**/target/surefire-reports/**/*.*] in 38.98 ms
13-Dec-2019 00:54:05 Successfully removed working directory at '/opt/bamboo-home/xml-data/build-dir/SCDT-LOCAL20XSKIPPER20X-KAFKA'
13-Dec-2019 00:54:05 Finalising the build...
13-Dec-2019 00:54:05 Stopping timer.
13-Dec-2019 00:54:05 Build SCDT-LOCAL20XSKIPPER20X-KAFKA-195 completed.
13-Dec-2019 00:54:05 Running on server: post build plugin 'NCover Results Collector'
13-Dec-2019 00:54:05 Running on server: post build plugin 'Build Hanging Detection Configuration'
13-Dec-2019 00:54:05 Running on server: post build plugin 'Bamboo project link creator'
13-Dec-2019 00:54:05 Running on server: post build plugin 'Clover Delta Calculator'
13-Dec-2019 00:54:05 Running on server: post build plugin 'Maven Dependencies Postprocessor'
13-Dec-2019 00:54:05 All post build plugins have finished
13-Dec-2019 00:54:05 Generating build results summary...
13-Dec-2019 00:54:05 Saving build results to disk...
13-Dec-2019 00:54:05 Logging substituted variables...
13-Dec-2019 00:54:05 Indexing build results...
13-Dec-2019 00:54:05 Finished building SCDT-LOCAL20XSKIPPER20X-KAFKA-195.