Build: #196 failed

Job: Run Data Flow Acceptance Tests for Kafka failed

Stages & jobs

  1. Test Stage - Kafka

  2. Test Stage - Rabbit

Build log

The build generated 954 lines of output. Download or view full build log

14-Dec-2019 00:14:01 Build Spring Cloud Data Flow Acceptance Tests - Local + SCDF-2.0.4.BS + Skipper 2.0.4.BS (12 am) - Run Data Flow Acceptance Tests for Kafka #196 (SCDT-LOCAL20XSKIPPER20X-KAFKA-196) started building on agent bamboo-19.af.pivotal.io
14-Dec-2019 00:14:01 Remote agent on host bamboo-19.af.pivotal.io
14-Dec-2019 00:14:01 Build working directory is /opt/bamboo-home/xml-data/build-dir/SCDT-LOCAL20XSKIPPER20X-KAFKA
14-Dec-2019 00:14:01 Executing build Spring Cloud Data Flow Acceptance Tests - Local + SCDF-2.0.4.BS + Skipper 2.0.4.BS (12 am) - Run Data Flow Acceptance Tests for Kafka #196 (SCDT-LOCAL20XSKIPPER20X-KAFKA-196)
14-Dec-2019 00:14:01 Starting task 'Checkout Default Repository' of type 'com.atlassian.bamboo.plugins.vcs:task.vcs.checkout'
14-Dec-2019 00:14:01 Checking out into /opt/bamboo-home/xml-data/build-dir/SCDT-LOCAL20XSKIPPER20X-KAFKA
14-Dec-2019 00:14:01 Updating source code to revision: de5f215a8ff95acbff6f531ccc41df40caef3fbd
14-Dec-2019 00:14:01 Creating local git repository in '/opt/bamboo-home/xml-data/build-dir/SCDT-LOCAL20XSKIPPER20X-KAFKA/.git'.
14-Dec-2019 00:14:01 Initialized empty Git repository in /opt/bamboo-home/xml-data/build-dir/SCDT-LOCAL20XSKIPPER20X-KAFKA/.git/
14-Dec-2019 00:14:02 Fetching 'refs/heads/master' from 'https://github.com/spring-cloud/spring-cloud-dataflow-acceptance-tests.git'.
14-Dec-2019 00:14:05 From https://github.com/spring-cloud/spring-cloud-dataflow-acceptance-tests
14-Dec-2019 00:14:05 * [new branch]      master     -> master
14-Dec-2019 00:14:05 Checking out revision de5f215a8ff95acbff6f531ccc41df40caef3fbd.
14-Dec-2019 00:14:05 Already on 'master'
14-Dec-2019 00:14:05 Updated source code to revision: de5f215a8ff95acbff6f531ccc41df40caef3fbd
14-Dec-2019 00:14:05 Finished task 'Checkout Default Repository' with result: Success
14-Dec-2019 00:14:05 Running pre-build action: Artifactory Release Staging
14-Dec-2019 00:14:05 Running pre-build action: VCS Version Collector
14-Dec-2019 00:14:05 Starting task 'Execute Acceptance Tests' of type 'com.atlassian.bamboo.plugins.scripttask:task.builder.script'
14-Dec-2019 00:14:05
Beginning to execute external process for build 'Spring Cloud Data Flow Acceptance Tests - Local + SCDF-2.0.4.BS + Skipper 2.0.4.BS (12 am) - Run Data Flow Acceptance Tests for Kafka #196 (SCDT-LOCAL20XSKIPPER20X-KAFKA-196)'
... running command line:
/opt/bamboo-home/temp/SCDT-LOCAL20XSKIPPER20X-KAFKA-196-ScriptBuildTask-4054678740919750921.sh
... in: /opt/bamboo-home/xml-data/build-dir/SCDT-LOCAL20XSKIPPER20X-KAFKA
... using extra environment variables:
bamboo_planRepository_1_branch=master
bamboo_********_username_password=********
bamboo_signing_store_password=********
bamboo_capability_system_builder_ant_Ant_1_9=/opt/ant-1.9
bamboo_capability_system_builder_ant_Ant_1_8=/opt/ant-1.8
bamboo_planRepository_1_branchDisplayName=master
bamboo_repository_274694331_git_username=spring-buildmaster
bamboo_artifactory_override_resolve_repo=libs-milestone
bamboo_capability_system_builder_node_Node_js_10_16=/opt/node-10.16/bin/node
bamboo_repository_revision_number=de5f215a8ff95acbff6f531ccc41df40caef3fbd
bamboo_RIAK_BIN=/usr/sbin/riak
bamboo_buildKey=SCDT-LOCAL20XSKIPPER20X-KAFKA
bamboo_repository_274694331_branch_name=master
bamboo_ge_cache_username=ci
bamboo_bintray_password=********
bamboo_sonar_token_password=********
bamboo_shortJobName=Run Data Flow Acceptance Tests for Kafka
bamboo_artifactory_override_resolver_password=********
bamboo_sonatype_token=RSJChaox
bamboo_capability_system_builder_gradle___gradlew=./gradlew
bamboo_buildResultsUrl=https://build.spring.io/browse/SCDT-LOCAL20XSKIPPER20X-KAFKA-196
bamboo_capability_system_builder_mvn3_Maven_3_3=/opt/maven-3.3
bamboo_capability_system_builder_mvn3_Maven_3_2=/opt/maven-3.2
bamboo_capability_system_builder_mvn3_Maven_3_1=/opt/maven-3.1
bamboo_planRepository_repositoryUrl=https://github.com/spring-cloud/spring-cloud-dataflow-acceptance-tests.git
bamboo_capability_system_builder_mvn3_Maven_3_6=/opt/maven-3.6
bamboo_agentId=286195715
bamboo_capability_system_builder_mvn3_Maven_3_5=/opt/maven-3.5
bamboo_capability_system_builder_mvn3_Maven_3_0=/opt/maven-3.0
bamboo_planRepository_revision=de5f215a8ff95acbff6f531ccc41df40caef3fbd
bamboo_planRepository_previousRevision=de5f215a8ff95acbff6f531ccc41df40caef3fbd
bamboo_capability_remote_build=true
bamboo_repository_branch_name=master
bamboo_sonatype_token_password=********
bamboo_sonatype_user=springsource
bamboo_repository_274694331_name=Git
bamboo_scdf_acceptance_tests_password=********
bamboo_APPLE_AC_PASSWORD=********
JAVA_HOME=/opt/jdk-8
bamboo_repository_274694331_git_branch=master
bamboo_planRepository_branch=master
bamboo_capability_system_jdk_JDK_13=/opt/jdk-13
bamboo_planRepository_1_type=gitv2
bamboo_planRepository_branchName=master
bamboo_capability_system_jdk_JDK_12=/opt/jdk-12
bamboo_capability_system_builder_gradlew_gradlew=./
bamboo_capability_system_builder_ant_Ant_1_10=/opt/ant-1.10
bamboo_sonar_password=********
bamboo_hg_cache_directory=/opt/bamboo-home/xml-data/build-dir/_hg-repositories-cache
bamboo_planRepository_1_username=spring-buildmaster
bamboo_repository_274694331_git_repositoryUrl=https://github.com/spring-cloud/spring-cloud-dataflow-acceptance-tests.git
bamboo_planRepository_type=gitv2
bamboo_git_cache_directory=/opt/bamboo-home/xml-data/build-dir/_git-repositories-cache
bamboo_artifactory_username=buildmaster
bamboo_tmp_directory=/opt/bamboo-home/temp
bamboo_planKey=SCDT-LOCAL20XSKIPPER20X
bamboo_planRepository_username=spring-buildmaster
bamboo_JDK8_HOME=/opt/jdk-8
bamboo_repository_274694331_previous_revision_number=de5f215a8ff95acbff6f531ccc41df40caef3fbd
bamboo_planRepository_1_branchName=master
bamboo_sonar_version=6.7.7
bamboo_sonar_jdbc_password=********
bamboo_bintray_api_key_password=********
bamboo_capability_system_jdk_JDK_1_11=/opt/jdk-11
bamboo_resultsUrl=https://build.spring.io/browse/SCDT-LOCAL20XSKIPPER20X-KAFKA-196
bamboo_APPLE_AC_USERNAME_PASSWORD=********
bamboo_capability_system_jdk_JDK_1_10=/opt/jdk-10
bamboo_build_working_directory=/opt/bamboo-home/xml-data/build-dir/SCDT-LOCAL20XSKIPPER20X-KAFKA
bamboo_planRepository_1_name=Git
bamboo_capability_system_os=ubuntu1804
bamboo_nexusPush_stagingProfile=buildmaster
bamboo_shortPlanName=Local + SCDF-2.0.4.BS + Skipper 2.0.4.BS (12 am)
bamboo_planRepository_name=Git
bamboo_buildNumber=196
bamboo_planName=Spring Cloud Data Flow Acceptance Tests - Local + SCDF-2.0.4.BS + Skipper 2.0.4.BS (12 am)
bamboo_JDK7_HOME=/opt/jdk-7
bamboo_shortPlanKey=LOCAL20XSKIPPER20X
bamboo_shortJobKey=KAFKA
bamboo_artifactory_password=********
bamboo_buildTimeStamp=2019-12-14T00:00:11.829Z
bamboo_repository_previous_revision_number=de5f215a8ff95acbff6f531ccc41df40caef3fbd
bamboo_sonar_username=buildmaster
bamboo_********_password=********
bamboo_repository_git_branch=master
bamboo_buildResultKey=SCDT-LOCAL20XSKIPPER20X-KAFKA-196
bamboo_nexusPush_close=true
bamboo_artifactory_override_resolver_username=buildmaster
bamboo_buildPlanName=Spring Cloud Data Flow Acceptance Tests - Local + SCDF-2.0.4.BS + Skipper 2.0.4.BS (12 am) - Run Data Flow Acceptance Tests for Kafka
bamboo_repository_274694331_revision_number=de5f215a8ff95acbff6f531ccc41df40caef3fbd
bamboo_planRepository_1_revision=de5f215a8ff95acbff6f531ccc41df40caef3fbd
bamboo_repository_name=Git
bamboo_signing_key_password=********
bamboo_capability_system_builder_groovy_Groovy_2_5=/opt/groovy-2.5
bamboo_buildFailed=false
bamboo_capability_system_docker_executable=/usr/bin/docker
bamboo_capability_system_jdk_OpenJDK_7=/opt/jdk-7
bamboo_capability_system_builder_groovy_Groovy_2_4=/opt/groovy-2.4
bamboo_artifactory_override_deployer_username=buildmaster
bamboo_capability_system_builder_command_Bash=/bin/bash
bamboo_agentWorkingDirectory=/opt/bamboo-home/xml-data/build-dir
bamboo_capability_system_git_executable=/usr/bin/git
bamboo_repository_git_username=spring-buildmaster
bamboo_planRepository_1_previousRevision=de5f215a8ff95acbff6f531ccc41df40caef3fbd
bamboo_capability_os_family=unix
bamboo_planRepository_branchDisplayName=master
bamboo_capability_system_builder_maven_Artifactory_Maven_3_6=/opt/maven-3.6
bamboo_capability_system_builder_maven_Artifactory_Maven_3_5=/opt/maven-3.5
bamboo_capability_system_builder_maven_Artifactory_Maven_3_3=/opt/maven-3.3
bamboo_capability_system_builder_maven_Artifactory_Maven_3_2=/opt/maven-3.2
bamboo_s3_properties=/home/bamboo/tools/s3.properties
bamboo_capability_system_builder_maven_Artifactory_Maven_3_1=/opt/maven-3.1
bamboo_artifactory_override_deploy_repo=libs-snapshot-local
bamboo_capability_system_builder_maven_Artifactory_Maven_3_0=/opt/maven-3.0
bamboo_plan_storageTag=plan-274497908
bamboo_bintray_username_password=********
bamboo_repository_git_repositoryUrl=https://github.com/spring-cloud/spring-cloud-dataflow-acceptance-tests.git
bamboo_working_directory=/opt/bamboo-home/xml-data/build-dir/SCDT-LOCAL20XSKIPPER20X-KAFKA
bamboo_planRepository_1_repositoryUrl=https://github.com/spring-cloud/spring-cloud-dataflow-acceptance-tests.git
bamboo_capability_system_jdk_JDK_1_8=/opt/jdk-8
bamboo_artifactory_override_deployer_password=********
bamboo_capability_system_jdk_JDK_1_9=/opt/jdk-9
bamboo_capability_system_jdk_JDK_1_6=/opt/jdk-6
bamboo_sonatype_password=********
bamboo_capability_system_jdk_JDK_1_7=/opt/jdk-7
bamboo_sonar_ip=10.194.6.9
bamboo_ge_cache_password=********
14-Dec-2019 00:14:05 CLEANING UP RESOURCES BEFORE TESTS
14-Dec-2019 00:14:05 Setting the environment variables
14-Dec-2019 00:14:05 Export the unset env. variables from /opt/bamboo-home/xml-data/build-dir/SCDT-LOCAL20XSKIPPER20X-KAFKA/local/init/env.properties :
14-Dec-2019 00:14:05    SPRING_CLOUD_DATAFLOW_SERVER_DOWNLOAD_URL = https://repo.spring.io/libs-snapshot/org/springframework/cloud/spring-cloud-dataflow-server-local//spring-cloud-dataflow-server-local-.jar
14-Dec-2019 00:14:05    SPRING_CLOUD_SKIPPER_SERVER_DOWNLOAD_URL = https://repo.spring.io/libs-snapshot/org/springframework/cloud/spring-cloud-skipper-server//spring-cloud-skipper-server-.jar
14-Dec-2019 00:14:05    SPRING_DATASOURCE_USERNAME = spring
14-Dec-2019 00:14:05    SPRING_DATASOURCE_PASSWORD = cloud
14-Dec-2019 00:14:05    SPRING_SCHEMA_NAME = dataflow
14-Dec-2019 00:14:05    DOCKER_SERVER = localhost
14-Dec-2019 00:14:05 Setting retries to 60 and WAIT_TIME to 5
14-Dec-2019 00:14:05 Export the unset env. variables from /opt/bamboo-home/xml-data/build-dir/SCDT-LOCAL20XSKIPPER20X-KAFKA/local/binder/rabbit/env.properties :
14-Dec-2019 00:14:05    STREAM_REGISTRATION_RESOURCE = https://dataflow.spring.io/latest-stream-applications-rabbit-maven
14-Dec-2019 00:14:05    TASK_REGISTRATION_RESOURCE = https://dataflow.spring.io/latest-task-applications-maven
14-Dec-2019 00:14:05 SCDF SERVER URI: http://localhost:9393
14-Dec-2019 00:14:05 Clean up, clean up, everybody everywhere; clean up clean up, everybody do your share!
14-Dec-2019 00:14:05 Clean up servers
14-Dec-2019 00:14:06 No stopped containers
14-Dec-2019 00:14:06 No stopped containers
14-Dec-2019 00:14:07 No stopped containers
14-Dec-2019 00:14:07 FINISHED CLEANING UP RESOURCES
14-Dec-2019 00:14:07 Setting the environment variables
14-Dec-2019 00:14:07 Export the unset env. variables from /opt/bamboo-home/xml-data/build-dir/SCDT-LOCAL20XSKIPPER20X-KAFKA/local/init/env.properties :
14-Dec-2019 00:14:07    SPRING_CLOUD_DATAFLOW_SERVER_DOWNLOAD_URL = https://repo.spring.io/libs-snapshot/org/springframework/cloud/spring-cloud-dataflow-server/2.0.4.BUILD-SNAPSHOT/spring-cloud-dataflow-server-2.0.4.BUILD-SNAPSHOT.jar
14-Dec-2019 00:14:07    SPRING_CLOUD_SKIPPER_SERVER_DOWNLOAD_URL = https://repo.spring.io/libs-snapshot/org/springframework/cloud/spring-cloud-skipper-server/2.0.4.BUILD-SNAPSHOT/spring-cloud-skipper-server-2.0.4.BUILD-SNAPSHOT.jar
14-Dec-2019 00:14:07    SPRING_DATASOURCE_USERNAME = spring
14-Dec-2019 00:14:07    SPRING_DATASOURCE_PASSWORD = cloud
14-Dec-2019 00:14:07    SPRING_SCHEMA_NAME = dataflow
14-Dec-2019 00:14:07    DOCKER_SERVER = localhost
14-Dec-2019 00:14:07 Setting retries to 60 and WAIT_TIME to 5
14-Dec-2019 00:14:07 cleaning up any previous mysql docker containers...
14-Dec-2019 00:14:08 done cleaning up.
14-Dec-2019 00:14:08 Could not find a local mysql server, trying docker.
14-Dec-2019 00:14:08 Pulling mysql (mysql:5.7)...
14-Dec-2019 00:14:09 5.7: Pulling from library/mysql
14-Dec-2019 00:14:17 Digest: sha256:5779c71a4730da36f013a23a437b5831198e68e634575f487d37a0639470e3a8
14-Dec-2019 00:14:17 Status: Downloaded newer image for mysql:5.7
14-Dec-2019 00:14:17 Creating mysql_mysql_1 ...
14-Dec-2019 00:14:18
14-Dec-2019 00:14:18 Creating mysql_mysql_1 ... done
14-Dec-2019 00:14:19 mysql running on localhost:3306
14-Dec-2019 00:14:19 Service host is localhost
14-Dec-2019 00:14:19 Creating kafka compose file on /opt/bamboo-home/xml-data/build-dir/SCDT-LOCAL20XSKIPPER20X-KAFKA/local/binder/kafka/docker-compose.yml
14-Dec-2019 00:14:19 cleaning up any previous kafka docker containers...
14-Dec-2019 00:14:19 done cleaning up
14-Dec-2019 00:14:19 Could not find a local kafka server, trying docker.
14-Dec-2019 00:14:19 Pulling zookeeper (wurstmeister/zookeeper:)...
14-Dec-2019 00:14:20 latest: Pulling from wurstmeister/zookeeper
14-Dec-2019 00:14:33 Digest: sha256:7a7fd44a72104bfbd24a77844bad5fabc86485b036f988ea927d1780782a6680
14-Dec-2019 00:14:33 Status: Downloaded newer image for wurstmeister/zookeeper:latest
14-Dec-2019 00:14:33 Pulling kafka (wurstmeister/kafka:2.11-0.11.0.3)...
14-Dec-2019 00:14:34 2.11-0.11.0.3: Pulling from wurstmeister/kafka
14-Dec-2019 00:14:42 Digest: sha256:04df57268bb64654df6487b3f345748fd8412a9c01953a4c1d15c2e41d413113
14-Dec-2019 00:14:42 Status: Downloaded newer image for wurstmeister/kafka:2.11-0.11.0.3
14-Dec-2019 00:14:42 Creating kafka_kafka_1 ...
14-Dec-2019 00:14:42 Creating kafka_zookeeper_1 ...
14-Dec-2019 00:14:45
14-Dec-2019 00:14:45 Creating kafka_kafka_1     ... done
14-Dec-2019 00:14:46
14-Dec-2019 00:14:46 Creating kafka_zookeeper_1 ... done
14-Dec-2019 00:14:46 kafka running on localhost:9092
14-Dec-2019 00:14:46 Export the unset env. variables from /opt/bamboo-home/xml-data/build-dir/SCDT-LOCAL20XSKIPPER20X-KAFKA/local/binder/kafka/env.properties :
14-Dec-2019 00:14:46    STREAM_REGISTRATION_RESOURCE = https://dataflow.spring.io/latest-stream-applications-kafka-maven
14-Dec-2019 00:14:46    TASK_REGISTRATION_RESOURCE = https://dataflow.spring.io/latest-task-applications-maven
14-Dec-2019 00:14:46 cleaning up any previous redis docker containers...
14-Dec-2019 00:14:46 done cleaning up.
14-Dec-2019 00:14:47 redis found on localhost
14-Dec-2019 00:14:47 SKIPPER SERVER URI: http://localhost:7577
14-Dec-2019 00:14:47 Downloading server from https://repo.spring.io/libs-snapshot/org/springframework/cloud/spring-cloud-skipper-server/2.0.4.BUILD-SNAPSHOT/spring-cloud-skipper-server-2.0.4.BUILD-SNAPSHOT.jar
14-Dec-2019 00:14:50 2019-12-14 00:14:50 URL:https://repo.spring.io/libs-snapshot/org/springframework/cloud/spring-cloud-skipper-server/2.0.4.BUILD-SNAPSHOT/spring-cloud-skipper-server-2.0.4.BUILD-SNAPSHOT.jar [84387317/84387317] -> "/opt/bamboo-home/xml-data/build-dir/SCDT-LOCAL20XSKIPPER20X-KAFKA/local/skipper-server/skipper-server.jar" [1]
14-Dec-2019 00:14:50 executing [nohup /opt/jdk-8/bin/java  -Dlogging.level.org.springframework.cloud.deployer.spi.local.LocalAppDeployer=DEBUG -Xmx1024m -Xss1024k -jar /opt/bamboo-home/xml-data/build-dir/SCDT-LOCAL20XSKIPPER20X-KAFKA/local/skipper-server/skipper-server.jar  --spring.datasource.driver-class-name=org.mariadb.jdbc.Driver --spring.datasource.url=jdbc:mysql://localhost/dataflow --spring.datasource.username=spring --spring.datasource.password=cloud  --spring.cloud.dataflow.applicationProperties.stream.spring.cloud.stream.kafka.binder.brokers=localhost --spring.cloud.dataflow.applicationProperties.stream.spring.cloud.stream.kafka.binder.zkNodes=localhost  --spring.redis.host=127.0.0.1 --spring.cloud.skipper.server.platform.local.accounts.default.workingDirectoriesRoot=/opt/bamboo-home/xml-data/build-dir/SCDT-LOCAL20XSKIPPER20X-KAFKA/local/skipper-server/app-logs > /opt/bamboo-home/xml-data/build-dir/SCDT-LOCAL20XSKIPPER20X-KAFKA/local/skipper-server/skipper-server.log &]
14-Dec-2019 00:14:50 [/opt/bamboo-home/xml-data/build-dir/SCDT-LOCAL20XSKIPPER20X-KAFKA/local/skipper-server] process pid is [9300]
14-Dec-2019 00:14:50 System props are []
14-Dec-2019 00:14:50 Logs are under [/opt/bamboo-home/xml-data/build-dir/SCDT-LOCAL20XSKIPPER20X-KAFKA/local/skipper-server/skipper-server.log] or from nohup [/opt/bamboo-home/xml-data/build-dir/SCDT-LOCAL20XSKIPPER20X-KAFKA/local/skipper-server/nohup.log]
14-Dec-2019 00:14:50 Failed to connect to localhost:7577. Attempt  #1/60... will try again in [5] seconds
14-Dec-2019 00:14:55 Failed to connect to localhost:7577. Attempt  #2/60... will try again in [5] seconds
14-Dec-2019 00:15:00 Failed to connect to localhost:7577. Attempt  #3/60... will try again in [5] seconds
14-Dec-2019 00:15:05 Failed to connect to localhost:7577. Attempt  #4/60... will try again in [5] seconds
14-Dec-2019 00:15:11 SCDF SERVER URI: http://localhost:9393
14-Dec-2019 00:15:11 Downloading server from https://repo.spring.io/libs-snapshot/org/springframework/cloud/spring-cloud-dataflow-server/2.0.4.BUILD-SNAPSHOT/spring-cloud-dataflow-server-2.0.4.BUILD-SNAPSHOT.jar
14-Dec-2019 00:15:15 2019-12-14 00:15:15 URL:https://repo.spring.io/libs-snapshot/org/springframework/cloud/spring-cloud-dataflow-server/2.0.4.BUILD-SNAPSHOT/spring-cloud-dataflow-server-2.0.4.BUILD-SNAPSHOT.jar [87897631/87897631] -> "/opt/bamboo-home/xml-data/build-dir/SCDT-LOCAL20XSKIPPER20X-KAFKA/local/server/scdf-server.jar" [1]
14-Dec-2019 00:15:15 SPRING_PROFILES_ACTIVE []
14-Dec-2019 00:15:15 executing [nohup /opt/jdk-8/bin/java  -Xmx1024m -Xss1024k -jar /opt/bamboo-home/xml-data/build-dir/SCDT-LOCAL20XSKIPPER20X-KAFKA/local/server/scdf-server.jar  --spring.datasource.driver-class-name=org.mariadb.jdbc.Driver --spring.datasource.url=jdbc:mysql://localhost/dataflow --spring.datasource.username=spring --spring.datasource.password=cloud  --spring.cloud.dataflow.applicationProperties.stream.spring.cloud.stream.kafka.binder.brokers=localhost --spring.cloud.dataflow.applicationProperties.stream.spring.cloud.stream.kafka.binder.zkNodes=localhost  --spring.redis.host=127.0.0.1 --spring.cloud.skipper.server.platform.local.accounts.default.workingDirectoriesRoot=/opt/bamboo-home/xml-data/build-dir/SCDT-LOCAL20XSKIPPER20X-KAFKA/local/skipper-server/app-logs --spring.cloud.dataflow.features.skipper-enabled=true > /opt/bamboo-home/xml-data/build-dir/SCDT-LOCAL20XSKIPPER20X-KAFKA/local/server/scdf-server.log &]
14-Dec-2019 00:15:15 [/opt/bamboo-home/xml-data/build-dir/SCDT-LOCAL20XSKIPPER20X-KAFKA/local/server] process pid is [9418]
14-Dec-2019 00:15:15 System props are []
14-Dec-2019 00:15:15 Logs are under [/opt/bamboo-home/xml-data/build-dir/SCDT-LOCAL20XSKIPPER20X-KAFKA/local/server/scdf-server.log] or from nohup [/opt/bamboo-home/xml-data/build-dir/SCDT-LOCAL20XSKIPPER20X-KAFKA/local/server/nohup.log]
14-Dec-2019 00:15:15 Failed to connect to localhost:9393. Attempt  #1/60... will try again in [5] seconds
14-Dec-2019 00:15:20 Failed to connect to localhost:9393. Attempt  #2/60... will try again in [5] seconds
14-Dec-2019 00:15:25 Failed to connect to localhost:9393. Attempt  #3/60... will try again in [5] seconds
14-Dec-2019 00:15:31 SCDF SERVER ABOUT:
14-Dec-2019 00:15:31 --2019-12-14 00:15:31--  http://localhost:9393/about
14-Dec-2019 00:15:31 Resolving localhost (localhost)... ::1, 127.0.0.1
14-Dec-2019 00:15:31 Connecting to localhost (localhost)|::1|:9393... connected.
14-Dec-2019 00:15:31 HTTP request sent, awaiting response... 200
14-Dec-2019 00:15:31 Length: unspecified [application/hal+json]
14-Dec-2019 00:15:31 Saving to: ‘STDOUT’
14-Dec-2019 00:15:31
14-Dec-2019 00:15:31      0K .                                                       171M=0s
14-Dec-2019 00:15:31
14-Dec-2019 00:15:31 2019-12-14 00:15:31 (171 MB/s) - written to stdout [1681]
14-Dec-2019 00:15:31
14-Dec-2019 00:15:31 {
14-Dec-2019 00:15:31     "_links": {
14-Dec-2019 00:15:31         "self": {
14-Dec-2019 00:15:31             "href": "http://localhost:9393/about"
14-Dec-2019 00:15:31         }
14-Dec-2019 00:15:31     },
14-Dec-2019 00:15:31     "featureInfo": {
14-Dec-2019 00:15:31         "analyticsEnabled": true,
14-Dec-2019 00:15:31         "grafanaEnabled": false,
14-Dec-2019 00:15:31         "schedulesEnabled": false,
14-Dec-2019 00:15:31         "streamsEnabled": true,
14-Dec-2019 00:15:31         "tasksEnabled": true
14-Dec-2019 00:15:31     },
14-Dec-2019 00:15:31     "grafanaInfo": {
14-Dec-2019 00:15:31         "refreshInterval": 15,
14-Dec-2019 00:15:31         "url": ""
14-Dec-2019 00:15:31     },
14-Dec-2019 00:15:31     "runtimeEnvironment": {
14-Dec-2019 00:15:31         "appDeployer": {
14-Dec-2019 00:15:31             "deployerImplementationVersion": "2.0.4.BUILD-SNAPSHOT",
14-Dec-2019 00:15:31             "deployerName": "Spring Cloud Skipper Server",
14-Dec-2019 00:15:31             "deployerSpiVersion": "2.0.3.RELEASE",
14-Dec-2019 00:15:31             "javaVersion": "1.8.0_232",
14-Dec-2019 00:15:31             "platformApiVersion": "",
14-Dec-2019 00:15:31             "platformClientVersion": "",
14-Dec-2019 00:15:31             "platformHostVersion": "",
14-Dec-2019 00:15:31             "platformSpecificInfo": {
14-Dec-2019 00:15:31                 "default": "local"
14-Dec-2019 00:15:31             },
14-Dec-2019 00:15:31             "platformType": "Skipper Managed",
14-Dec-2019 00:15:31             "springBootVersion": "2.1.3.RELEASE",
14-Dec-2019 00:15:31             "springVersion": "5.1.5.RELEASE"
14-Dec-2019 00:15:31         },
14-Dec-2019 00:15:31         "taskLaunchers": [
14-Dec-2019 00:15:31             {
14-Dec-2019 00:15:31                 "deployerImplementationVersion": "2.0.3.RELEASE",
14-Dec-2019 00:15:31                 "deployerName": "LocalTaskLauncher",
14-Dec-2019 00:15:31                 "deployerSpiVersion": "2.0.2.RELEASE",
14-Dec-2019 00:15:31                 "javaVersion": "1.8.0_232",
14-Dec-2019 00:15:31                 "platformApiVersion": "Linux 4.15.0-66-generic",
14-Dec-2019 00:15:31                 "platformClientVersion": "4.15.0-66-generic",
14-Dec-2019 00:15:31                 "platformHostVersion": "4.15.0-66-generic",
14-Dec-2019 00:15:31                 "platformSpecificInfo": {},
14-Dec-2019 00:15:31                 "platformType": "Local",
14-Dec-2019 00:15:31                 "springBootVersion": "2.1.3.RELEASE",
14-Dec-2019 00:15:31                 "springVersion": "5.1.5.RELEASE"
14-Dec-2019 00:15:31             }
14-Dec-2019 00:15:31         ]
14-Dec-2019 00:15:31     },
14-Dec-2019 00:15:31     "securityInfo": {
14-Dec-2019 00:15:31         "authenticated": false,
14-Dec-2019 00:15:31         "authenticationEnabled": false,
14-Dec-2019 00:15:31         "roles": [],
14-Dec-2019 00:15:31         "username": null
14-Dec-2019 00:15:31     },
14-Dec-2019 00:15:31     "versionInfo": {
14-Dec-2019 00:15:31         "core": {
14-Dec-2019 00:15:31             "name": "Spring Cloud Data Flow Core",
14-Dec-2019 00:15:31             "version": "2.0.4.BUILD-SNAPSHOT"
14-Dec-2019 00:15:31         },
14-Dec-2019 00:15:31         "dashboard": {
14-Dec-2019 00:15:31             "name": "Spring Cloud Dataflow UI",
14-Dec-2019 00:15:31             "version": "2.0.3.RELEASE"
14-Dec-2019 00:15:31         },
14-Dec-2019 00:15:31         "implementation": {
14-Dec-2019 00:15:31             "name": "spring-cloud-dataflow-server",
14-Dec-2019 00:15:31             "version": "2.0.4.BUILD-SNAPSHOT"
14-Dec-2019 00:15:31         },
14-Dec-2019 00:15:31         "shell": {
14-Dec-2019 00:15:31             "name": "Spring Cloud Data Flow Shell",
14-Dec-2019 00:15:31             "url": "https://repo.spring.io/libs-snapshot/org/springframework/cloud/spring-cloud-dataflow-shell/2.0.4.BUILD-SNAPSHOT/spring-cloud-dataflow-shell-2.0.4.BUILD-SNAPSHOT.jar",
14-Dec-2019 00:15:31             "version": "2.0.4.BUILD-SNAPSHOT"
14-Dec-2019 00:15:31         }
14-Dec-2019 00:15:31     }
14-Dec-2019 00:15:31 }
14-Dec-2019 00:15:31 SKIPPER SERVER ABOUT:
14-Dec-2019 00:15:31 --2019-12-14 00:15:31--  http://localhost:7577/api/about
14-Dec-2019 00:15:31 Resolving localhost (localhost)... ::1, 127.0.0.1
14-Dec-2019 00:15:31 Connecting to localhost (localhost)|::1|:7577... connected.
14-Dec-2019 00:15:31 HTTP request sent, awaiting response... 200
14-Dec-2019 00:15:31 Length: unspecified [application/hal+json]
14-Dec-2019 00:15:31 Saving to: ‘STDOUT’
14-Dec-2019 00:15:31
14-Dec-2019 00:15:31      0K                                                        39.8M=0s
14-Dec-2019 00:15:31
14-Dec-2019 00:15:31 2019-12-14 00:15:31 (39.8 MB/s) - written to stdout [426]
14-Dec-2019 00:15:31
14-Dec-2019 00:15:31 {
14-Dec-2019 00:15:31     "versionInfo": {
14-Dec-2019 00:15:31         "server": {
14-Dec-2019 00:15:31             "name": "Spring Cloud Skipper Server",
14-Dec-2019 00:15:31             "version": "2.0.4.BUILD-SNAPSHOT"
14-Dec-2019 00:15:31         },
14-Dec-2019 00:15:31         "shell": {
14-Dec-2019 00:15:31             "name": "Spring Cloud Skipper Shell",
14-Dec-2019 00:15:31             "url": "https://repo.spring.io/libs-snapshot/org/springframework/cloud/spring-cloud-skipper-shell/2.0.4.BUILD-SNAPSHOT/spring-cloud-skipper-shell-2.0.4.BUILD-SNAPSHOT.jar",
14-Dec-2019 00:15:31             "version": "2.0.4.BUILD-SNAPSHOT"
14-Dec-2019 00:15:31         }
14-Dec-2019 00:15:31     }
14-Dec-2019 00:15:31 }
14-Dec-2019 00:15:32 [INFO] Scanning for projects...
14-Dec-2019 00:15:33 [INFO] Downloading: https://repo.spring.io/libs-snapshot-local/org/apache/maven/plugins/maven-metadata.xml
14-Dec-2019 00:15:33 [INFO] Downloading: https://repo.spring.io/libs-snapshot-local/org/codehaus/mojo/maven-metadata.xml
14-Dec-2019 00:15:33 [INFO] Downloading: https://repo.spring.io/libs-milestone-local/org/codehaus/mojo/maven-metadata.xml
14-Dec-2019 00:15:33 [INFO] Downloading: https://repo.spring.io/libs-milestone-local/org/apache/maven/plugins/maven-metadata.xml
14-Dec-2019 00:15:33 [INFO] Downloading: https://repo.spring.io/libs-milestone-local/org/apache/maven/plugins/maven-surefire-report-plugin/maven-metadata.xml
14-Dec-2019 00:15:33 [INFO] Downloading: https://repo.spring.io/libs-snapshot-local/org/apache/maven/plugins/maven-surefire-report-plugin/maven-metadata.xml
14-Dec-2019 00:15:33 [INFO]                                                                         
14-Dec-2019 00:15:33 [INFO] ------------------------------------------------------------------------
14-Dec-2019 00:15:33 [INFO] Building Data Flow Acceptance Tests 1.1.0.BUILD-SNAPSHOT
14-Dec-2019 00:15:33 [INFO] ------------------------------------------------------------------------
14-Dec-2019 00:15:34 [INFO] Downloading: https://repo.spring.io/libs-snapshot-local/org/springframework/cloud/spring-cloud-dataflow-rest-client/1.7.0.BUILD-SNAPSHOT/maven-metadata.xml
14-Dec-2019 00:15:34 [INFO] Downloaded: https://repo.spring.io/libs-snapshot-local/org/springframework/cloud/spring-cloud-dataflow-rest-client/1.7.0.BUILD-SNAPSHOT/maven-metadata.xml (2 KB at 6.4 KB/sec)
14-Dec-2019 00:15:34 [INFO] Downloading: https://repo.spring.io/libs-snapshot-local/org/springframework/cloud/spring-cloud-dataflow-parent/1.7.0.BUILD-SNAPSHOT/maven-metadata.xml
14-Dec-2019 00:15:34 [INFO] Downloaded: https://repo.spring.io/libs-snapshot-local/org/springframework/cloud/spring-cloud-dataflow-parent/1.7.0.BUILD-SNAPSHOT/maven-metadata.xml (646 B at 3.2 KB/sec)
14-Dec-2019 00:15:34 [INFO] Downloading: https://repo.spring.io/libs-snapshot-local/org/springframework/cloud/spring-cloud-dataflow-dependencies/1.7.0.BUILD-SNAPSHOT/maven-metadata.xml
14-Dec-2019 00:15:34 [INFO] Downloaded: https://repo.spring.io/libs-snapshot-local/org/springframework/cloud/spring-cloud-dataflow-dependencies/1.7.0.BUILD-SNAPSHOT/maven-metadata.xml (652 B at 3.9 KB/sec)
14-Dec-2019 00:15:34 [INFO] Downloading: https://repo.spring.io/libs-snapshot-local/org/springframework/cloud/spring-cloud-dataflow-rest-resource/1.7.0.BUILD-SNAPSHOT/maven-metadata.xml
14-Dec-2019 00:15:35 [INFO] Downloaded: https://repo.spring.io/libs-snapshot-local/org/springframework/cloud/spring-cloud-dataflow-rest-resource/1.7.0.BUILD-SNAPSHOT/maven-metadata.xml (2 KB at 7.6 KB/sec)
14-Dec-2019 00:15:35 [INFO] Downloading: https://repo.spring.io/libs-snapshot-local/org/springframework/cloud/spring-cloud-dataflow-core/1.7.0.BUILD-SNAPSHOT/maven-metadata.xml
14-Dec-2019 00:15:35 [INFO] Downloaded: https://repo.spring.io/libs-snapshot-local/org/springframework/cloud/spring-cloud-dataflow-core/1.7.0.BUILD-SNAPSHOT/maven-metadata.xml (2 KB at 7.5 KB/sec)
14-Dec-2019 00:15:35 [INFO]
14-Dec-2019 00:15:35 [INFO] --- maven-checkstyle-plugin:2.17:check (checkstyle-validation) @ spring-cloud-dataflow-acceptance-tests ---
14-Dec-2019 00:15:36 [INFO]
14-Dec-2019 00:15:36 [INFO] --- maven-resources-plugin:2.6:resources (default-resources) @ spring-cloud-dataflow-acceptance-tests ---
14-Dec-2019 00:15:36 [INFO] Using 'UTF-8' encoding to copy filtered resources.
14-Dec-2019 00:15:36 [INFO] skip non existing resourceDirectory /opt/bamboo-home/xml-data/build-dir/SCDT-LOCAL20XSKIPPER20X-KAFKA/src/main/resources
14-Dec-2019 00:15:36 [INFO] skip non existing resourceDirectory /opt/bamboo-home/xml-data/build-dir/SCDT-LOCAL20XSKIPPER20X-KAFKA/src/main/resources
14-Dec-2019 00:15:36 [INFO]
14-Dec-2019 00:15:36 [INFO] --- maven-compiler-plugin:3.1:compile (default-compile) @ spring-cloud-dataflow-acceptance-tests ---
14-Dec-2019 00:15:36 [INFO] Changes detected - recompiling the module!
14-Dec-2019 00:15:36 [INFO] Compiling 8 source files to /opt/bamboo-home/xml-data/build-dir/SCDT-LOCAL20XSKIPPER20X-KAFKA/target/classes
14-Dec-2019 00:15:36 [INFO]
14-Dec-2019 00:15:36 [INFO] --- maven-resources-plugin:2.6:testResources (default-testResources) @ spring-cloud-dataflow-acceptance-tests ---
14-Dec-2019 00:15:36 [INFO] Using 'UTF-8' encoding to copy filtered resources.
14-Dec-2019 00:15:36 [INFO] Copying 1 resource
14-Dec-2019 00:15:36 [INFO]
14-Dec-2019 00:15:36 [INFO] --- maven-compiler-plugin:3.1:testCompile (default-testCompile) @ spring-cloud-dataflow-acceptance-tests ---
14-Dec-2019 00:15:36 [INFO] Changes detected - recompiling the module!
14-Dec-2019 00:15:36 [INFO] Compiling 16 source files to /opt/bamboo-home/xml-data/build-dir/SCDT-LOCAL20XSKIPPER20X-KAFKA/target/test-classes
14-Dec-2019 00:15:37 [WARNING] /opt/bamboo-home/xml-data/build-dir/SCDT-LOCAL20XSKIPPER20X-KAFKA/src/test/java/org/springframework/cloud/dataflow/acceptance/test/AbstractTaskTests.java: Some input files use unchecked or unsafe operations.
14-Dec-2019 00:15:37 [WARNING] /opt/bamboo-home/xml-data/build-dir/SCDT-LOCAL20XSKIPPER20X-KAFKA/src/test/java/org/springframework/cloud/dataflow/acceptance/test/AbstractTaskTests.java: Recompile with -Xlint:unchecked for details.
14-Dec-2019 00:15:37 [INFO]
14-Dec-2019 00:15:37 [INFO] --- maven-surefire-plugin:2.18.1:test (default-test) @ spring-cloud-dataflow-acceptance-tests ---
14-Dec-2019 00:15:37 [INFO] Surefire report directory: /opt/bamboo-home/xml-data/build-dir/SCDT-LOCAL20XSKIPPER20X-KAFKA/target/surefire-reports
14-Dec-2019 00:15:37
14-Dec-2019 00:15:37 -------------------------------------------------------
14-Dec-2019 00:15:37 T E S T S
14-Dec-2019 00:15:37 -------------------------------------------------------
14-Dec-2019 00:15:37 2019-12-14 00:15:37.872  INFO   --- [           main] .b.t.c.SpringBootTestContextBootstrapper : Neither @ContextConfiguration nor @ContextHierarchy found for test class [org.springframework.cloud.dataflow.acceptance.test.AnalyticsTests], using SpringBootContextLoader
14-Dec-2019 00:15:37 2019-12-14 00:15:37.917  INFO   --- [           main] .b.t.c.SpringBootTestContextBootstrapper : Loaded default TestExecutionListener class names from location [META-INF/spring.factories]: [org.springframework.boot.test.mock.mockito.MockitoTestExecutionListener, org.springframework.boot.test.mock.mockito.ResetMocksTestExecutionListener, org.springframework.boot.test.autoconfigure.restdocs.RestDocsTestExecutionListener, org.springframework.boot.test.autoconfigure.web.client.MockRestServiceServerResetTestExecutionListener, org.springframework.boot.test.autoconfigure.web.servlet.MockMvcPrintOnlyOnFailureTestExecutionListener, org.springframework.boot.test.autoconfigure.web.servlet.WebDriverTestExecutionListener, org.springframework.test.context.web.ServletTestExecutionListener, org.springframework.test.context.support.DirtiesContextBeforeModesTestExecutionListener, org.springframework.test.context.support.DependencyInjectionTestExecutionListener, org.springframework.test.context.support.DirtiesContextTestExecutionListener, org.springframework.test.context.transaction.TransactionalTestExecutionListener, org.springframework.test.context.jdbc.SqlScriptsTestExecutionListener]
14-Dec-2019 00:15:37 2019-12-14 00:15:37.935  INFO   --- [           main] .b.t.c.SpringBootTestContextBootstrapper : Using TestExecutionListeners: [org.springframework.test.context.web.ServletTestExecutionListener@4b5d6a01, org.springframework.test.context.support.DirtiesContextBeforeModesTestExecutionListener@4a22f9e2, org.springframework.boot.test.autoconfigure.SpringBootDependencyInjectionTestExecutionListener@3c419631, org.springframework.test.context.support.DirtiesContextTestExecutionListener@418e7838, org.springframework.test.context.transaction.TransactionalTestExecutionListener@61230f6a, org.springframework.test.context.jdbc.SqlScriptsTestExecutionListener@3c130745, org.springframework.boot.test.mock.mockito.MockitoTestExecutionListener@cd3fee8, org.springframework.boot.test.autoconfigure.web.servlet.MockMvcPrintOnlyOnFailureTestExecutionListener@3e2e18f2, org.springframework.boot.test.autoconfigure.web.client.MockRestServiceServerResetTestExecutionListener@470f1802, org.springframework.boot.test.mock.mockito.ResetMocksTestExecutionListener@63021689, org.springframework.boot.test.autoconfigure.web.servlet.WebDriverTestExecutionListener@703580bf, org.springframework.boot.test.autoconfigure.restdocs.RestDocsTestExecutionListener@3e92efc3]
14-Dec-2019 00:15:37 2019-12-14 00:15:37.937  INFO   --- [           main] .b.t.c.SpringBootTestContextBootstrapper : Neither @ContextConfiguration nor @ContextHierarchy found for test class [org.springframework.cloud.dataflow.acceptance.test.WoodChuckTests], using SpringBootContextLoader
14-Dec-2019 00:15:37 2019-12-14 00:15:37.953  INFO   --- [           main] .b.t.c.SpringBootTestContextBootstrapper : Loaded default TestExecutionListener class names from location [META-INF/spring.factories]: [org.springframework.boot.test.mock.mockito.MockitoTestExecutionListener, org.springframework.boot.test.mock.mockito.ResetMocksTestExecutionListener, org.springframework.boot.test.autoconfigure.restdocs.RestDocsTestExecutionListener, org.springframework.boot.test.autoconfigure.web.client.MockRestServiceServerResetTestExecutionListener, org.springframework.boot.test.autoconfigure.web.servlet.MockMvcPrintOnlyOnFailureTestExecutionListener, org.springframework.boot.test.autoconfigure.web.servlet.WebDriverTestExecutionListener, org.springframework.test.context.web.ServletTestExecutionListener, org.springframework.test.context.support.DirtiesContextBeforeModesTestExecutionListener, org.springframework.test.context.support.DependencyInjectionTestExecutionListener, org.springframework.test.context.support.DirtiesContextTestExecutionListener, org.springframework.test.context.transaction.TransactionalTestExecutionListener, org.springframework.test.context.jdbc.SqlScriptsTestExecutionListener]
14-Dec-2019 00:15:37 2019-12-14 00:15:37.956  INFO   --- [           main] .b.t.c.SpringBootTestContextBootstrapper : Using TestExecutionListeners: [org.springframework.test.context.web.ServletTestExecutionListener@7ec7ffd3, org.springframework.test.context.support.DirtiesContextBeforeModesTestExecutionListener@5b239d7d, org.springframework.boot.test.autoconfigure.SpringBootDependencyInjectionTestExecutionListener@6572421, org.springframework.test.context.support.DirtiesContextTestExecutionListener@6b81ce95, org.springframework.test.context.transaction.TransactionalTestExecutionListener@2a798d51, org.springframework.test.context.jdbc.SqlScriptsTestExecutionListener@6d763516, org.springframework.boot.test.mock.mockito.MockitoTestExecutionListener@52bf72b5, org.springframework.boot.test.autoconfigure.web.servlet.MockMvcPrintOnlyOnFailureTestExecutionListener@37afeb11, org.springframework.boot.test.autoconfigure.web.client.MockRestServiceServerResetTestExecutionListener@515aebb0, org.springframework.boot.test.mock.mockito.ResetMocksTestExecutionListener@dd8ba08, org.springframework.boot.test.autoconfigure.web.servlet.WebDriverTestExecutionListener@245b4bdc, org.springframework.boot.test.autoconfigure.restdocs.RestDocsTestExecutionListener@6c64cb25]
14-Dec-2019 00:15:37 2019-12-14 00:15:37.958  INFO   --- [           main] .b.t.c.SpringBootTestContextBootstrapper : Neither @ContextConfiguration nor @ContextHierarchy found for test class [org.springframework.cloud.dataflow.acceptance.test.HttpSourceTests], using SpringBootContextLoader
14-Dec-2019 00:15:37 2019-12-14 00:15:37.967  INFO   --- [           main] .b.t.c.SpringBootTestContextBootstrapper : Loaded default TestExecutionListener class names from location [META-INF/spring.factories]: [org.springframework.boot.test.mock.mockito.MockitoTestExecutionListener, org.springframework.boot.test.mock.mockito.ResetMocksTestExecutionListener, org.springframework.boot.test.autoconfigure.restdocs.RestDocsTestExecutionListener, org.springframework.boot.test.autoconfigure.web.client.MockRestServiceServerResetTestExecutionListener, org.springframework.boot.test.autoconfigure.web.servlet.MockMvcPrintOnlyOnFailureTestExecutionListener, org.springframework.boot.test.autoconfigure.web.servlet.WebDriverTestExecutionListener, org.springframework.test.context.web.ServletTestExecutionListener, org.springframework.test.context.support.DirtiesContextBeforeModesTestExecutionListener, org.springframework.test.context.support.DependencyInjectionTestExecutionListener, org.springframework.test.context.support.DirtiesContextTestExecutionListener, org.springframework.test.context.transaction.TransactionalTestExecutionListener, org.springframework.test.context.jdbc.SqlScriptsTestExecutionListener]
14-Dec-2019 00:15:37 2019-12-14 00:15:37.971  INFO   --- [           main] .b.t.c.SpringBootTestContextBootstrapper : Using TestExecutionListeners: [org.springframework.test.context.web.ServletTestExecutionListener@40a4337a, org.springframework.test.context.support.DirtiesContextBeforeModesTestExecutionListener@6025e1b6, org.springframework.boot.test.autoconfigure.SpringBootDependencyInjectionTestExecutionListener@22ff4249, org.springframework.test.context.support.DirtiesContextTestExecutionListener@2d1ef81a, org.springframework.test.context.transaction.TransactionalTestExecutionListener@4c402120, org.springframework.test.context.jdbc.SqlScriptsTestExecutionListener@327514f, org.springframework.boot.test.mock.mockito.MockitoTestExecutionListener@5b12b668, org.springframework.boot.test.autoconfigure.web.servlet.MockMvcPrintOnlyOnFailureTestExecutionListener@1165b38, org.springframework.boot.test.autoconfigure.web.client.MockRestServiceServerResetTestExecutionListener@4c12331b, org.springframework.boot.test.mock.mockito.ResetMocksTestExecutionListener@7586beff, org.springframework.boot.test.autoconfigure.web.servlet.WebDriverTestExecutionListener@3b69e7d1, org.springframework.boot.test.autoconfigure.restdocs.RestDocsTestExecutionListener@815b41f]
14-Dec-2019 00:15:37 2019-12-14 00:15:37.987  INFO   --- [           main] .b.t.c.SpringBootTestContextBootstrapper : Neither @ContextConfiguration nor @ContextHierarchy found for test class [org.springframework.cloud.dataflow.acceptance.test.TickTockTests], using SpringBootContextLoader
14-Dec-2019 00:15:37 2019-12-14 00:15:37.996  INFO   --- [           main] .b.t.c.SpringBootTestContextBootstrapper : Loaded default TestExecutionListener class names from location [META-INF/spring.factories]: [org.springframework.boot.test.mock.mockito.MockitoTestExecutionListener, org.springframework.boot.test.mock.mockito.ResetMocksTestExecutionListener, org.springframework.boot.test.autoconfigure.restdocs.RestDocsTestExecutionListener, org.springframework.boot.test.autoconfigure.web.client.MockRestServiceServerResetTestExecutionListener, org.springframework.boot.test.autoconfigure.web.servlet.MockMvcPrintOnlyOnFailureTestExecutionListener, org.springframework.boot.test.autoconfigure.web.servlet.WebDriverTestExecutionListener, org.springframework.test.context.web.ServletTestExecutionListener, org.springframework.test.context.support.DirtiesContextBeforeModesTestExecutionListener, org.springframework.test.context.support.DependencyInjectionTestExecutionListener, org.springframework.test.context.support.DirtiesContextTestExecutionListener, org.springframework.test.context.transaction.TransactionalTestExecutionListener, org.springframework.test.context.jdbc.SqlScriptsTestExecutionListener]
14-Dec-2019 00:15:38 2019-12-14 00:15:37.999  INFO   --- [           main] .b.t.c.SpringBootTestContextBootstrapper : Using TestExecutionListeners: [org.springframework.test.context.web.ServletTestExecutionListener@55b53d44, org.springframework.test.context.support.DirtiesContextBeforeModesTestExecutionListener@482bce4f, org.springframework.boot.test.autoconfigure.SpringBootDependencyInjectionTestExecutionListener@366647c2, org.springframework.test.context.support.DirtiesContextTestExecutionListener@6a6afff2, org.springframework.test.context.transaction.TransactionalTestExecutionListener@1649b0e6, org.springframework.test.context.jdbc.SqlScriptsTestExecutionListener@865dd6, org.springframework.boot.test.mock.mockito.MockitoTestExecutionListener@4da4253, org.springframework.boot.test.autoconfigure.web.servlet.MockMvcPrintOnlyOnFailureTestExecutionListener@3972a855, org.springframework.boot.test.autoconfigure.web.client.MockRestServiceServerResetTestExecutionListener@62e7f11d, org.springframework.boot.test.mock.mockito.ResetMocksTestExecutionListener@503d687a, org.springframework.boot.test.autoconfigure.web.servlet.WebDriverTestExecutionListener@6a370f4, org.springframework.boot.test.autoconfigure.restdocs.RestDocsTestExecutionListener@2abf4075]
14-Dec-2019 00:15:38 2019-12-14 00:15:38.008  INFO   --- [           main] .b.t.c.SpringBootTestContextBootstrapper : Neither @ContextConfiguration nor @ContextHierarchy found for test class [org.springframework.cloud.dataflow.acceptance.test.TransformTests], using SpringBootContextLoader
14-Dec-2019 00:15:38 2019-12-14 00:15:38.017  INFO   --- [           main] .b.t.c.SpringBootTestContextBootstrapper : Loaded default TestExecutionListener class names from location [META-INF/spring.factories]: [org.springframework.boot.test.mock.mockito.MockitoTestExecutionListener, org.springframework.boot.test.mock.mockito.ResetMocksTestExecutionListener, org.springframework.boot.test.autoconfigure.restdocs.RestDocsTestExecutionListener, org.springframework.boot.test.autoconfigure.web.client.MockRestServiceServerResetTestExecutionListener, org.springframework.boot.test.autoconfigure.web.servlet.MockMvcPrintOnlyOnFailureTestExecutionListener, org.springframework.boot.test.autoconfigure.web.servlet.WebDriverTestExecutionListener, org.springframework.test.context.web.ServletTestExecutionListener, org.springframework.test.context.support.DirtiesContextBeforeModesTestExecutionListener, org.springframework.test.context.support.DependencyInjectionTestExecutionListener, org.springframework.test.context.support.DirtiesContextTestExecutionListener, org.springframework.test.context.transaction.TransactionalTestExecutionListener, org.springframework.test.context.jdbc.SqlScriptsTestExecutionListener]
14-Dec-2019 00:15:38 2019-12-14 00:15:38.020  INFO   --- [           main] .b.t.c.SpringBootTestContextBootstrapper : Using TestExecutionListeners: [org.springframework.test.context.web.ServletTestExecutionListener@51e69659, org.springframework.test.context.support.DirtiesContextBeforeModesTestExecutionListener@47e2e487, org.springframework.boot.test.autoconfigure.SpringBootDependencyInjectionTestExecutionListener@201a4587, org.springframework.test.context.support.DirtiesContextTestExecutionListener@61001b64, org.springframework.test.context.transaction.TransactionalTestExecutionListener@4310d43, org.springframework.test.context.jdbc.SqlScriptsTestExecutionListener@54a7079e, org.springframework.boot.test.mock.mockito.MockitoTestExecutionListener@26e356f0, org.springframework.boot.test.autoconfigure.web.servlet.MockMvcPrintOnlyOnFailureTestExecutionListener@47d9a273, org.springframework.boot.test.autoconfigure.web.client.MockRestServiceServerResetTestExecutionListener@4b8ee4de, org.springframework.boot.test.mock.mockito.ResetMocksTestExecutionListener@27f981c6, org.springframework.boot.test.autoconfigure.web.servlet.WebDriverTestExecutionListener@1b11171f, org.springframework.boot.test.autoconfigure.restdocs.RestDocsTestExecutionListener@1151e434]
14-Dec-2019 00:15:38 2019-12-14 00:15:38.032  INFO   --- [           main] .b.t.c.SpringBootTestContextBootstrapper : Neither @ContextConfiguration nor @ContextHierarchy found for test class [org.springframework.cloud.dataflow.acceptance.test.NamedChannelTests], using SpringBootContextLoader
14-Dec-2019 00:15:38 2019-12-14 00:15:38.041  INFO   --- [           main] .b.t.c.SpringBootTestContextBootstrapper : Loaded default TestExecutionListener class names from location [META-INF/spring.factories]: [org.springframework.boot.test.mock.mockito.MockitoTestExecutionListener, org.springframework.boot.test.mock.mockito.ResetMocksTestExecutionListener, org.springframework.boot.test.autoconfigure.restdocs.RestDocsTestExecutionListener, org.springframework.boot.test.autoconfigure.web.client.MockRestServiceServerResetTestExecutionListener, org.springframework.boot.test.autoconfigure.web.servlet.MockMvcPrintOnlyOnFailureTestExecutionListener, org.springframework.boot.test.autoconfigure.web.servlet.WebDriverTestExecutionListener, org.springframework.test.context.web.ServletTestExecutionListener, org.springframework.test.context.support.DirtiesContextBeforeModesTestExecutionListener, org.springframework.test.context.support.DependencyInjectionTestExecutionListener, org.springframework.test.context.support.DirtiesContextTestExecutionListener, org.springframework.test.context.transaction.TransactionalTestExecutionListener, org.springframework.test.context.jdbc.SqlScriptsTestExecutionListener]
14-Dec-2019 00:15:38 2019-12-14 00:15:38.044  INFO   --- [           main] .b.t.c.SpringBootTestContextBootstrapper : Using TestExecutionListeners: [org.springframework.test.context.web.ServletTestExecutionListener@70cf32e3, org.springframework.test.context.support.DirtiesContextBeforeModesTestExecutionListener@5a59ca5e, org.springframework.boot.test.autoconfigure.SpringBootDependencyInjectionTestExecutionListener@4bdeaabb, org.springframework.test.context.support.DirtiesContextTestExecutionListener@6c4906d3, org.springframework.test.context.transaction.TransactionalTestExecutionListener@65987993, org.springframework.test.context.jdbc.SqlScriptsTestExecutionListener@71075444, org.springframework.boot.test.mock.mockito.MockitoTestExecutionListener@4f32a3ad, org.springframework.boot.test.autoconfigure.web.servlet.MockMvcPrintOnlyOnFailureTestExecutionListener@6b695b06, org.springframework.boot.test.autoconfigure.web.client.MockRestServiceServerResetTestExecutionListener@4d1bf319, org.springframework.boot.test.mock.mockito.ResetMocksTestExecutionListener@6f53b8a, org.springframework.boot.test.autoconfigure.web.servlet.WebDriverTestExecutionListener@5c80cf32, org.springframework.boot.test.autoconfigure.restdocs.RestDocsTestExecutionListener@7d900ecf]
14-Dec-2019 00:15:38 Running org.springframework.cloud.dataflow.acceptance.test.AnalyticsTests
14-Dec-2019 00:15:38 2019-12-14 00:15:38.076  INFO   --- [           main] .b.t.c.SpringBootTestContextBootstrapper : Neither @ContextConfiguration nor @ContextHierarchy found for test class [org.springframework.cloud.dataflow.acceptance.test.AnalyticsTests], using SpringBootContextLoader
14-Dec-2019 00:15:38 2019-12-14 00:15:38.097  INFO   --- [           main] .b.t.c.SpringBootTestContextBootstrapper : Loaded default TestExecutionListener class names from location [META-INF/spring.factories]: [org.springframework.boot.test.mock.mockito.MockitoTestExecutionListener, org.springframework.boot.test.mock.mockito.ResetMocksTestExecutionListener, org.springframework.boot.test.autoconfigure.restdocs.RestDocsTestExecutionListener, org.springframework.boot.test.autoconfigure.web.client.MockRestServiceServerResetTestExecutionListener, org.springframework.boot.test.autoconfigure.web.servlet.MockMvcPrintOnlyOnFailureTestExecutionListener, org.springframework.boot.test.autoconfigure.web.servlet.WebDriverTestExecutionListener, org.springframework.test.context.web.ServletTestExecutionListener, org.springframework.test.context.support.DirtiesContextBeforeModesTestExecutionListener, org.springframework.test.context.support.DependencyInjectionTestExecutionListener, org.springframework.test.context.support.DirtiesContextTestExecutionListener, org.springframework.test.context.transaction.TransactionalTestExecutionListener, org.springframework.test.context.jdbc.SqlScriptsTestExecutionListener]
14-Dec-2019 00:15:38 2019-12-14 00:15:38.100  INFO   --- [           main] .b.t.c.SpringBootTestContextBootstrapper : Using TestExecutionListeners: [org.springframework.test.context.web.ServletTestExecutionListener@77659b30, org.springframework.test.context.support.DirtiesContextBeforeModesTestExecutionListener@456d6c1e, org.springframework.boot.test.autoconfigure.SpringBootDependencyInjectionTestExecutionListener@1e13529a, org.springframework.test.context.support.DirtiesContextTestExecutionListener@1ec9bd38, org.springframework.test.context.transaction.TransactionalTestExecutionListener@452e19ca, org.springframework.test.context.jdbc.SqlScriptsTestExecutionListener@6b0d80ed, org.springframework.boot.test.mock.mockito.MockitoTestExecutionListener@6f8e8894, org.springframework.boot.test.autoconfigure.web.servlet.MockMvcPrintOnlyOnFailureTestExecutionListener@3cfdd820, org.springframework.boot.test.autoconfigure.web.client.MockRestServiceServerResetTestExecutionListener@928763c, org.springframework.boot.test.mock.mockito.ResetMocksTestExecutionListener@e25951c, org.springframework.boot.test.autoconfigure.web.servlet.WebDriverTestExecutionListener@15f47664, org.springframework.boot.test.autoconfigure.restdocs.RestDocsTestExecutionListener@471a9022]
14-Dec-2019 00:15:38 2019-12-14 00:15:38.699  INFO 9525 --- [           main] s.c.a.AnnotationConfigApplicationContext : Refreshing org.springframework.context.annotation.AnnotationConfigApplicationContext@2fa7ae9: startup date [Sat Dec 14 00:15:38 UTC 2019]; root of context hierarchy
14-Dec-2019 00:15:38 2019-12-14 00:15:38.955  INFO 9525 --- [           main] trationDelegate$BeanPostProcessorChecker : Bean 'configurationPropertiesRebinderAutoConfiguration' of type [class org.springframework.cloud.autoconfigure.ConfigurationPropertiesRebinderAutoConfiguration$$EnhancerBySpringCGLIB$$ed959188] is not eligible for getting processed by all BeanPostProcessors (for example: not eligible for auto-proxying)
14-Dec-2019 00:15:39
14-Dec-2019 00:15:39   .   ____          _            __ _ _
14-Dec-2019 00:15:39 /\\ / ___'_ __ _ _(_)_ __  __ _ \ \ \ \
14-Dec-2019 00:15:39 ( ( )\___ | '_ | '_| | '_ \/ _` | \ \ \ \
14-Dec-2019 00:15:39 \\/  ___)| |_)| | | | | || (_| |  ) ) ) )
14-Dec-2019 00:15:39   '  |____| .__|_| |_|_| |_\__, | / / / /
14-Dec-2019 00:15:39 =========|_|==============|___/=/_/_/_/
14-Dec-2019 00:15:39 :: Spring Boot ::        (v1.4.1.RELEASE)
14-Dec-2019 00:15:39
14-Dec-2019 00:15:39 2019-12-14 00:15:39.253  INFO 9525 --- [           main] c.c.c.ConfigServicePropertySourceLocator : Fetching config from server at: http://localhost:8888
14-Dec-2019 00:15:39 2019-12-14 00:15:39.333  WARN 9525 --- [           main] c.c.c.ConfigServicePropertySourceLocator : Could not locate PropertySource: I/O error on GET request for "http://localhost:8888//blah": Connection refused (Connection refused); nested exception is java.net.ConnectException: Connection refused (Connection refused)
14-Dec-2019 00:15:39 2019-12-14 00:15:39.340  INFO 9525 --- [           main] o.s.c.d.acceptance.test.AnalyticsTests   : The following profiles are active: blah
14-Dec-2019 00:15:39 2019-12-14 00:15:39.562  INFO 9525 --- [           main] o.s.c.d.acceptance.test.AnalyticsTests   : Started AnalyticsTests in 1.397 seconds (JVM running for 2.128)
14-Dec-2019 00:15:39 2019-12-14 00:15:39.818  INFO 9525 --- [           main] junit.logTestName                        : Starting Test analyticsTest(org.springframework.cloud.dataflow.acceptance.test.AnalyticsTests)
14-Dec-2019 00:15:39 2019-12-14 00:15:39.822  INFO 9525 --- [           main] o.s.c.d.acceptance.test.AnalyticsTests   : Importing stream apps from uri resource: https://dataflow.spring.io/kafka-maven-latest
14-Dec-2019 00:15:42 2019-12-14 00:15:42.206  INFO 9525 --- [           main] junit.logTestName                        : Finished Test analyticsTest(org.springframework.cloud.dataflow.acceptance.test.AnalyticsTests)
14-Dec-2019 00:15:42 2019-12-14 00:15:42.207  INFO 9525 --- [           main] o.s.c.d.acceptance.test.AnalyticsTests   : Destroy all streams
14-Dec-2019 00:15:42 Tests run: 1, Failures: 0, Errors: 0, Skipped: 1, Time elapsed: 4.157 sec - in org.springframework.cloud.dataflow.acceptance.test.AnalyticsTests
14-Dec-2019 00:15:42 Running org.springframework.cloud.dataflow.acceptance.test.WoodChuckTests
14-Dec-2019 00:15:42 2019-12-14 00:15:42.227  INFO 9525 --- [           main] .b.t.c.SpringBootTestContextBootstrapper : Neither @ContextConfiguration nor @ContextHierarchy found for test class [org.springframework.cloud.dataflow.acceptance.test.WoodChuckTests], using SpringBootContextLoader
14-Dec-2019 00:15:42 2019-12-14 00:15:42.239  INFO 9525 --- [           main] .b.t.c.SpringBootTestContextBootstrapper : Loaded default TestExecutionListener class names from location [META-INF/spring.factories]: [org.springframework.boot.test.mock.mockito.MockitoTestExecutionListener, org.springframework.boot.test.mock.mockito.ResetMocksTestExecutionListener, org.springframework.boot.test.autoconfigure.restdocs.RestDocsTestExecutionListener, org.springframework.boot.test.autoconfigure.web.client.MockRestServiceServerResetTestExecutionListener, org.springframework.boot.test.autoconfigure.web.servlet.MockMvcPrintOnlyOnFailureTestExecutionListener, org.springframework.boot.test.autoconfigure.web.servlet.WebDriverTestExecutionListener, org.springframework.test.context.web.ServletTestExecutionListener, org.springframework.test.context.support.DirtiesContextBeforeModesTestExecutionListener, org.springframework.test.context.support.DependencyInjectionTestExecutionListener, org.springframework.test.context.support.DirtiesContextTestExecutionListener, org.springframework.test.context.transaction.TransactionalTestExecutionListener, org.springframework.test.context.jdbc.SqlScriptsTestExecutionListener]
14-Dec-2019 00:15:42 2019-12-14 00:15:42.242  INFO 9525 --- [           main] .b.t.c.SpringBootTestContextBootstrapper : Using TestExecutionListeners: [org.springframework.test.context.web.ServletTestExecutionListener@43045f9f, org.springframework.test.context.support.DirtiesContextBeforeModesTestExecutionListener@2643d762, org.springframework.boot.test.autoconfigure.SpringBootDependencyInjectionTestExecutionListener@6403e24c, org.springframework.test.context.support.DirtiesContextTestExecutionListener@2f236de0, org.springframework.test.context.transaction.TransactionalTestExecutionListener@4eba373c, org.springframework.test.context.jdbc.SqlScriptsTestExecutionListener@767a014e, org.springframework.boot.test.mock.mockito.MockitoTestExecutionListener@d109c4f, org.springframework.boot.test.autoconfigure.web.servlet.MockMvcPrintOnlyOnFailureTestExecutionListener@3968bc60, org.springframework.boot.test.autoconfigure.web.client.MockRestServiceServerResetTestExecutionListener@26f46fa6, org.springframework.boot.test.mock.mockito.ResetMocksTestExecutionListener@227a47, org.springframework.boot.test.autoconfigure.web.servlet.WebDriverTestExecutionListener@9596ce8, org.springframework.boot.test.autoconfigure.restdocs.RestDocsTestExecutionListener@75ae4a1f]
14-Dec-2019 00:15:42 2019-12-14 00:15:42.324  INFO 9525 --- [           main] junit.logTestName                        : Starting Test testPartitioning(org.springframework.cloud.dataflow.acceptance.test.WoodChuckTests)
14-Dec-2019 00:15:42 2019-12-14 00:15:42.341  INFO 9525 --- [           main] o.s.c.d.acceptance.test.WoodChuckTests   : Creating stream 'WOODCHUCK-TEST'
14-Dec-2019 00:15:42 2019-12-14 00:15:42.513  INFO 9525 --- [           main] o.s.c.d.acceptance.test.WoodChuckTests   : Deploying stream 'WOODCHUCK-TEST' with properties: {app.*.spring.cloud.streamapp.security.enabled=false, app.log.logging.pattern.level=WOODCHUCK-${INSTANCE_INDEX:${CF_INSTANCE_INDEX:${spring.cloud.stream.instanceIndex:0}}} %5p, app.*.logging.file=${PID}-test.log, app.splitter.producer.partitionKeyExpression=payload, app.*.endpoints.logfile.sensitive=false, app.log.spring.cloud.stream.kafka.bindings.input.consumer.autoRebalanceEnabled=false, app.*.management.endpoints.web.exposure.include=*, deployer.log.count=2}
14-Dec-2019 00:15:44 2019-12-14 00:15:44.883  INFO 9525 --- [           main] o.s.c.d.acceptance.test.WoodChuckTests   : Checking: Stream=WOODCHUCK-TEST, status = deploying, status description = The stream is being deployed.
14-Dec-2019 00:15:44 2019-12-14 00:15:44.883  INFO 9525 --- [           main] o.s.c.d.acceptance.test.WoodChuckTests   : Sleeping to check status of Stream=WOODCHUCK-TEST
14-Dec-2019 00:15:55 2019-12-14 00:15:55.056  INFO 9525 --- [           main] o.s.c.d.acceptance.test.WoodChuckTests   : Checking: Stream=WOODCHUCK-TEST, status = deploying, status description = The stream is being deployed.
14-Dec-2019 00:15:55 2019-12-14 00:15:55.057  INFO 9525 --- [           main] o.s.c.d.acceptance.test.WoodChuckTests   : Sleeping to check status of Stream=WOODCHUCK-TEST
14-Dec-2019 00:16:05 2019-12-14 00:16:05.157  INFO 9525 --- [           main] o.s.c.d.acceptance.test.WoodChuckTests   : Checking: Stream=WOODCHUCK-TEST, status = deploying, status description = The stream is being deployed.
14-Dec-2019 00:16:05 2019-12-14 00:16:05.157  INFO 9525 --- [           main] o.s.c.d.acceptance.test.WoodChuckTests   : Sleeping to check status of Stream=WOODCHUCK-TEST
14-Dec-2019 00:16:15 2019-12-14 00:16:15.213  INFO 9525 --- [           main] o.s.c.d.acceptance.test.WoodChuckTests   : Checking: Stream=WOODCHUCK-TEST, status = deployed, status description = The stream has been successfully deployed
14-Dec-2019 00:16:15 2019-12-14 00:16:15.270  INFO 9525 --- [           main] o.s.c.d.acceptance.test.WoodChuckTests   : Sleeping to check status of Stream=WOODCHUCK-TEST
14-Dec-2019 00:16:25 2019-12-14 00:16:25.271  INFO 9525 --- [           main] o.s.c.d.acceptance.test.WoodChuckTests   : Stream 'WOODCHUCK-TEST' started with status: deployed
14-Dec-2019 00:16:25 2019-12-14 00:16:25.272  INFO 9525 --- [           main] o.s.c.d.acceptance.test.WoodChuckTests   : App 'log' has instances: {WOODCHUCK-TEST.log-v1-0=http://10.194.6.129:41806, WOODCHUCK-TEST.log-v1-1=http://10.194.6.129:52284}
14-Dec-2019 00:16:25 2019-12-14 00:16:25.272  INFO 9525 --- [           main] o.s.c.d.acceptance.test.WoodChuckTests   : App 'http' has instances: {WOODCHUCK-TEST.http-v1-0=http://10.194.6.129:37001}
14-Dec-2019 00:16:25 2019-12-14 00:16:25.272  INFO 9525 --- [           main] o.s.c.d.acceptance.test.WoodChuckTests   : App 'splitter' has instances: {WOODCHUCK-TEST.splitter-v1-0=http://10.194.6.129:52466}
14-Dec-2019 00:16:25 2019-12-14 00:16:25.273  INFO 9525 --- [           main] o.s.c.d.acceptance.test.WoodChuckTests   : Looking for 'Started HttpSource' in logfile for http
14-Dec-2019 00:16:35 2019-12-14 00:16:35.274  INFO 9525 --- [           main] o.s.c.d.acceptance.test.WoodChuckTests   : Requesting log for app WOODCHUCK-TEST.http-v1-0
14-Dec-2019 00:16:35 2019-12-14 00:16:35.584  INFO 9525 --- [           main] o.s.c.d.acceptance.test.WoodChuckTests   : Retrieved logfile from 'http://10.194.6.129:37001/actuator/logfile
14-Dec-2019 00:16:35 2019-12-14 00:16:35.589  INFO 9525 --- [           main] o.s.c.d.acceptance.test.WoodChuckTests   : Matched all 'Started HttpSource' in logfile for app http (source WOODCHUCK-TEST.http-v1-0)
14-Dec-2019 00:16:35 2019-12-14 00:16:35.589  INFO 9525 --- [           main] o.s.c.d.acceptance.test.WoodChuckTests   : Looking for 'Started SplitterProcessor' in logfile for splitter
14-Dec-2019 00:16:45 2019-12-14 00:16:45.590  INFO 9525 --- [           main] o.s.c.d.acceptance.test.WoodChuckTests   : Requesting log for app WOODCHUCK-TEST.splitter-v1-0
14-Dec-2019 00:16:45 2019-12-14 00:16:45.732  INFO 9525 --- [           main] o.s.c.d.acceptance.test.WoodChuckTests   : Retrieved logfile from 'http://10.194.6.129:52466/actuator/logfile
14-Dec-2019 00:16:45 2019-12-14 00:16:45.733  INFO 9525 --- [           main] o.s.c.d.acceptance.test.WoodChuckTests   : Matched all 'Started SplitterProcessor' in logfile for app splitter (source WOODCHUCK-TEST.splitter-v1-0)
14-Dec-2019 00:16:45 2019-12-14 00:16:45.733  INFO 9525 --- [           main] o.s.c.d.acceptance.test.WoodChuckTests   : Looking for 'Started LogSink' in logfile for log
14-Dec-2019 00:16:55 2019-12-14 00:16:55.733  INFO 9525 --- [           main] o.s.c.d.acceptance.test.WoodChuckTests   : Requesting log for app WOODCHUCK-TEST.log-v1-0
14-Dec-2019 00:16:55 2019-12-14 00:16:55.866  INFO 9525 --- [           main] o.s.c.d.acceptance.test.WoodChuckTests   : Retrieved logfile from 'http://10.194.6.129:41806/actuator/logfile
14-Dec-2019 00:16:55 2019-12-14 00:16:55.866  INFO 9525 --- [           main] o.s.c.d.acceptance.test.WoodChuckTests   : Requesting log for app WOODCHUCK-TEST.log-v1-1
14-Dec-2019 00:16:56 2019-12-14 00:16:56.019  INFO 9525 --- [           main] o.s.c.d.acceptance.test.WoodChuckTests   : Retrieved logfile from 'http://10.194.6.129:52284/actuator/logfile
14-Dec-2019 00:16:56 2019-12-14 00:16:56.020  INFO 9525 --- [           main] o.s.c.d.acceptance.test.WoodChuckTests   : Matched all 'Started LogSink' in logfile for app log (source WOODCHUCK-TEST.log-v1-0)
14-Dec-2019 00:16:56 2019-12-14 00:16:56.215  INFO 9525 --- [           main] o.s.c.d.acceptance.test.WoodChuckTests   : Looking for 'WOODCHUCK-0,How,chuck' in logfile for log
14-Dec-2019 00:17:06 2019-12-14 00:17:06.216  INFO 9525 --- [           main] o.s.c.d.acceptance.test.WoodChuckTests   : Requesting log for app WOODCHUCK-TEST.log-v1-0
14-Dec-2019 00:17:06 2019-12-14 00:17:06.232  INFO 9525 --- [           main] o.s.c.d.acceptance.test.WoodChuckTests   : Retrieved logfile from 'http://10.194.6.129:41806/actuator/logfile
14-Dec-2019 00:17:06 2019-12-14 00:17:06.233  INFO 9525 --- [           main] o.s.c.d.acceptance.test.WoodChuckTests   : Requesting log for app WOODCHUCK-TEST.log-v1-1
14-Dec-2019 00:17:06 2019-12-14 00:17:06.249  INFO 9525 --- [           main] o.s.c.d.acceptance.test.WoodChuckTests   : Retrieved logfile from 'http://10.194.6.129:52284/actuator/logfile
14-Dec-2019 00:17:06 2019-12-14 00:17:06.249  INFO 9525 --- [           main] o.s.c.d.acceptance.test.WoodChuckTests   : Matched all 'WOODCHUCK-0,How,chuck' in logfile for app log (source WOODCHUCK-TEST.log-v1-0)
14-Dec-2019 00:17:06 2019-12-14 00:17:06.249  INFO 9525 --- [           main] o.s.c.d.acceptance.test.WoodChuckTests   : Looking for 'WOODCHUCK-1,much,wood,would,if,a,woodchuck,could' in logfile for log
14-Dec-2019 00:17:16 2019-12-14 00:17:16.250  INFO 9525 --- [           main] o.s.c.d.acceptance.test.WoodChuckTests   : Requesting log for app WOODCHUCK-TEST.log-v1-0
14-Dec-2019 00:17:16 2019-12-14 00:17:16.264  INFO 9525 --- [           main] o.s.c.d.acceptance.test.WoodChuckTests   : Retrieved logfile from 'http://10.194.6.129:41806/actuator/logfile
14-Dec-2019 00:17:16 2019-12-14 00:17:16.264  INFO 9525 --- [           main] o.s.c.d.acceptance.test.WoodChuckTests   : Requesting log for app WOODCHUCK-TEST.log-v1-1
14-Dec-2019 00:17:16 2019-12-14 00:17:16.273  INFO 9525 --- [           main] o.s.c.d.acceptance.test.WoodChuckTests   : Retrieved logfile from 'http://10.194.6.129:52284/actuator/logfile
14-Dec-2019 00:17:16 2019-12-14 00:17:16.273  INFO 9525 --- [           main] o.s.c.d.acceptance.test.WoodChuckTests   : Matched all 'WOODCHUCK-1,much,wood,would,if,a,woodchuck,could' in logfile for app log (source WOODCHUCK-TEST.log-v1-1)
14-Dec-2019 00:17:16 2019-12-14 00:17:16.281  INFO 9525 --- [           main] junit.logTestName                        : Test testPartitioning(org.springframework.cloud.dataflow.acceptance.test.WoodChuckTests) Succeeded
14-Dec-2019 00:17:16 2019-12-14 00:17:16.281  INFO 9525 --- [           main] junit.logTestName                        : Finished Test testPartitioning(org.springframework.cloud.dataflow.acceptance.test.WoodChuckTests)
14-Dec-2019 00:17:16 2019-12-14 00:17:16.281  INFO 9525 --- [           main] o.s.c.d.acceptance.test.WoodChuckTests   : Destroy all streams
14-Dec-2019 00:17:16 Tests run: 1, Failures: 0, Errors: 0, Skipped: 0, Time elapsed: 94.406 sec - in org.springframework.cloud.dataflow.acceptance.test.WoodChuckTests
14-Dec-2019 00:17:16 Running org.springframework.cloud.dataflow.acceptance.test.HttpSourceTests
14-Dec-2019 00:17:16 2019-12-14 00:17:16.748  INFO 9525 --- [           main] .b.t.c.SpringBootTestContextBootstrapper : Neither @ContextConfiguration nor @ContextHierarchy found for test class [org.springframework.cloud.dataflow.acceptance.test.HttpSourceTests], using SpringBootContextLoader
14-Dec-2019 00:17:16 2019-12-14 00:17:16.754  INFO 9525 --- [           main] .b.t.c.SpringBootTestContextBootstrapper : Loaded default TestExecutionListener class names from location [META-INF/spring.factories]: [org.springframework.boot.test.mock.mockito.MockitoTestExecutionListener, org.springframework.boot.test.mock.mockito.ResetMocksTestExecutionListener, org.springframework.boot.test.autoconfigure.restdocs.RestDocsTestExecutionListener, org.springframework.boot.test.autoconfigure.web.client.MockRestServiceServerResetTestExecutionListener, org.springframework.boot.test.autoconfigure.web.servlet.MockMvcPrintOnlyOnFailureTestExecutionListener, org.springframework.boot.test.autoconfigure.web.servlet.WebDriverTestExecutionListener, org.springframework.test.context.web.ServletTestExecutionListener, org.springframework.test.context.support.DirtiesContextBeforeModesTestExecutionListener, org.springframework.test.context.support.DependencyInjectionTestExecutionListener, org.springframework.test.context.support.DirtiesContextTestExecutionListener, org.springframework.test.context.transaction.TransactionalTestExecutionListener, org.springframework.test.context.jdbc.SqlScriptsTestExecutionListener]
14-Dec-2019 00:17:16 2019-12-14 00:17:16.756  INFO 9525 --- [           main] .b.t.c.SpringBootTestContextBootstrapper : Using TestExecutionListeners: [org.springframework.test.context.web.ServletTestExecutionListener@5ea4300e, org.springframework.test.context.support.DirtiesContextBeforeModesTestExecutionListener@5a1c3cb4, org.springframework.boot.test.autoconfigure.SpringBootDependencyInjectionTestExecutionListener@76ad6715, org.springframework.test.context.support.DirtiesContextTestExecutionListener@56637cff, org.springframework.test.context.transaction.TransactionalTestExecutionListener@2938127d, org.springframework.test.context.jdbc.SqlScriptsTestExecutionListener@127a7272, org.springframework.boot.test.mock.mockito.MockitoTestExecutionListener@ff23ae7, org.springframework.boot.test.autoconfigure.web.servlet.MockMvcPrintOnlyOnFailureTestExecutionListener@423b2b62, org.springframework.boot.test.autoconfigure.web.client.MockRestServiceServerResetTestExecutionListener@2b7962a2, org.springframework.boot.test.mock.mockito.ResetMocksTestExecutionListener@6ad16c5d, org.springframework.boot.test.autoconfigure.web.servlet.WebDriverTestExecutionListener@74ea46e2, org.springframework.boot.test.autoconfigure.restdocs.RestDocsTestExecutionListener@6f911326]
14-Dec-2019 00:17:16 2019-12-14 00:17:16.856  INFO 9525 --- [           main] junit.logTestName                        : Starting Test httpSourceTests(org.springframework.cloud.dataflow.acceptance.test.HttpSourceTests)
14-Dec-2019 00:17:16 2019-12-14 00:17:16.857  INFO 9525 --- [           main] o.s.c.d.acceptance.test.HttpSourceTests  : Creating stream 'HTTP-TEST'
14-Dec-2019 00:17:16 2019-12-14 00:17:16.898  INFO 9525 --- [           main] o.s.c.d.acceptance.test.HttpSourceTests  : Deploying stream 'HTTP-TEST' with properties: {app.*.spring.cloud.streamapp.security.enabled=false, app.*.logging.file=${PID}-test.log, app.*.endpoints.logfile.sensitive=false, app.*.management.endpoints.web.exposure.include=*}
14-Dec-2019 00:17:17 2019-12-14 00:17:17.663  INFO 9525 --- [           main] o.s.c.d.acceptance.test.HttpSourceTests  : Checking: Stream=HTTP-TEST, status = deploying, status description = The stream is being deployed.
14-Dec-2019 00:17:17 2019-12-14 00:17:17.663  INFO 9525 --- [           main] o.s.c.d.acceptance.test.HttpSourceTests  : Sleeping to check status of Stream=HTTP-TEST
14-Dec-2019 00:17:27 2019-12-14 00:17:27.702  INFO 9525 --- [           main] o.s.c.d.acceptance.test.HttpSourceTests  : Checking: Stream=HTTP-TEST, status = deploying, status description = The stream is being deployed.
14-Dec-2019 00:17:27 2019-12-14 00:17:27.702  INFO 9525 --- [           main] o.s.c.d.acceptance.test.HttpSourceTests  : Sleeping to check status of Stream=HTTP-TEST
14-Dec-2019 00:17:37 2019-12-14 00:17:37.754  INFO 9525 --- [           main] o.s.c.d.acceptance.test.HttpSourceTests  : Checking: Stream=HTTP-TEST, status = deployed, status description = The stream has been successfully deployed
14-Dec-2019 00:17:37 2019-12-14 00:17:37.792  INFO 9525 --- [           main] o.s.c.d.acceptance.test.HttpSourceTests  : Sleeping to check status of Stream=HTTP-TEST
14-Dec-2019 00:17:47 2019-12-14 00:17:47.792  INFO 9525 --- [           main] o.s.c.d.acceptance.test.HttpSourceTests  : Stream 'HTTP-TEST' started with status: deployed
14-Dec-2019 00:17:47 2019-12-14 00:17:47.793  INFO 9525 --- [           main] o.s.c.d.acceptance.test.HttpSourceTests  : App 'log' has instances: {HTTP-TEST.log-v1-0=http://10.194.6.129:52758}
14-Dec-2019 00:17:47 2019-12-14 00:17:47.793  INFO 9525 --- [           main] o.s.c.d.acceptance.test.HttpSourceTests  : App 'http' has instances: {HTTP-TEST.http-v1-0=http://10.194.6.129:31439}
14-Dec-2019 00:17:47 2019-12-14 00:17:47.805  INFO 9525 --- [           main] o.s.c.d.acceptance.test.HttpSourceTests  : Looking for 'Started HttpSource' in logfile for http
14-Dec-2019 00:17:57 2019-12-14 00:17:57.806  INFO 9525 --- [           main] o.s.c.d.acceptance.test.HttpSourceTests  : Requesting log for app HTTP-TEST.http-v1-0
14-Dec-2019 00:17:58 2019-12-14 00:17:58.127  INFO 9525 --- [           main] o.s.c.d.acceptance.test.HttpSourceTests  : Retrieved logfile from 'http://10.194.6.129:31439/actuator/logfile
14-Dec-2019 00:17:58 2019-12-14 00:17:58.127  INFO 9525 --- [           main] o.s.c.d.acceptance.test.HttpSourceTests  : Matched all 'Started HttpSource' in logfile for app http (source HTTP-TEST.http-v1-0)
14-Dec-2019 00:17:58 2019-12-14 00:17:58.127  INFO 9525 --- [           main] o.s.c.d.acceptance.test.HttpSourceTests  : Looking for 'Started LogSink' in logfile for log
14-Dec-2019 00:18:08 2019-12-14 00:18:08.127  INFO 9525 --- [           main] o.s.c.d.acceptance.test.HttpSourceTests  : Requesting log for app HTTP-TEST.log-v1-0
14-Dec-2019 00:18:08 2019-12-14 00:18:08.270  INFO 9525 --- [           main] o.s.c.d.acceptance.test.HttpSourceTests  : Retrieved logfile from 'http://10.194.6.129:52758/actuator/logfile
14-Dec-2019 00:18:08 2019-12-14 00:18:08.270  INFO 9525 --- [           main] o.s.c.d.acceptance.test.HttpSourceTests  : Matched all 'Started LogSink' in logfile for app log (source HTTP-TEST.log-v1-0)
14-Dec-2019 00:18:08 2019-12-14 00:18:08.421  INFO 9525 --- [           main] o.s.c.d.acceptance.test.HttpSourceTests  : Looking for '72c386b5-b8cf-4b8b-8a11-caa44afa5cb8' in logfile for log
14-Dec-2019 00:18:18 2019-12-14 00:18:18.421  INFO 9525 --- [           main] o.s.c.d.acceptance.test.HttpSourceTests  : Requesting log for app HTTP-TEST.log-v1-0
14-Dec-2019 00:18:18 2019-12-14 00:18:18.438  INFO 9525 --- [           main] o.s.c.d.acceptance.test.HttpSourceTests  : Retrieved logfile from 'http://10.194.6.129:52758/actuator/logfile
14-Dec-2019 00:18:18 2019-12-14 00:18:18.438  INFO 9525 --- [           main] o.s.c.d.acceptance.test.HttpSourceTests  : Matched all '72c386b5-b8cf-4b8b-8a11-caa44afa5cb8' in logfile for app log (source HTTP-TEST.log-v1-0)
14-Dec-2019 00:18:18 2019-12-14 00:18:18.441  INFO 9525 --- [           main] junit.logTestName                        : Test httpSourceTests(org.springframework.cloud.dataflow.acceptance.test.HttpSourceTests) Succeeded
14-Dec-2019 00:18:18 2019-12-14 00:18:18.441  INFO 9525 --- [           main] junit.logTestName                        : Finished Test httpSourceTests(org.springframework.cloud.dataflow.acceptance.test.HttpSourceTests)
14-Dec-2019 00:18:18 2019-12-14 00:18:18.441  INFO 9525 --- [           main] o.s.c.d.acceptance.test.HttpSourceTests  : Destroy all streams
14-Dec-2019 00:18:18 Tests run: 1, Failures: 0, Errors: 0, Skipped: 0, Time elapsed: 61.929 sec - in org.springframework.cloud.dataflow.acceptance.test.HttpSourceTests
14-Dec-2019 00:18:18 Running org.springframework.cloud.dataflow.acceptance.test.TimestampTaskTests
14-Dec-2019 00:18:18 2019-12-14 00:18:18.682  INFO 9525 --- [           main] o.s.c.support.GenericApplicationContext  : Refreshing org.springframework.context.support.GenericApplicationContext@7a81065e: startup date [Sat Dec 14 00:18:18 UTC 2019]; root of context hierarchy
14-Dec-2019 00:18:18 2019-12-14 00:18:18.801  INFO 9525 --- [           main] junit.logTestName                        : Starting Test timeStampTests(org.springframework.cloud.dataflow.acceptance.test.TimestampTaskTests)
14-Dec-2019 00:18:18 2019-12-14 00:18:18.802  INFO 9525 --- [           main] o.s.c.d.a.test.AbstractTaskTests         : Importing task apps from uri resource: https://dataflow.spring.io/task-maven-latest
14-Dec-2019 00:18:19 2019-12-14 00:18:19.444  INFO 9525 --- [           main] o.s.c.d.a.test.AbstractTaskTests         : Done importing task apps.
14-Dec-2019 00:18:29 2019-12-14 00:18:29.892  INFO 9525 --- [           main] junit.logTestName                        : Test timeStampTests(org.springframework.cloud.dataflow.acceptance.test.TimestampTaskTests) Succeeded
14-Dec-2019 00:18:29 2019-12-14 00:18:29.892  INFO 9525 --- [           main] junit.logTestName                        : Finished Test timeStampTests(org.springframework.cloud.dataflow.acceptance.test.TimestampTaskTests)
14-Dec-2019 00:18:29 2019-12-14 00:18:29.969  INFO 9525 --- [           main] junit.logTestName                        : Starting Test timeStampTestsMultipleLaunch(org.springframework.cloud.dataflow.acceptance.test.TimestampTaskTests)
14-Dec-2019 00:18:50 2019-12-14 00:18:50.495  INFO 9525 --- [           main] junit.logTestName                        : Test timeStampTestsMultipleLaunch(org.springframework.cloud.dataflow.acceptance.test.TimestampTaskTests) Succeeded
14-Dec-2019 00:18:50 2019-12-14 00:18:50.495  INFO 9525 --- [           main] junit.logTestName                        : Finished Test timeStampTestsMultipleLaunch(org.springframework.cloud.dataflow.acceptance.test.TimestampTaskTests)
14-Dec-2019 00:18:50 Tests run: 2, Failures: 0, Errors: 0, Skipped: 0, Time elapsed: 31.817 sec - in org.springframework.cloud.dataflow.acceptance.test.TimestampTaskTests
14-Dec-2019 00:18:50 Running org.springframework.cloud.dataflow.acceptance.test.TickTockTests
14-Dec-2019 00:18:50 2019-12-14 00:18:50.496  INFO 9525 --- [           main] .b.t.c.SpringBootTestContextBootstrapper : Neither @ContextConfiguration nor @ContextHierarchy found for test class [org.springframework.cloud.dataflow.acceptance.test.TickTockTests], using SpringBootContextLoader
14-Dec-2019 00:18:50 2019-12-14 00:18:50.502  INFO 9525 --- [           main] .b.t.c.SpringBootTestContextBootstrapper : Loaded default TestExecutionListener class names from location [META-INF/spring.factories]: [org.springframework.boot.test.mock.mockito.MockitoTestExecutionListener, org.springframework.boot.test.mock.mockito.ResetMocksTestExecutionListener, org.springframework.boot.test.autoconfigure.restdocs.RestDocsTestExecutionListener, org.springframework.boot.test.autoconfigure.web.client.MockRestServiceServerResetTestExecutionListener, org.springframework.boot.test.autoconfigure.web.servlet.MockMvcPrintOnlyOnFailureTestExecutionListener, org.springframework.boot.test.autoconfigure.web.servlet.WebDriverTestExecutionListener, org.springframework.test.context.web.ServletTestExecutionListener, org.springframework.test.context.support.DirtiesContextBeforeModesTestExecutionListener, org.springframework.test.context.support.DependencyInjectionTestExecutionListener, org.springframework.test.context.support.DirtiesContextTestExecutionListener, org.springframework.test.context.transaction.TransactionalTestExecutionListener, org.springframework.test.context.jdbc.SqlScriptsTestExecutionListener]
14-Dec-2019 00:18:50 2019-12-14 00:18:50.504  INFO 9525 --- [           main] .b.t.c.SpringBootTestContextBootstrapper : Using TestExecutionListeners: [org.springframework.test.context.web.ServletTestExecutionListener@2a367e93, org.springframework.test.context.support.DirtiesContextBeforeModesTestExecutionListener@7f6874f2, org.springframework.boot.test.autoconfigure.SpringBootDependencyInjectionTestExecutionListener@1a6dc589, org.springframework.test.context.support.DirtiesContextTestExecutionListener@697a34af, org.springframework.test.context.transaction.TransactionalTestExecutionListener@70211df5, org.springframework.test.context.jdbc.SqlScriptsTestExecutionListener@4c5228e7, org.springframework.boot.test.mock.mockito.MockitoTestExecutionListener@38e7ed69, org.springframework.boot.test.autoconfigure.web.servlet.MockMvcPrintOnlyOnFailureTestExecutionListener@806996, org.springframework.boot.test.autoconfigure.web.client.MockRestServiceServerResetTestExecutionListener@78b612c6, org.springframework.boot.test.mock.mockito.ResetMocksTestExecutionListener@257e0827, org.springframework.boot.test.autoconfigure.web.servlet.WebDriverTestExecutionListener@22752544, org.springframework.boot.test.autoconfigure.restdocs.RestDocsTestExecutionListener@21ba2445]
14-Dec-2019 00:18:50 2019-12-14 00:18:50.585  INFO 9525 --- [           main] junit.logTestName                        : Starting Test tickTockUpdateRollbackTests(org.springframework.cloud.dataflow.acceptance.test.TickTockTests)
14-Dec-2019 00:18:50 2019-12-14 00:18:50.611  INFO 9525 --- [           main] o.s.c.d.acceptance.test.TickTockTests    : Creating stream 'TICKTOCK'
14-Dec-2019 00:18:50 2019-12-14 00:18:50.644  INFO 9525 --- [           main] o.s.c.d.acceptance.test.TickTockTests    : Deploying stream 'TICKTOCK' with properties: {app.*.spring.cloud.streamapp.security.enabled=false, app.*.logging.file=${PID}-test.log, app.*.endpoints.logfile.sensitive=false, app.log.log.expression='TICKTOCK - TIMESTAMP: '.concat(payload), app.*.management.endpoints.web.exposure.include=*}
14-Dec-2019 00:18:51 2019-12-14 00:18:51.259  INFO 9525 --- [           main] o.s.c.d.acceptance.test.TickTockTests    : Checking: Stream=TICKTOCK, status = deploying, status description = The stream is being deployed.
14-Dec-2019 00:18:51 2019-12-14 00:18:51.260  INFO 9525 --- [           main] o.s.c.d.acceptance.test.TickTockTests    : Sleeping to check status of Stream=TICKTOCK
14-Dec-2019 00:19:01 2019-12-14 00:19:01.317  INFO 9525 --- [           main] o.s.c.d.acceptance.test.TickTockTests    : Checking: Stream=TICKTOCK, status = deploying, status description = The stream is being deployed.
14-Dec-2019 00:19:01 2019-12-14 00:19:01.317  INFO 9525 --- [           main] o.s.c.d.acceptance.test.TickTockTests    : Sleeping to check status of Stream=TICKTOCK
14-Dec-2019 00:19:11 2019-12-14 00:19:11.365  INFO 9525 --- [           main] o.s.c.d.acceptance.test.TickTockTests    : Checking: Stream=TICKTOCK, status = deployed, status description = The stream has been successfully deployed
14-Dec-2019 00:19:11 2019-12-14 00:19:11.408  INFO 9525 --- [           main] o.s.c.d.acceptance.test.TickTockTests    : Sleeping to check status of Stream=TICKTOCK
14-Dec-2019 00:19:21 2019-12-14 00:19:21.409  INFO 9525 --- [           main] o.s.c.d.acceptance.test.TickTockTests    : Stream 'TICKTOCK' started with status: deployed
14-Dec-2019 00:19:21 2019-12-14 00:19:21.409  INFO 9525 --- [           main] o.s.c.d.acceptance.test.TickTockTests    : App 'log' has instances: {TICKTOCK.log-v1-0=http://10.194.6.129:47593}
14-Dec-2019 00:19:21 2019-12-14 00:19:21.409  INFO 9525 --- [           main] o.s.c.d.acceptance.test.TickTockTests    : App 'time' has instances: {TICKTOCK.time-v1-0=http://10.194.6.129:59809}
14-Dec-2019 00:19:21 2019-12-14 00:19:21.410  INFO 9525 --- [           main] o.s.c.d.acceptance.test.TickTockTests    : Looking for 'Started TimeSource' in logfile for time
14-Dec-2019 00:19:31 2019-12-14 00:19:31.410  INFO 9525 --- [           main] o.s.c.d.acceptance.test.TickTockTests    : Requesting log for app TICKTOCK.time-v1-0
14-Dec-2019 00:19:31 2019-12-14 00:19:31.717  INFO 9525 --- [           main] o.s.c.d.acceptance.test.TickTockTests    : Retrieved logfile from 'http://10.194.6.129:59809/actuator/logfile
14-Dec-2019 00:19:31 2019-12-14 00:19:31.717  INFO 9525 --- [           main] o.s.c.d.acceptance.test.TickTockTests    : Matched all 'Started TimeSource' in logfile for app time (source TICKTOCK.time-v1-0)
14-Dec-2019 00:19:31 2019-12-14 00:19:31.717  INFO 9525 --- [           main] o.s.c.d.acceptance.test.TickTockTests    : Looking for 'Started LogSink' in logfile for log
14-Dec-2019 00:19:41 2019-12-14 00:19:41.718  INFO 9525 --- [           main] o.s.c.d.acceptance.test.TickTockTests    : Requesting log for app TICKTOCK.log-v1-0
14-Dec-2019 00:19:41 2019-12-14 00:19:41.854  INFO 9525 --- [           main] o.s.c.d.acceptance.test.TickTockTests    : Retrieved logfile from 'http://10.194.6.129:47593/actuator/logfile
14-Dec-2019 00:19:41 2019-12-14 00:19:41.854  INFO 9525 --- [           main] o.s.c.d.acceptance.test.TickTockTests    : Matched all 'Started LogSink' in logfile for app log (source TICKTOCK.log-v1-0)
14-Dec-2019 00:19:41 2019-12-14 00:19:41.854  INFO 9525 --- [           main] o.s.c.d.acceptance.test.TickTockTests    : Looking for 'TICKTOCK - TIMESTAMP:' in logfile for log
14-Dec-2019 00:19:51 2019-12-14 00:19:51.854  INFO 9525 --- [           main] o.s.c.d.acceptance.test.TickTockTests    : Requesting log for app TICKTOCK.log-v1-0
14-Dec-2019 00:19:51 2019-12-14 00:19:51.871  INFO 9525 --- [           main] o.s.c.d.acceptance.test.TickTockTests    : Retrieved logfile from 'http://10.194.6.129:47593/actuator/logfile
14-Dec-2019 00:19:51 2019-12-14 00:19:51.872  INFO 9525 --- [           main] o.s.c.d.acceptance.test.TickTockTests    : Matched all 'TICKTOCK - TIMESTAMP:' in logfile for app log (source TICKTOCK.log-v1-0)
14-Dec-2019 00:19:51 2019-12-14 00:19:51.873  INFO 9525 --- [           main] o.s.c.d.acceptance.test.TickTockTests    : Updating stream 'TICKTOCK'
14-Dec-2019 00:19:52 2019-12-14 00:19:52.514  INFO 9525 --- [           main] o.s.c.d.acceptance.test.TickTockTests    : Checking: Stream=TICKTOCK, status = deploying, status description = The stream is being deployed.
14-Dec-2019 00:19:52 2019-12-14 00:19:52.514  INFO 9525 --- [           main] o.s.c.d.acceptance.test.TickTockTests    : Sleeping to check status of Stream=TICKTOCK
14-Dec-2019 00:20:02 2019-12-14 00:20:02.557  INFO 9525 --- [           main] o.s.c.d.acceptance.test.TickTockTests    : Checking: Stream=TICKTOCK, status = deployed, status description = The stream has been successfully deployed
14-Dec-2019 00:20:02 2019-12-14 00:20:02.588  INFO 9525 --- [           main] o.s.c.d.acceptance.test.TickTockTests    : Sleeping to check status of Stream=TICKTOCK
14-Dec-2019 00:20:12 2019-12-14 00:20:12.589  INFO 9525 --- [           main] o.s.c.d.acceptance.test.TickTockTests    : Stream 'TICKTOCK' started with status: deployed
14-Dec-2019 00:20:12 2019-12-14 00:20:12.591  INFO 9525 --- [           main] o.s.c.d.acceptance.test.TickTockTests    : App 'log' has instances: {TICKTOCK.log-v1-0=http://10.194.6.129:47593, TICKTOCK.log-v2-0=http://10.194.6.129:58408}
14-Dec-2019 00:20:12 2019-12-14 00:20:12.591  INFO 9525 --- [           main] o.s.c.d.acceptance.test.TickTockTests    : App 'time' has instances: {TICKTOCK.time-v1-0=http://10.194.6.129:59809}
14-Dec-2019 00:20:12 2019-12-14 00:20:12.591  INFO 9525 --- [           main] o.s.c.d.acceptance.test.TickTockTests    : Looking for 'Started LogSink' in logfile for log
14-Dec-2019 00:20:22 2019-12-14 00:20:22.592  INFO 9525 --- [           main] o.s.c.d.acceptance.test.TickTockTests    : Requesting log for app TICKTOCK.log-v1-0
14-Dec-2019 00:20:22 2019-12-14 00:20:22.593  WARN 9525 --- [           main] o.s.c.d.acceptance.test.TickTockTests    : Error while trying to access logfile from 'http://10.194.6.129:47593/logfile' due to : org.springframework.web.client.ResourceAccessException: I/O error on GET request for "http://10.194.6.129:47593/logfile": Connection refused (Connection refused); nested exception is java.net.ConnectException: Connection refused (Connection refused)
14-Dec-2019 00:20:22 2019-12-14 00:20:22.593  INFO 9525 --- [           main] o.s.c.d.acceptance.test.TickTockTests    : Requesting log for app TICKTOCK.log-v2-0
14-Dec-2019 00:20:22 2019-12-14 00:20:22.717  INFO 9525 --- [           main] o.s.c.d.acceptance.test.TickTockTests    : Retrieved logfile from 'http://10.194.6.129:58408/actuator/logfile
14-Dec-2019 00:20:22 2019-12-14 00:20:22.717  INFO 9525 --- [           main] o.s.c.d.acceptance.test.TickTockTests    : Matched all 'Started LogSink' in logfile for app log (source TICKTOCK.log-v2-0)
14-Dec-2019 00:20:22 2019-12-14 00:20:22.717  INFO 9525 --- [           main] o.s.c.d.acceptance.test.TickTockTests    : Looking for 'TICKTOCK Updated - TIMESTAMP:' in logfile for log
14-Dec-2019 00:20:32 2019-12-14 00:20:32.717  INFO 9525 --- [           main] o.s.c.d.acceptance.test.TickTockTests    : Requesting log for app TICKTOCK.log-v1-0
14-Dec-2019 00:20:32 2019-12-14 00:20:32.718  WARN 9525 --- [           main] o.s.c.d.acceptance.test.TickTockTests    : Error while trying to access logfile from 'http://10.194.6.129:47593/logfile' due to : org.springframework.web.client.ResourceAccessException: I/O error on GET request for "http://10.194.6.129:47593/logfile": Connection refused (Connection refused); nested exception is java.net.ConnectException: Connection refused (Connection refused)
14-Dec-2019 00:20:32 2019-12-14 00:20:32.719  INFO 9525 --- [           main] o.s.c.d.acceptance.test.TickTockTests    : Requesting log for app TICKTOCK.log-v2-0
14-Dec-2019 00:20:32 2019-12-14 00:20:32.730  INFO 9525 --- [           main] o.s.c.d.acceptance.test.TickTockTests    : Retrieved logfile from 'http://10.194.6.129:58408/actuator/logfile
14-Dec-2019 00:20:32 2019-12-14 00:20:32.731  INFO 9525 --- [           main] o.s.c.d.acceptance.test.TickTockTests    : Matched all 'TICKTOCK Updated - TIMESTAMP:' in logfile for app log (source TICKTOCK.log-v2-0)
14-Dec-2019 00:20:32 2019-12-14 00:20:32.731  INFO 9525 --- [           main] o.s.c.d.acceptance.test.TickTockTests    : Rolling back the stream 'TICKTOCK' to the version 0
14-Dec-2019 00:20:33 2019-12-14 00:20:33.213  INFO 9525 --- [           main] o.s.c.d.acceptance.test.TickTockTests    : Checking: Stream=TICKTOCK, status = deploying, status description = The stream is being deployed.
14-Dec-2019 00:20:33 2019-12-14 00:20:33.214  INFO 9525 --- [           main] o.s.c.d.acceptance.test.TickTockTests    : Sleeping to check status of Stream=TICKTOCK
14-Dec-2019 00:20:43 2019-12-14 00:20:43.255  INFO 9525 --- [           main] o.s.c.d.acceptance.test.TickTockTests    : Checking: Stream=TICKTOCK, status = deployed, status description = The stream has been successfully deployed
14-Dec-2019 00:20:43 2019-12-14 00:20:43.285  INFO 9525 --- [           main] o.s.c.d.acceptance.test.TickTockTests    : Sleeping to check status of Stream=TICKTOCK
14-Dec-2019 00:20:53 2019-12-14 00:20:53.286  INFO 9525 --- [           main] o.s.c.d.acceptance.test.TickTockTests    : Stream 'TICKTOCK' started with status: deployed
14-Dec-2019 00:20:53 2019-12-14 00:20:53.286  INFO 9525 --- [           main] o.s.c.d.acceptance.test.TickTockTests    : App 'log' has instances: {TICKTOCK.log-v1-0=http://10.194.6.129:47593, TICKTOCK.log-v3-0=http://10.194.6.129:33529, TICKTOCK.log-v2-0=http://10.194.6.129:58408}
14-Dec-2019 00:20:53 2019-12-14 00:20:53.287  INFO 9525 --- [           main] o.s.c.d.acceptance.test.TickTockTests    : App 'time' has instances: {TICKTOCK.time-v1-0=http://10.194.6.129:59809}
14-Dec-2019 00:20:53 2019-12-14 00:20:53.287  INFO 9525 --- [           main] o.s.c.d.acceptance.test.TickTockTests    : Looking for 'TICKTOCK - TIMESTAMP:' in logfile for log
14-Dec-2019 00:21:03 2019-12-14 00:21:03.287  INFO 9525 --- [           main] o.s.c.d.acceptance.test.TickTockTests    : Requesting log for app TICKTOCK.log-v1-0
14-Dec-2019 00:21:03 2019-12-14 00:21:03.290  WARN 9525 --- [           main] o.s.c.d.acceptance.test.TickTockTests    : Error while trying to access logfile from 'http://10.194.6.129:47593/logfile' due to : org.springframework.web.client.ResourceAccessException: I/O error on GET request for "http://10.194.6.129:47593/logfile": Connection refused (Connection refused); nested exception is java.net.ConnectException: Connection refused (Connection refused)
14-Dec-2019 00:21:03 2019-12-14 00:21:03.290  INFO 9525 --- [           main] o.s.c.d.acceptance.test.TickTockTests    : Requesting log for app TICKTOCK.log-v3-0
14-Dec-2019 00:21:03 2019-12-14 00:21:03.451  INFO 9525 --- [           main] o.s.c.d.acceptance.test.TickTockTests    : Retrieved logfile from 'http://10.194.6.129:33529/actuator/logfile
14-Dec-2019 00:21:03 2019-12-14 00:21:03.451  INFO 9525 --- [           main] o.s.c.d.acceptance.test.TickTockTests    : Requesting log for app TICKTOCK.log-v2-0
14-Dec-2019 00:21:03 2019-12-14 00:21:03.452  WARN 9525 --- [           main] o.s.c.d.acceptance.test.TickTockTests    : Error while trying to access logfile from 'http://10.194.6.129:58408/logfile' due to : org.springframework.web.client.ResourceAccessException: I/O error on GET request for "http://10.194.6.129:58408/logfile": Connection refused (Connection refused); nested exception is java.net.ConnectException: Connection refused (Connection refused)
14-Dec-2019 00:21:03 2019-12-14 00:21:03.452  INFO 9525 --- [           main] o.s.c.d.acceptance.test.TickTockTests    : Matched all 'TICKTOCK - TIMESTAMP:' in logfile for app log (source TICKTOCK.log-v3-0)
14-Dec-2019 00:21:03 2019-12-14 00:21:03.455  INFO 9525 --- [           main] junit.logTestName                        : Test tickTockUpdateRollbackTests(org.springframework.cloud.dataflow.acceptance.test.TickTockTests) Succeeded
14-Dec-2019 00:21:03 2019-12-14 00:21:03.455  INFO 9525 --- [           main] junit.logTestName                        : Finished Test tickTockUpdateRollbackTests(org.springframework.cloud.dataflow.acceptance.test.TickTockTests)
14-Dec-2019 00:21:03 2019-12-14 00:21:03.455  INFO 9525 --- [           main] o.s.c.d.acceptance.test.TickTockTests    : Destroy all streams
14-Dec-2019 00:21:03 2019-12-14 00:21:03.821  INFO 9525 --- [           main] junit.logTestName                        : Starting Test tickTockTests(org.springframework.cloud.dataflow.acceptance.test.TickTockTests)
14-Dec-2019 00:21:03 2019-12-14 00:21:03.823  INFO 9525 --- [           main] o.s.c.d.acceptance.test.TickTockTests    : Creating stream 'TICKTOCK'
14-Dec-2019 00:21:03 2019-12-14 00:21:03.864  INFO 9525 --- [           main] o.s.c.d.acceptance.test.TickTockTests    : Deploying stream 'TICKTOCK' with properties: {app.*.spring.cloud.streamapp.security.enabled=false, app.*.logging.file=${PID}-test.log, app.*.endpoints.logfile.sensitive=false, app.log.log.expression='TICKTOCK - TIMESTAMP: '.concat(payload), app.*.management.endpoints.web.exposure.include=*}
14-Dec-2019 00:21:04 2019-12-14 00:21:04.471  INFO 9525 --- [           main] o.s.c.d.acceptance.test.TickTockTests    : Checking: Stream=TICKTOCK, status = deploying, status description = The stream is being deployed.
14-Dec-2019 00:21:04 2019-12-14 00:21:04.471  INFO 9525 --- [           main] o.s.c.d.acceptance.test.TickTockTests    : Sleeping to check status of Stream=TICKTOCK
14-Dec-2019 00:21:14 2019-12-14 00:21:14.505  INFO 9525 --- [           main] o.s.c.d.acceptance.test.TickTockTests    : Checking: Stream=TICKTOCK, status = deploying, status description = The stream is being deployed.
14-Dec-2019 00:21:14 2019-12-14 00:21:14.505  INFO 9525 --- [           main] o.s.c.d.acceptance.test.TickTockTests    : Sleeping to check status of Stream=TICKTOCK
14-Dec-2019 00:21:24 2019-12-14 00:21:24.550  INFO 9525 --- [           main] o.s.c.d.acceptance.test.TickTockTests    : Checking: Stream=TICKTOCK, status = deployed, status description = The stream has been successfully deployed
14-Dec-2019 00:21:24 2019-12-14 00:21:24.577  INFO 9525 --- [           main] o.s.c.d.acceptance.test.TickTockTests    : Sleeping to check status of Stream=TICKTOCK
14-Dec-2019 00:21:34 2019-12-14 00:21:34.578  INFO 9525 --- [           main] o.s.c.d.acceptance.test.TickTockTests    : Stream 'TICKTOCK' started with status: deployed
14-Dec-2019 00:21:34 2019-12-14 00:21:34.578  INFO 9525 --- [           main] o.s.c.d.acceptance.test.TickTockTests    : App 'log' has instances: {TICKTOCK.log-v4-0=http://10.194.6.129:47340}
14-Dec-2019 00:21:34 2019-12-14 00:21:34.579  INFO 9525 --- [           main] o.s.c.d.acceptance.test.TickTockTests    : App 'time' has instances: {TICKTOCK.time-v4-0=http://10.194.6.129:42453}
14-Dec-2019 00:21:34 2019-12-14 00:21:34.579  INFO 9525 --- [           main] o.s.c.d.acceptance.test.TickTockTests    : Looking for 'Started TimeSource' in logfile for time
14-Dec-2019 00:21:44 2019-12-14 00:21:44.579  INFO 9525 --- [           main] o.s.c.d.acceptance.test.TickTockTests    : Requesting log for app TICKTOCK.time-v4-0
14-Dec-2019 00:21:44 2019-12-14 00:21:44.891  INFO 9525 --- [           main] o.s.c.d.acceptance.test.TickTockTests    : Retrieved logfile from 'http://10.194.6.129:42453/actuator/logfile
14-Dec-2019 00:21:44 2019-12-14 00:21:44.891  INFO 9525 --- [           main] o.s.c.d.acceptance.test.TickTockTests    : Matched all 'Started TimeSource' in logfile for app time (source TICKTOCK.time-v4-0)
14-Dec-2019 00:21:44 2019-12-14 00:21:44.891  INFO 9525 --- [           main] o.s.c.d.acceptance.test.TickTockTests    : Looking for 'Started LogSink' in logfile for log
14-Dec-2019 00:21:54 2019-12-14 00:21:54.891  INFO 9525 --- [           main] o.s.c.d.acceptance.test.TickTockTests    : Requesting log for app TICKTOCK.log-v4-0
14-Dec-2019 00:21:55 2019-12-14 00:21:55.033  INFO 9525 --- [           main] o.s.c.d.acceptance.test.TickTockTests    : Retrieved logfile from 'http://10.194.6.129:47340/actuator/logfile
14-Dec-2019 00:21:55 2019-12-14 00:21:55.034  INFO 9525 --- [           main] o.s.c.d.acceptance.test.TickTockTests    : Matched all 'Started LogSink' in logfile for app log (source TICKTOCK.log-v4-0)
14-Dec-2019 00:21:55 2019-12-14 00:21:55.034  INFO 9525 --- [           main] o.s.c.d.acceptance.test.TickTockTests    : Looking for 'TICKTOCK - TIMESTAMP:' in logfile for log
14-Dec-2019 00:22:05 2019-12-14 00:22:05.034  INFO 9525 --- [           main] o.s.c.d.acceptance.test.TickTockTests    : Requesting log for app TICKTOCK.log-v4-0
14-Dec-2019 00:22:05 2019-12-14 00:22:05.048  INFO 9525 --- [           main] o.s.c.d.acceptance.test.TickTockTests    : Retrieved logfile from 'http://10.194.6.129:47340/actuator/logfile
14-Dec-2019 00:22:05 2019-12-14 00:22:05.049  INFO 9525 --- [           main] o.s.c.d.acceptance.test.TickTockTests    : Matched all 'TICKTOCK - TIMESTAMP:' in logfile for app log (source TICKTOCK.log-v4-0)
14-Dec-2019 00:22:05 2019-12-14 00:22:05.063  INFO 9525 --- [           main] junit.logTestName                        : Test tickTockTests(org.springframework.cloud.dataflow.acceptance.test.TickTockTests) Succeeded
14-Dec-2019 00:22:05 2019-12-14 00:22:05.063  INFO 9525 --- [           main] junit.logTestName                        : Finished Test tickTockTests(org.springframework.cloud.dataflow.acceptance.test.TickTockTests)
14-Dec-2019 00:22:05 2019-12-14 00:22:05.064  INFO 9525 --- [           main] o.s.c.d.acceptance.test.TickTockTests    : Destroy all streams
14-Dec-2019 00:22:05 2019-12-14 00:22:05.341  INFO 9525 --- [           main] junit.logTestName                        : Starting Test tickTockTestsFromConfigServer(org.springframework.cloud.dataflow.acceptance.test.TickTockTests)
14-Dec-2019 00:22:05 2019-12-14 00:22:05.350  INFO 9525 --- [           main] junit.logTestName                        : Finished Test tickTockTestsFromConfigServer(org.springframework.cloud.dataflow.acceptance.test.TickTockTests)
14-Dec-2019 00:22:05 2019-12-14 00:22:05.351  INFO 9525 --- [           main] o.s.c.d.acceptance.test.TickTockTests    : Destroy all streams
14-Dec-2019 00:22:05 Tests run: 3, Failures: 0, Errors: 0, Skipped: 1, Time elapsed: 194.859 sec - in org.springframework.cloud.dataflow.acceptance.test.TickTockTests
14-Dec-2019 00:22:05 Running org.springframework.cloud.dataflow.acceptance.test.ComposedTaskTests
14-Dec-2019 00:22:05 2019-12-14 00:22:05.416  INFO 9525 --- [           main] junit.logTestName                        : Starting Test ctrMultipleLaunchWithArguments(org.springframework.cloud.dataflow.acceptance.test.ComposedTaskTests)
14-Dec-2019 00:25:06 2019-12-14 00:25:06.099 ERROR 9525 --- [           main] junit.logTestName                        : !!! Test ctrMultipleLaunchWithArguments(org.springframework.cloud.dataflow.acceptance.test.ComposedTaskTests) Failed !!!
14-Dec-2019 00:25:06
14-Dec-2019 00:25:06 java.lang.AssertionError: null
14-Dec-2019 00:25:06         at org.junit.Assert.fail(Assert.java:86)
14-Dec-2019 00:25:06         at org.junit.Assert.assertTrue(Assert.java:41)
14-Dec-2019 00:25:06         at org.junit.Assert.assertTrue(Assert.java:52)
14-Dec-2019 00:25:06         at org.springframework.cloud.dataflow.acceptance.test.ComposedTaskTests.assertTaskExecutions(ComposedTaskTests.java:65)
14-Dec-2019 00:25:06         at org.springframework.cloud.dataflow.acceptance.test.ComposedTaskTests.ctrMultipleLaunchWithArguments(ComposedTaskTests.java:57)
14-Dec-2019 00:25:06         at sun.reflect.NativeMethodAccessorImpl.invoke0(Native Method)
14-Dec-2019 00:25:06         at sun.reflect.NativeMethodAccessorImpl.invoke(NativeMethodAccessorImpl.java:62)
14-Dec-2019 00:25:06         at sun.reflect.DelegatingMethodAccessorImpl.invoke(DelegatingMethodAccessorImpl.java:43)
14-Dec-2019 00:25:06         at java.lang.reflect.Method.invoke(Method.java:498)
14-Dec-2019 00:25:06         at org.junit.runners.model.FrameworkMethod$1.runReflectiveCall(FrameworkMethod.java:50)
14-Dec-2019 00:25:06         at org.junit.internal.runners.model.ReflectiveCallable.run(ReflectiveCallable.java:12)
14-Dec-2019 00:25:06         at org.junit.runners.model.FrameworkMethod.invokeExplosively(FrameworkMethod.java:47)
14-Dec-2019 00:25:06         at org.junit.internal.runners.statements.InvokeMethod.evaluate(InvokeMethod.java:17)
14-Dec-2019 00:25:06         at org.junit.internal.runners.statements.RunBefores.evaluate(RunBefores.java:26)
14-Dec-2019 00:25:06         at org.springframework.test.context.junit4.statements.RunBeforeTestMethodCallbacks.evaluate(RunBeforeTestMethodCallbacks.java:75)
14-Dec-2019 00:25:06         at org.junit.internal.runners.statements.RunAfters.evaluate(RunAfters.java:27)
14-Dec-2019 00:25:06         at org.springframework.test.context.junit4.statements.RunAfterTestMethodCallbacks.evaluate(RunAfterTestMethodCallbacks.java:86)
14-Dec-2019 00:25:06         at org.junit.rules.TestWatcher$1.evaluate(TestWatcher.java:55)
14-Dec-2019 00:25:06         at org.junit.rules.RunRules.evaluate(RunRules.java:20)
14-Dec-2019 00:25:06         at org.springframework.test.context.junit4.statements.SpringRepeat.evaluate(SpringRepeat.java:84)
14-Dec-2019 00:25:06         at org.junit.runners.ParentRunner.runLeaf(ParentRunner.java:325)
14-Dec-2019 00:25:06         at org.springframework.test.context.junit4.SpringJUnit4ClassRunner.runChild(SpringJUnit4ClassRunner.java:252)
14-Dec-2019 00:25:06         at org.springframework.test.context.junit4.SpringJUnit4ClassRunner.runChild(SpringJUnit4ClassRunner.java:94)
14-Dec-2019 00:25:06         at org.junit.runners.ParentRunner$3.run(ParentRunner.java:290)
14-Dec-2019 00:25:06         at org.junit.runners.ParentRunner$1.schedule(ParentRunner.java:71)
14-Dec-2019 00:25:06         at org.junit.runners.ParentRunner.runChildren(ParentRunner.java:288)
14-Dec-2019 00:25:06         at org.junit.runners.ParentRunner.access$000(ParentRunner.java:58)
14-Dec-2019 00:25:06         at org.junit.runners.ParentRunner$2.evaluate(ParentRunner.java:268)
14-Dec-2019 00:25:06         at org.springframework.test.context.junit4.statements.RunBeforeTestClassCallbacks.evaluate(RunBeforeTestClassCallbacks.java:61)
14-Dec-2019 00:25:06         at org.springframework.test.context.junit4.statements.RunAfterTestClassCallbacks.evaluate(RunAfterTestClassCallbacks.java:70)
14-Dec-2019 00:25:06         at org.junit.runners.ParentRunner.run(ParentRunner.java:363)
14-Dec-2019 00:25:06         at org.springframework.test.context.junit4.SpringJUnit4ClassRunner.run(SpringJUnit4ClassRunner.java:191)
14-Dec-2019 00:25:06         at org.apache.maven.surefire.junit4.JUnit4Provider.execute(JUnit4Provider.java:283)
14-Dec-2019 00:25:06         at org.apache.maven.surefire.junit4.JUnit4Provider.executeWithRerun(JUnit4Provider.java:173)
14-Dec-2019 00:25:06         at org.apache.maven.surefire.junit4.JUnit4Provider.executeTestSet(JUnit4Provider.java:153)
14-Dec-2019 00:25:06         at org.apache.maven.surefire.junit4.JUnit4Provider.invoke(JUnit4Provider.java:128)
14-Dec-2019 00:25:06         at org.apache.maven.surefire.booter.ForkedBooter.invokeProviderInSameClassLoader(ForkedBooter.java:203)
14-Dec-2019 00:25:06         at org.apache.maven.surefire.booter.ForkedBooter.runSuitesInProcess(ForkedBooter.java:155)
14-Dec-2019 00:25:06         at org.apache.maven.surefire.booter.ForkedBooter.main(ForkedBooter.java:103)
14-Dec-2019 00:25:06
14-Dec-2019 00:25:06 2019-12-14 00:25:06.101  INFO 9525 --- [           main] junit.logTestName                        : Finished Test ctrMultipleLaunchWithArguments(org.springframework.cloud.dataflow.acceptance.test.ComposedTaskTests)
14-Dec-2019 00:25:06 2019-12-14 00:25:06.176  INFO 9525 --- [           main] junit.logTestName                        : Starting Test ctrMultipleLaunch(org.springframework.cloud.dataflow.acceptance.test.ComposedTaskTests)
14-Dec-2019 00:28:06 2019-12-14 00:28:06.791 ERROR 9525 --- [           main] junit.logTestName                        : !!! Test ctrMultipleLaunch(org.springframework.cloud.dataflow.acceptance.test.ComposedTaskTests) Failed !!!
14-Dec-2019 00:28:06
14-Dec-2019 00:28:06 java.lang.AssertionError: null
14-Dec-2019 00:28:06         at org.junit.Assert.fail(Assert.java:86)
14-Dec-2019 00:28:06         at org.junit.Assert.assertTrue(Assert.java:41)
14-Dec-2019 00:28:06         at org.junit.Assert.assertTrue(Assert.java:52)
14-Dec-2019 00:28:06         at org.springframework.cloud.dataflow.acceptance.test.ComposedTaskTests.assertTaskExecutions(ComposedTaskTests.java:65)
14-Dec-2019 00:28:06         at org.springframework.cloud.dataflow.acceptance.test.ComposedTaskTests.ctrMultipleLaunch(ComposedTaskTests.java:47)
14-Dec-2019 00:28:06         at sun.reflect.NativeMethodAccessorImpl.invoke0(Native Method)
14-Dec-2019 00:28:06         at sun.reflect.NativeMethodAccessorImpl.invoke(NativeMethodAccessorImpl.java:62)
14-Dec-2019 00:28:06         at sun.reflect.DelegatingMethodAccessorImpl.invoke(DelegatingMethodAccessorImpl.java:43)
14-Dec-2019 00:28:06         at java.lang.reflect.Method.invoke(Method.java:498)
14-Dec-2019 00:28:06         at org.junit.runners.model.FrameworkMethod$1.runReflectiveCall(FrameworkMethod.java:50)
14-Dec-2019 00:28:06         at org.junit.internal.runners.model.ReflectiveCallable.run(ReflectiveCallable.java:12)
14-Dec-2019 00:28:06         at org.junit.runners.model.FrameworkMethod.invokeExplosively(FrameworkMethod.java:47)
14-Dec-2019 00:28:06         at org.junit.internal.runners.statements.InvokeMethod.evaluate(InvokeMethod.java:17)
14-Dec-2019 00:28:06         at org.junit.internal.runners.statements.RunBefores.evaluate(RunBefores.java:26)
14-Dec-2019 00:28:06         at org.springframework.test.context.junit4.statements.RunBeforeTestMethodCallbacks.evaluate(RunBeforeTestMethodCallbacks.java:75)
14-Dec-2019 00:28:06         at org.junit.internal.runners.statements.RunAfters.evaluate(RunAfters.java:27)
14-Dec-2019 00:28:06         at org.springframework.test.context.junit4.statements.RunAfterTestMethodCallbacks.evaluate(RunAfterTestMethodCallbacks.java:86)
14-Dec-2019 00:28:06         at org.junit.rules.TestWatcher$1.evaluate(TestWatcher.java:55)
14-Dec-2019 00:28:06         at org.junit.rules.RunRules.evaluate(RunRules.java:20)
14-Dec-2019 00:28:06         at org.springframework.test.context.junit4.statements.SpringRepeat.evaluate(SpringRepeat.java:84)
14-Dec-2019 00:28:06         at org.junit.runners.ParentRunner.runLeaf(ParentRunner.java:325)
14-Dec-2019 00:28:06         at org.springframework.test.context.junit4.SpringJUnit4ClassRunner.runChild(SpringJUnit4ClassRunner.java:252)
14-Dec-2019 00:28:06         at org.springframework.test.context.junit4.SpringJUnit4ClassRunner.runChild(SpringJUnit4ClassRunner.java:94)
14-Dec-2019 00:28:06         at org.junit.runners.ParentRunner$3.run(ParentRunner.java:290)
14-Dec-2019 00:28:06         at org.junit.runners.ParentRunner$1.schedule(ParentRunner.java:71)
14-Dec-2019 00:28:06         at org.junit.runners.ParentRunner.runChildren(ParentRunner.java:288)
14-Dec-2019 00:28:06         at org.junit.runners.ParentRunner.access$000(ParentRunner.java:58)
14-Dec-2019 00:28:06         at org.junit.runners.ParentRunner$2.evaluate(ParentRunner.java:268)
14-Dec-2019 00:28:06         at org.springframework.test.context.junit4.statements.RunBeforeTestClassCallbacks.evaluate(RunBeforeTestClassCallbacks.java:61)
14-Dec-2019 00:28:06         at org.springframework.test.context.junit4.statements.RunAfterTestClassCallbacks.evaluate(RunAfterTestClassCallbacks.java:70)
14-Dec-2019 00:28:06         at org.junit.runners.ParentRunner.run(ParentRunner.java:363)
14-Dec-2019 00:28:06         at org.springframework.test.context.junit4.SpringJUnit4ClassRunner.run(SpringJUnit4ClassRunner.java:191)
14-Dec-2019 00:28:06         at org.apache.maven.surefire.junit4.JUnit4Provider.execute(JUnit4Provider.java:283)
14-Dec-2019 00:28:06         at org.apache.maven.surefire.junit4.JUnit4Provider.executeWithRerun(JUnit4Provider.java:173)
14-Dec-2019 00:28:06         at org.apache.maven.surefire.junit4.JUnit4Provider.executeTestSet(JUnit4Provider.java:153)
14-Dec-2019 00:28:06         at org.apache.maven.surefire.junit4.JUnit4Provider.invoke(JUnit4Provider.java:128)
14-Dec-2019 00:28:06         at org.apache.maven.surefire.booter.ForkedBooter.invokeProviderInSameClassLoader(ForkedBooter.java:203)
14-Dec-2019 00:28:06         at org.apache.maven.surefire.booter.ForkedBooter.runSuitesInProcess(ForkedBooter.java:155)
14-Dec-2019 00:28:06         at org.apache.maven.surefire.booter.ForkedBooter.main(ForkedBooter.java:103)
14-Dec-2019 00:28:06
14-Dec-2019 00:28:06 2019-12-14 00:28:06.792  INFO 9525 --- [           main] junit.logTestName                        : Finished Test ctrMultipleLaunch(org.springframework.cloud.dataflow.acceptance.test.ComposedTaskTests)
14-Dec-2019 00:28:06 2019-12-14 00:28:06.868  INFO 9525 --- [           main] junit.logTestName                        : Starting Test ctrLaunch(org.springframework.cloud.dataflow.acceptance.test.ComposedTaskTests)
14-Dec-2019 00:31:07 2019-12-14 00:31:07.579 ERROR 9525 --- [           main] junit.logTestName                        : !!! Test ctrLaunch(org.springframework.cloud.dataflow.acceptance.test.ComposedTaskTests) Failed !!!
14-Dec-2019 00:31:07
14-Dec-2019 00:31:07 java.lang.AssertionError: null
14-Dec-2019 00:31:07         at org.junit.Assert.fail(Assert.java:86)
14-Dec-2019 00:31:07         at org.junit.Assert.assertTrue(Assert.java:41)
14-Dec-2019 00:31:07         at org.junit.Assert.assertTrue(Assert.java:52)
14-Dec-2019 00:31:07         at org.springframework.cloud.dataflow.acceptance.test.ComposedTaskTests.assertTaskExecutions(ComposedTaskTests.java:65)
14-Dec-2019 00:31:07         at org.springframework.cloud.dataflow.acceptance.test.ComposedTaskTests.ctrLaunch(ComposedTaskTests.java:41)
14-Dec-2019 00:31:07         at sun.reflect.NativeMethodAccessorImpl.invoke0(Native Method)
14-Dec-2019 00:31:07         at sun.reflect.NativeMethodAccessorImpl.invoke(NativeMethodAccessorImpl.java:62)
14-Dec-2019 00:31:07         at sun.reflect.DelegatingMethodAccessorImpl.invoke(DelegatingMethodAccessorImpl.java:43)
14-Dec-2019 00:31:07         at java.lang.reflect.Method.invoke(Method.java:498)
14-Dec-2019 00:31:07         at org.junit.runners.model.FrameworkMethod$1.runReflectiveCall(FrameworkMethod.java:50)
14-Dec-2019 00:31:07         at org.junit.internal.runners.model.ReflectiveCallable.run(ReflectiveCallable.java:12)
14-Dec-2019 00:31:07         at org.junit.runners.model.FrameworkMethod.invokeExplosively(FrameworkMethod.java:47)
14-Dec-2019 00:31:07         at org.junit.internal.runners.statements.InvokeMethod.evaluate(InvokeMethod.java:17)
14-Dec-2019 00:31:07         at org.junit.internal.runners.statements.RunBefores.evaluate(RunBefores.java:26)
14-Dec-2019 00:31:07         at org.springframework.test.context.junit4.statements.RunBeforeTestMethodCallbacks.evaluate(RunBeforeTestMethodCallbacks.java:75)
14-Dec-2019 00:31:07         at org.junit.internal.runners.statements.RunAfters.evaluate(RunAfters.java:27)
14-Dec-2019 00:31:07         at org.springframework.test.context.junit4.statements.RunAfterTestMethodCallbacks.evaluate(RunAfterTestMethodCallbacks.java:86)
14-Dec-2019 00:31:07         at org.junit.rules.TestWatcher$1.evaluate(TestWatcher.java:55)
14-Dec-2019 00:31:07         at org.junit.rules.RunRules.evaluate(RunRules.java:20)
14-Dec-2019 00:31:07         at org.springframework.test.context.junit4.statements.SpringRepeat.evaluate(SpringRepeat.java:84)
14-Dec-2019 00:31:07         at org.junit.runners.ParentRunner.runLeaf(ParentRunner.java:325)
14-Dec-2019 00:31:07         at org.springframework.test.context.junit4.SpringJUnit4ClassRunner.runChild(SpringJUnit4ClassRunner.java:252)
14-Dec-2019 00:31:07         at org.springframework.test.context.junit4.SpringJUnit4ClassRunner.runChild(SpringJUnit4ClassRunner.java:94)
14-Dec-2019 00:31:07         at org.junit.runners.ParentRunner$3.run(ParentRunner.java:290)
14-Dec-2019 00:31:07         at org.junit.runners.ParentRunner$1.schedule(ParentRunner.java:71)
14-Dec-2019 00:31:07         at org.junit.runners.ParentRunner.runChildren(ParentRunner.java:288)
14-Dec-2019 00:31:07         at org.junit.runners.ParentRunner.access$000(ParentRunner.java:58)
14-Dec-2019 00:31:07         at org.junit.runners.ParentRunner$2.evaluate(ParentRunner.java:268)
14-Dec-2019 00:31:07         at org.springframework.test.context.junit4.statements.RunBeforeTestClassCallbacks.evaluate(RunBeforeTestClassCallbacks.java:61)
14-Dec-2019 00:31:07         at org.springframework.test.context.junit4.statements.RunAfterTestClassCallbacks.evaluate(RunAfterTestClassCallbacks.java:70)
14-Dec-2019 00:31:07         at org.junit.runners.ParentRunner.run(ParentRunner.java:363)
14-Dec-2019 00:31:07         at org.springframework.test.context.junit4.SpringJUnit4ClassRunner.run(SpringJUnit4ClassRunner.java:191)
14-Dec-2019 00:31:07         at org.apache.maven.surefire.junit4.JUnit4Provider.execute(JUnit4Provider.java:283)
14-Dec-2019 00:31:07         at org.apache.maven.surefire.junit4.JUnit4Provider.executeWithRerun(JUnit4Provider.java:173)
14-Dec-2019 00:31:07         at org.apache.maven.surefire.junit4.JUnit4Provider.executeTestSet(JUnit4Provider.java:153)
14-Dec-2019 00:31:07         at org.apache.maven.surefire.junit4.JUnit4Provider.invoke(JUnit4Provider.java:128)
14-Dec-2019 00:31:07         at org.apache.maven.surefire.booter.ForkedBooter.invokeProviderInSameClassLoader(ForkedBooter.java:203)
14-Dec-2019 00:31:07         at org.apache.maven.surefire.booter.ForkedBooter.runSuitesInProcess(ForkedBooter.java:155)
14-Dec-2019 00:31:07         at org.apache.maven.surefire.booter.ForkedBooter.main(ForkedBooter.java:103)
14-Dec-2019 00:31:07
14-Dec-2019 00:31:07 2019-12-14 00:31:07.580  INFO 9525 --- [           main] junit.logTestName                        : Finished Test ctrLaunch(org.springframework.cloud.dataflow.acceptance.test.ComposedTaskTests)
14-Dec-2019 00:31:07 Tests run: 3, Failures: 3, Errors: 0, Skipped: 0, Time elapsed: 542.224 sec <<< FAILURE! - in org.springframework.cloud.dataflow.acceptance.test.ComposedTaskTests
14-Dec-2019 00:31:07 ctrMultipleLaunchWithArguments(org.springframework.cloud.dataflow.acceptance.test.ComposedTaskTests)  Time elapsed: 180.691 sec  <<< FAILURE!
14-Dec-2019 00:31:07 java.lang.AssertionError: null
14-Dec-2019 00:31:07         at org.junit.Assert.fail(Assert.java:86)
14-Dec-2019 00:31:07         at org.junit.Assert.assertTrue(Assert.java:41)
14-Dec-2019 00:31:07         at org.junit.Assert.assertTrue(Assert.java:52)
14-Dec-2019 00:31:07         at org.springframework.cloud.dataflow.acceptance.test.ComposedTaskTests.assertTaskExecutions(ComposedTaskTests.java:65)
14-Dec-2019 00:31:07         at org.springframework.cloud.dataflow.acceptance.test.ComposedTaskTests.ctrMultipleLaunchWithArguments(ComposedTaskTests.java:57)
14-Dec-2019 00:31:07
14-Dec-2019 00:31:07 ctrMultipleLaunch(org.springframework.cloud.dataflow.acceptance.test.ComposedTaskTests)  Time elapsed: 180.617 sec  <<< FAILURE!
14-Dec-2019 00:31:07 java.lang.AssertionError: null
14-Dec-2019 00:31:07         at org.junit.Assert.fail(Assert.java:86)
14-Dec-2019 00:31:07         at org.junit.Assert.assertTrue(Assert.java:41)
14-Dec-2019 00:31:07         at org.junit.Assert.assertTrue(Assert.java:52)
14-Dec-2019 00:31:07         at org.springframework.cloud.dataflow.acceptance.test.ComposedTaskTests.assertTaskExecutions(ComposedTaskTests.java:65)
14-Dec-2019 00:31:07         at org.springframework.cloud.dataflow.acceptance.test.ComposedTaskTests.ctrMultipleLaunch(ComposedTaskTests.java:47)
14-Dec-2019 00:31:07
14-Dec-2019 00:31:07 ctrLaunch(org.springframework.cloud.dataflow.acceptance.test.ComposedTaskTests)  Time elapsed: 180.713 sec  <<< FAILURE!
14-Dec-2019 00:31:07 java.lang.AssertionError: null
14-Dec-2019 00:31:07         at org.junit.Assert.fail(Assert.java:86)
14-Dec-2019 00:31:07         at org.junit.Assert.assertTrue(Assert.java:41)
14-Dec-2019 00:31:07         at org.junit.Assert.assertTrue(Assert.java:52)
14-Dec-2019 00:31:07         at org.springframework.cloud.dataflow.acceptance.test.ComposedTaskTests.assertTaskExecutions(ComposedTaskTests.java:65)
14-Dec-2019 00:31:07         at org.springframework.cloud.dataflow.acceptance.test.ComposedTaskTests.ctrLaunch(ComposedTaskTests.java:41)
14-Dec-2019 00:31:07
14-Dec-2019 00:31:07 Running org.springframework.cloud.dataflow.acceptance.test.TransformTests
14-Dec-2019 00:31:07 2019-12-14 00:31:07.584  INFO 9525 --- [           main] .b.t.c.SpringBootTestContextBootstrapper : Neither @ContextConfiguration nor @ContextHierarchy found for test class [org.springframework.cloud.dataflow.acceptance.test.TransformTests], using SpringBootContextLoader
14-Dec-2019 00:31:07 2019-12-14 00:31:07.598  INFO 9525 --- [           main] .b.t.c.SpringBootTestContextBootstrapper : Loaded default TestExecutionListener class names from location [META-INF/spring.factories]: [org.springframework.boot.test.mock.mockito.MockitoTestExecutionListener, org.springframework.boot.test.mock.mockito.ResetMocksTestExecutionListener, org.springframework.boot.test.autoconfigure.restdocs.RestDocsTestExecutionListener, org.springframework.boot.test.autoconfigure.web.client.MockRestServiceServerResetTestExecutionListener, org.springframework.boot.test.autoconfigure.web.servlet.MockMvcPrintOnlyOnFailureTestExecutionListener, org.springframework.boot.test.autoconfigure.web.servlet.WebDriverTestExecutionListener, org.springframework.test.context.web.ServletTestExecutionListener, org.springframework.test.context.support.DirtiesContextBeforeModesTestExecutionListener, org.springframework.test.context.support.DependencyInjectionTestExecutionListener, org.springframework.test.context.support.DirtiesContextTestExecutionListener, org.springframework.test.context.transaction.TransactionalTestExecutionListener, org.springframework.test.context.jdbc.SqlScriptsTestExecutionListener]
14-Dec-2019 00:31:07 2019-12-14 00:31:07.602  INFO 9525 --- [           main] .b.t.c.SpringBootTestContextBootstrapper : Using TestExecutionListeners: [org.springframework.test.context.web.ServletTestExecutionListener@5b275811, org.springframework.test.context.support.DirtiesContextBeforeModesTestExecutionListener@2f0ed952, org.springframework.boot.test.autoconfigure.SpringBootDependencyInjectionTestExecutionListener@6f044c58, org.springframework.test.context.support.DirtiesContextTestExecutionListener@6d074b14, org.springframework.test.context.transaction.TransactionalTestExecutionListener@c017175, org.springframework.test.context.jdbc.SqlScriptsTestExecutionListener@559cedee, org.springframework.boot.test.mock.mockito.MockitoTestExecutionListener@18371d89, org.springframework.boot.test.autoconfigure.web.servlet.MockMvcPrintOnlyOnFailureTestExecutionListener@4f3faa70, org.springframework.boot.test.autoconfigure.web.client.MockRestServiceServerResetTestExecutionListener@4832f03b, org.springframework.boot.test.mock.mockito.ResetMocksTestExecutionListener@7af3874e, org.springframework.boot.test.autoconfigure.web.servlet.WebDriverTestExecutionListener@5a8816cc, org.springframework.boot.test.autoconfigure.restdocs.RestDocsTestExecutionListener@68565bc7]
14-Dec-2019 00:31:07 2019-12-14 00:31:07.673  INFO 9525 --- [           main] junit.logTestName                        : Starting Test transformTests(org.springframework.cloud.dataflow.acceptance.test.TransformTests)
14-Dec-2019 00:31:07 2019-12-14 00:31:07.674  INFO 9525 --- [           main] o.s.c.d.acceptance.test.TransformTests   : Creating stream 'TRANSFORM-TEST'
14-Dec-2019 00:31:07 2019-12-14 00:31:07.713  INFO 9525 --- [           main] o.s.c.d.acceptance.test.TransformTests   : Deploying stream 'TRANSFORM-TEST' with properties: {app.*.spring.cloud.streamapp.security.enabled=false, app.*.logging.file=${PID}-test.log, app.*.endpoints.logfile.sensitive=false, app.*.management.endpoints.web.exposure.include=*}
14-Dec-2019 00:31:08 2019-12-14 00:31:08.507  INFO 9525 --- [           main] o.s.c.d.acceptance.test.TransformTests   : Checking: Stream=TRANSFORM-TEST, status = deploying, status description = The stream is being deployed.
14-Dec-2019 00:31:08 2019-12-14 00:31:08.508  INFO 9525 --- [           main] o.s.c.d.acceptance.test.TransformTests   : Sleeping to check status of Stream=TRANSFORM-TEST
14-Dec-2019 00:31:18 2019-12-14 00:31:18.546  INFO 9525 --- [           main] o.s.c.d.acceptance.test.TransformTests   : Checking: Stream=TRANSFORM-TEST, status = deploying, status description = The stream is being deployed.
14-Dec-2019 00:31:18 2019-12-14 00:31:18.546  INFO 9525 --- [           main] o.s.c.d.acceptance.test.TransformTests   : Sleeping to check status of Stream=TRANSFORM-TEST
14-Dec-2019 00:31:28 2019-12-14 00:31:28.585  INFO 9525 --- [           main] o.s.c.d.acceptance.test.TransformTests   : Checking: Stream=TRANSFORM-TEST, status = deployed, status description = The stream has been successfully deployed
14-Dec-2019 00:31:28 2019-12-14 00:31:28.627  INFO 9525 --- [           main] o.s.c.d.acceptance.test.TransformTests   : Sleeping to check status of Stream=TRANSFORM-TEST
14-Dec-2019 00:31:38 2019-12-14 00:31:38.628  INFO 9525 --- [           main] o.s.c.d.acceptance.test.TransformTests   : Stream 'TRANSFORM-TEST' started with status: deployed
14-Dec-2019 00:31:38 2019-12-14 00:31:38.628  INFO 9525 --- [           main] o.s.c.d.acceptance.test.TransformTests   : App 'transform' has instances: {TRANSFORM-TEST.transform-v1-0=http://10.194.6.129:49712}
14-Dec-2019 00:31:38 2019-12-14 00:31:38.628  INFO 9525 --- [           main] o.s.c.d.acceptance.test.TransformTests   : App 'log' has instances: {TRANSFORM-TEST.log-v1-0=http://10.194.6.129:46606}
14-Dec-2019 00:31:38 2019-12-14 00:31:38.628  INFO 9525 --- [           main] o.s.c.d.acceptance.test.TransformTests   : App 'http' has instances: {TRANSFORM-TEST.http-v1-0=http://10.194.6.129:57401}
14-Dec-2019 00:31:38 2019-12-14 00:31:38.629  INFO 9525 --- [           main] o.s.c.d.acceptance.test.TransformTests   : Looking for 'Started HttpSource' in logfile for http
14-Dec-2019 00:31:48 2019-12-14 00:31:48.629  INFO 9525 --- [           main] o.s.c.d.acceptance.test.TransformTests   : Requesting log for app TRANSFORM-TEST.http-v1-0
14-Dec-2019 00:31:49 2019-12-14 00:31:49.007  INFO 9525 --- [           main] o.s.c.d.acceptance.test.TransformTests   : Retrieved logfile from 'http://10.194.6.129:57401/actuator/logfile
14-Dec-2019 00:31:49 2019-12-14 00:31:49.007  INFO 9525 --- [           main] o.s.c.d.acceptance.test.TransformTests   : Matched all 'Started HttpSource' in logfile for app http (source TRANSFORM-TEST.http-v1-0)
14-Dec-2019 00:31:49 2019-12-14 00:31:49.152  INFO 9525 --- [           main] o.s.c.d.acceptance.test.TransformTests   : Looking for 'Started LogSink' in logfile for log
14-Dec-2019 00:31:59 2019-12-14 00:31:59.152  INFO 9525 --- [           main] o.s.c.d.acceptance.test.TransformTests   : Requesting log for app TRANSFORM-TEST.log-v1-0
14-Dec-2019 00:31:59 2019-12-14 00:31:59.284  INFO 9525 --- [           main] o.s.c.d.acceptance.test.TransformTests   : Retrieved logfile from 'http://10.194.6.129:46606/actuator/logfile
14-Dec-2019 00:31:59 2019-12-14 00:31:59.284  INFO 9525 --- [           main] o.s.c.d.acceptance.test.TransformTests   : Matched all 'Started LogSink' in logfile for app log (source TRANSFORM-TEST.log-v1-0)
14-Dec-2019 00:31:59 2019-12-14 00:31:59.284  INFO 9525 --- [           main] o.s.c.d.acceptance.test.TransformTests   : Looking for 'ABCDEFG' in logfile for log
14-Dec-2019 00:32:09 2019-12-14 00:32:09.284  INFO 9525 --- [           main] o.s.c.d.acceptance.test.TransformTests   : Requesting log for app TRANSFORM-TEST.log-v1-0
14-Dec-2019 00:32:09 2019-12-14 00:32:09.298  INFO 9525 --- [           main] o.s.c.d.acceptance.test.TransformTests   : Retrieved logfile from 'http://10.194.6.129:46606/actuator/logfile
14-Dec-2019 00:32:09 2019-12-14 00:32:09.298  INFO 9525 --- [           main] o.s.c.d.acceptance.test.TransformTests   : Matched all 'ABCDEFG' in logfile for app log (source TRANSFORM-TEST.log-v1-0)
14-Dec-2019 00:32:09 2019-12-14 00:32:09.300  INFO 9525 --- [           main] junit.logTestName                        : Test transformTests(org.springframework.cloud.dataflow.acceptance.test.TransformTests) Succeeded
14-Dec-2019 00:32:09 2019-12-14 00:32:09.301  INFO 9525 --- [           main] junit.logTestName                        : Finished Test transformTests(org.springframework.cloud.dataflow.acceptance.test.TransformTests)
14-Dec-2019 00:32:09 2019-12-14 00:32:09.301  INFO 9525 --- [           main] o.s.c.d.acceptance.test.TransformTests   : Destroy all streams
14-Dec-2019 00:32:09 Tests run: 1, Failures: 0, Errors: 0, Skipped: 0, Time elapsed: 62.005 sec - in org.springframework.cloud.dataflow.acceptance.test.TransformTests
14-Dec-2019 00:32:09 Running org.springframework.cloud.dataflow.acceptance.test.SchedulerTests
14-Dec-2019 00:32:09 2019-12-14 00:32:09.739  INFO 9525 --- [           main] s.c.a.AnnotationConfigApplicationContext : Refreshing org.springframework.context.annotation.AnnotationConfigApplicationContext@6d33a66e: startup date [Sat Dec 14 00:32:09 UTC 2019]; root of context hierarchy
14-Dec-2019 00:32:09 2019-12-14 00:32:09.761  INFO 9525 --- [           main] trationDelegate$BeanPostProcessorChecker : Bean 'configurationPropertiesRebinderAutoConfiguration' of type [class org.springframework.cloud.autoconfigure.ConfigurationPropertiesRebinderAutoConfiguration$$EnhancerBySpringCGLIB$$ed959188] is not eligible for getting processed by all BeanPostProcessors (for example: not eligible for auto-proxying)
14-Dec-2019 00:32:09
14-Dec-2019 00:32:09   .   ____          _            __ _ _
14-Dec-2019 00:32:09 /\\ / ___'_ __ _ _(_)_ __  __ _ \ \ \ \
14-Dec-2019 00:32:09 ( ( )\___ | '_ | '_| | '_ \/ _` | \ \ \ \
14-Dec-2019 00:32:09 \\/  ___)| |_)| | | | | || (_| |  ) ) ) )
14-Dec-2019 00:32:09   '  |____| .__|_| |_|_| |_\__, | / / / /
14-Dec-2019 00:32:09 =========|_|==============|___/=/_/_/_/
14-Dec-2019 00:32:09 :: Spring Boot ::        (v1.4.1.RELEASE)
14-Dec-2019 00:32:09
14-Dec-2019 00:32:09 2019-12-14 00:32:09.848  INFO 9525 --- [           main] c.c.c.ConfigServicePropertySourceLocator : Fetching config from server at: http://localhost:8888
14-Dec-2019 00:32:09 2019-12-14 00:32:09.851  WARN 9525 --- [           main] c.c.c.ConfigServicePropertySourceLocator : Could not locate PropertySource: I/O error on GET request for "http://localhost:8888//blah": Connection refused (Connection refused); nested exception is java.net.ConnectException: Connection refused (Connection refused)
14-Dec-2019 00:32:09 2019-12-14 00:32:09.852  INFO 9525 --- [           main] o.a.maven.surefire.booter.ForkedBooter   : The following profiles are active: blah
14-Dec-2019 00:32:09 2019-12-14 00:32:09.853  INFO 9525 --- [           main] s.c.a.AnnotationConfigApplicationContext : Refreshing org.springframework.context.annotation.AnnotationConfigApplicationContext@76f881d9: startup date [Sat Dec 14 00:32:09 UTC 2019]; parent: org.springframework.context.annotation.AnnotationConfigApplicationContext@6d33a66e
14-Dec-2019 00:32:09 2019-12-14 00:32:09.947  INFO 9525 --- [           main] o.a.maven.surefire.booter.ForkedBooter   : Started ForkedBooter in 0.285 seconds (JVM running for 992.514)
14-Dec-2019 00:32:09 2019-12-14 00:32:09.948  INFO 9525 --- [           main] s.c.a.AnnotationConfigApplicationContext : Closing org.springframework.context.annotation.AnnotationConfigApplicationContext@76f881d9: startup date [Sat Dec 14 00:32:09 UTC 2019]; parent: org.springframework.context.annotation.AnnotationConfigApplicationContext@6d33a66e
14-Dec-2019 00:32:09 2019-12-14 00:32:09.948 ERROR 9525 --- [           main] o.s.c.d.a.test.util.SchedulerRule        : SCHEDULER IS NOT AVAILABLE, SKIPPING TESTS
14-Dec-2019 00:32:09
14-Dec-2019 00:32:09 java.lang.IllegalArgumentException: no SchedulerOperations bean is available.  Skipping test.
14-Dec-2019 00:32:09         at org.springframework.util.Assert.notNull(Assert.java:115)
14-Dec-2019 00:32:09         at org.springframework.cloud.dataflow.acceptance.test.util.SchedulerRule.obtainResource(SchedulerRule.java:57)
14-Dec-2019 00:32:09         at org.springframework.cloud.scheduler.spi.junit.AbstractExternalResourceTestSupport.apply(AbstractExternalResourceTestSupport.java:58)
14-Dec-2019 00:32:09         at org.junit.rules.RunRules.applyAll(RunRules.java:26)
14-Dec-2019 00:32:09         at org.junit.rules.RunRules.<init>(RunRules.java:15)
14-Dec-2019 00:32:09         at org.junit.runners.ParentRunner.withClassRules(ParentRunner.java:245)
14-Dec-2019 00:32:09         at org.junit.runners.ParentRunner.classBlock(ParentRunner.java:194)
14-Dec-2019 00:32:09         at org.junit.runners.ParentRunner.run(ParentRunner.java:362)
14-Dec-2019 00:32:09         at org.springframework.test.context.junit4.SpringJUnit4ClassRunner.run(SpringJUnit4ClassRunner.java:191)
14-Dec-2019 00:32:09         at org.apache.maven.surefire.junit4.JUnit4Provider.execute(JUnit4Provider.java:283)
14-Dec-2019 00:32:09         at org.apache.maven.surefire.junit4.JUnit4Provider.executeWithRerun(JUnit4Provider.java:173)
14-Dec-2019 00:32:09         at org.apache.maven.surefire.junit4.JUnit4Provider.executeTestSet(JUnit4Provider.java:153)
14-Dec-2019 00:32:09         at org.apache.maven.surefire.junit4.JUnit4Provider.invoke(JUnit4Provider.java:128)
14-Dec-2019 00:32:09         at org.apache.maven.surefire.booter.ForkedBooter.invokeProviderInSameClassLoader(ForkedBooter.java:203)
14-Dec-2019 00:32:09         at org.apache.maven.surefire.booter.ForkedBooter.runSuitesInProcess(ForkedBooter.java:155)
14-Dec-2019 00:32:09         at org.apache.maven.surefire.booter.ForkedBooter.main(ForkedBooter.java:103)
14-Dec-2019 00:32:09
14-Dec-2019 00:32:09 Tests run: 1, Failures: 0, Errors: 0, Skipped: 1, Time elapsed: 0.307 sec - in org.springframework.cloud.dataflow.acceptance.test.SchedulerTests
14-Dec-2019 00:32:09 Running org.springframework.cloud.dataflow.acceptance.test.NamedChannelTests
14-Dec-2019 00:32:09 2019-12-14 00:32:09.949  INFO 9525 --- [           main] .b.t.c.SpringBootTestContextBootstrapper : Neither @ContextConfiguration nor @ContextHierarchy found for test class [org.springframework.cloud.dataflow.acceptance.test.NamedChannelTests], using SpringBootContextLoader
14-Dec-2019 00:32:09 2019-12-14 00:32:09.954  INFO 9525 --- [           main] .b.t.c.SpringBootTestContextBootstrapper : Loaded default TestExecutionListener class names from location [META-INF/spring.factories]: [org.springframework.boot.test.mock.mockito.MockitoTestExecutionListener, org.springframework.boot.test.mock.mockito.ResetMocksTestExecutionListener, org.springframework.boot.test.autoconfigure.restdocs.RestDocsTestExecutionListener, org.springframework.boot.test.autoconfigure.web.client.MockRestServiceServerResetTestExecutionListener, org.springframework.boot.test.autoconfigure.web.servlet.MockMvcPrintOnlyOnFailureTestExecutionListener, org.springframework.boot.test.autoconfigure.web.servlet.WebDriverTestExecutionListener, org.springframework.test.context.web.ServletTestExecutionListener, org.springframework.test.context.support.DirtiesContextBeforeModesTestExecutionListener, org.springframework.test.context.support.DependencyInjectionTestExecutionListener, org.springframework.test.context.support.DirtiesContextTestExecutionListener, org.springframework.test.context.transaction.TransactionalTestExecutionListener, org.springframework.test.context.jdbc.SqlScriptsTestExecutionListener]
14-Dec-2019 00:32:09 2019-12-14 00:32:09.956  INFO 9525 --- [           main] .b.t.c.SpringBootTestContextBootstrapper : Using TestExecutionListeners: [org.springframework.test.context.web.ServletTestExecutionListener@1b482cbf, org.springframework.test.context.support.DirtiesContextBeforeModesTestExecutionListener@661fe025, org.springframework.boot.test.autoconfigure.SpringBootDependencyInjectionTestExecutionListener@7161457, org.springframework.test.context.support.DirtiesContextTestExecutionListener@38ee7a9d, org.springframework.test.context.transaction.TransactionalTestExecutionListener@629984eb, org.springframework.test.context.jdbc.SqlScriptsTestExecutionListener@7b1e5e55, org.springframework.boot.test.mock.mockito.MockitoTestExecutionListener@4c1d59cd, org.springframework.boot.test.autoconfigure.web.servlet.MockMvcPrintOnlyOnFailureTestExecutionListener@76cf841, org.springframework.boot.test.autoconfigure.web.client.MockRestServiceServerResetTestExecutionListener@297c9a9b, org.springframework.boot.test.mock.mockito.ResetMocksTestExecutionListener@20999517, org.springframework.boot.test.autoconfigure.web.servlet.WebDriverTestExecutionListener@6ec63f8, org.springframework.boot.test.autoconfigure.restdocs.RestDocsTestExecutionListener@66223d94]
14-Dec-2019 00:32:10 2019-12-14 00:32:10.019  INFO 9525 --- [           main] junit.logTestName                        : Starting Test testDestination(org.springframework.cloud.dataflow.acceptance.test.NamedChannelTests)
14-Dec-2019 00:32:10 2019-12-14 00:32:10.022  INFO 9525 --- [           main] o.s.c.d.a.test.NamedChannelTests         : Creating stream 'LOG-DESTINATION-SINK'
14-Dec-2019 00:32:10 2019-12-14 00:32:10.051  INFO 9525 --- [           main] o.s.c.d.a.test.NamedChannelTests         : Deploying stream 'LOG-DESTINATION-SINK' with properties: {app.*.spring.cloud.streamapp.security.enabled=false, app.*.logging.file=${PID}-test.log, app.*.endpoints.logfile.sensitive=false, app.*.management.endpoints.web.exposure.include=*}
14-Dec-2019 00:32:10 2019-12-14 00:32:10.506  INFO 9525 --- [           main] o.s.c.d.a.test.NamedChannelTests         : Checking: Stream=LOG-DESTINATION-SINK, status = deploying, status description = The stream is being deployed.
14-Dec-2019 00:32:10 2019-12-14 00:32:10.506  INFO 9525 --- [           main] o.s.c.d.a.test.NamedChannelTests         : Sleeping to check status of Stream=LOG-DESTINATION-SINK
14-Dec-2019 00:32:20 2019-12-14 00:32:20.548  INFO 9525 --- [           main] o.s.c.d.a.test.NamedChannelTests         : Checking: Stream=LOG-DESTINATION-SINK, status = deployed, status description = The stream has been successfully deployed
14-Dec-2019 00:32:20 2019-12-14 00:32:20.592  INFO 9525 --- [           main] o.s.c.d.a.test.NamedChannelTests         : Sleeping to check status of Stream=LOG-DESTINATION-SINK
14-Dec-2019 00:32:30 2019-12-14 00:32:30.593  INFO 9525 --- [           main] o.s.c.d.a.test.NamedChannelTests         : Stream 'LOG-DESTINATION-SINK' started with status: deployed
14-Dec-2019 00:32:30 2019-12-14 00:32:30.594  INFO 9525 --- [           main] o.s.c.d.a.test.NamedChannelTests         : App 'log' has instances: {LOG-DESTINATION-SINK.log-v1-0=http://10.194.6.129:23574}
14-Dec-2019 00:32:30 2019-12-14 00:32:30.595  INFO 9525 --- [           main] o.s.c.d.a.test.NamedChannelTests         : Looking for 'Started LogSink' in logfile for log
14-Dec-2019 00:32:40 2019-12-14 00:32:40.595  INFO 9525 --- [           main] o.s.c.d.a.test.NamedChannelTests         : Requesting log for app LOG-DESTINATION-SINK.log-v1-0
14-Dec-2019 00:32:40 2019-12-14 00:32:40.905  INFO 9525 --- [           main] o.s.c.d.a.test.NamedChannelTests         : Retrieved logfile from 'http://10.194.6.129:23574/actuator/logfile
14-Dec-2019 00:32:40 2019-12-14 00:32:40.905  INFO 9525 --- [           main] o.s.c.d.a.test.NamedChannelTests         : Matched all 'Started LogSink' in logfile for app log (source LOG-DESTINATION-SINK.log-v1-0)
14-Dec-2019 00:32:40 2019-12-14 00:32:40.906  INFO 9525 --- [           main] o.s.c.d.a.test.NamedChannelTests         : Creating stream 'HTTP-DESTINATION-SOURCE'
14-Dec-2019 00:32:40 2019-12-14 00:32:40.955  INFO 9525 --- [           main] o.s.c.d.a.test.NamedChannelTests         : Deploying stream 'HTTP-DESTINATION-SOURCE' with properties: {app.*.spring.cloud.streamapp.security.enabled=false, app.*.logging.file=${PID}-test.log, app.*.endpoints.logfile.sensitive=false, app.*.management.endpoints.web.exposure.include=*}
14-Dec-2019 00:32:41 2019-12-14 00:32:41.475  INFO 9525 --- [           main] o.s.c.d.a.test.NamedChannelTests         : Checking: Stream=HTTP-DESTINATION-SOURCE, status = deploying, status description = The stream is being deployed.
14-Dec-2019 00:32:41 2019-12-14 00:32:41.475  INFO 9525 --- [           main] o.s.c.d.a.test.NamedChannelTests         : Sleeping to check status of Stream=HTTP-DESTINATION-SOURCE
14-Dec-2019 00:32:51 2019-12-14 00:32:51.531  INFO 9525 --- [           main] o.s.c.d.a.test.NamedChannelTests         : Checking: Stream=HTTP-DESTINATION-SOURCE, status = deployed, status description = The stream has been successfully deployed
14-Dec-2019 00:32:51 2019-12-14 00:32:51.567  INFO 9525 --- [           main] o.s.c.d.a.test.NamedChannelTests         : Sleeping to check status of Stream=HTTP-DESTINATION-SOURCE
14-Dec-2019 00:33:01 2019-12-14 00:33:01.567  INFO 9525 --- [           main] o.s.c.d.a.test.NamedChannelTests         : Stream 'HTTP-DESTINATION-SOURCE' started with status: deployed
14-Dec-2019 00:33:01 2019-12-14 00:33:01.569  INFO 9525 --- [           main] o.s.c.d.a.test.NamedChannelTests         : App 'http' has instances: {HTTP-DESTINATION-SOURCE.http-v1-0=http://10.194.6.129:28960}
14-Dec-2019 00:33:01 2019-12-14 00:33:01.569  INFO 9525 --- [           main] o.s.c.d.a.test.NamedChannelTests         : Looking for 'Started HttpSource' in logfile for http
14-Dec-2019 00:33:11 2019-12-14 00:33:11.570  INFO 9525 --- [           main] o.s.c.d.a.test.NamedChannelTests         : Requesting log for app HTTP-DESTINATION-SOURCE.http-v1-0
14-Dec-2019 00:33:11 2019-12-14 00:33:11.878  INFO 9525 --- [           main] o.s.c.d.a.test.NamedChannelTests         : Retrieved logfile from 'http://10.194.6.129:28960/actuator/logfile
14-Dec-2019 00:33:11 2019-12-14 00:33:11.879  INFO 9525 --- [           main] o.s.c.d.a.test.NamedChannelTests         : Matched all 'Started HttpSource' in logfile for app http (source HTTP-DESTINATION-SOURCE.http-v1-0)
14-Dec-2019 00:33:12 2019-12-14 00:33:12.010  INFO 9525 --- [           main] o.s.c.d.a.test.NamedChannelTests         : Looking for 'abcdefg' in logfile for log
14-Dec-2019 00:33:22 2019-12-14 00:33:22.011  INFO 9525 --- [           main] o.s.c.d.a.test.NamedChannelTests         : Requesting log for app LOG-DESTINATION-SINK.log-v1-0
14-Dec-2019 00:33:22 2019-12-14 00:33:22.025  INFO 9525 --- [           main] o.s.c.d.a.test.NamedChannelTests         : Retrieved logfile from 'http://10.194.6.129:23574/actuator/logfile
14-Dec-2019 00:33:22 2019-12-14 00:33:22.026  INFO 9525 --- [           main] o.s.c.d.a.test.NamedChannelTests         : Matched all 'abcdefg' in logfile for app log (source LOG-DESTINATION-SINK.log-v1-0)
14-Dec-2019 00:33:22 2019-12-14 00:33:22.027  INFO 9525 --- [           main] junit.logTestName                        : Test testDestination(org.springframework.cloud.dataflow.acceptance.test.NamedChannelTests) Succeeded
14-Dec-2019 00:33:22 2019-12-14 00:33:22.027  INFO 9525 --- [           main] junit.logTestName                        : Finished Test testDestination(org.springframework.cloud.dataflow.acceptance.test.NamedChannelTests)
14-Dec-2019 00:33:22 2019-12-14 00:33:22.027  INFO 9525 --- [           main] o.s.c.d.a.test.NamedChannelTests         : Destroy all streams
14-Dec-2019 00:33:22 2019-12-14 00:33:22.378  INFO 9525 --- [           main] junit.logTestName                        : Starting Test testTap(org.springframework.cloud.dataflow.acceptance.test.NamedChannelTests)
14-Dec-2019 00:33:22 2019-12-14 00:33:22.380  INFO 9525 --- [           main] o.s.c.d.a.test.NamedChannelTests         : Creating stream 'TAPHTTP'
14-Dec-2019 00:33:22 2019-12-14 00:33:22.407  INFO 9525 --- [           main] o.s.c.d.a.test.NamedChannelTests         : Deploying stream 'TAPHTTP' with properties: {app.*.spring.cloud.streamapp.security.enabled=false, app.*.logging.file=${PID}-test.log, app.*.endpoints.logfile.sensitive=false, app.*.management.endpoints.web.exposure.include=*}
14-Dec-2019 00:33:22 2019-12-14 00:33:22.939  INFO 9525 --- [           main] o.s.c.d.a.test.NamedChannelTests         : Checking: Stream=TAPHTTP, status = deploying, status description = The stream is being deployed.
14-Dec-2019 00:33:22 2019-12-14 00:33:22.939  INFO 9525 --- [           main] o.s.c.d.a.test.NamedChannelTests         : Sleeping to check status of Stream=TAPHTTP
14-Dec-2019 00:33:32 2019-12-14 00:33:32.972  INFO 9525 --- [           main] o.s.c.d.a.test.NamedChannelTests         : Checking: Stream=TAPHTTP, status = deploying, status description = The stream is being deployed.
14-Dec-2019 00:33:32 2019-12-14 00:33:32.972  INFO 9525 --- [           main] o.s.c.d.a.test.NamedChannelTests         : Sleeping to check status of Stream=TAPHTTP
14-Dec-2019 00:33:43 2019-12-14 00:33:43.002  INFO 9525 --- [           main] o.s.c.d.a.test.NamedChannelTests         : Checking: Stream=TAPHTTP, status = deployed, status description = The stream has been successfully deployed
14-Dec-2019 00:33:43 2019-12-14 00:33:43.037  INFO 9525 --- [           main] o.s.c.d.a.test.NamedChannelTests         : Sleeping to check status of Stream=TAPHTTP
14-Dec-2019 00:33:53 2019-12-14 00:33:53.038  INFO 9525 --- [           main] o.s.c.d.a.test.NamedChannelTests         : Stream 'TAPHTTP' started with status: deployed
14-Dec-2019 00:33:53 2019-12-14 00:33:53.038  INFO 9525 --- [           main] o.s.c.d.a.test.NamedChannelTests         : App 'log' has instances: {TAPHTTP.log-v1-0=http://10.194.6.129:59389}
14-Dec-2019 00:33:53 2019-12-14 00:33:53.038  INFO 9525 --- [           main] o.s.c.d.a.test.NamedChannelTests         : App 'http' has instances: {TAPHTTP.http-v1-0=http://10.194.6.129:20103}
14-Dec-2019 00:33:53 2019-12-14 00:33:53.038  INFO 9525 --- [           main] o.s.c.d.a.test.NamedChannelTests         : Looking for 'Started HttpSource' in logfile for http
14-Dec-2019 00:34:03 2019-12-14 00:34:03.038  INFO 9525 --- [           main] o.s.c.d.a.test.NamedChannelTests         : Requesting log for app TAPHTTP.http-v1-0
14-Dec-2019 00:34:03 2019-12-14 00:34:03.311  INFO 9525 --- [           main] o.s.c.d.a.test.NamedChannelTests         : Retrieved logfile from 'http://10.194.6.129:20103/actuator/logfile
14-Dec-2019 00:34:03 2019-12-14 00:34:03.311  INFO 9525 --- [           main] o.s.c.d.a.test.NamedChannelTests         : Matched all 'Started HttpSource' in logfile for app http (source TAPHTTP.http-v1-0)
14-Dec-2019 00:34:03 2019-12-14 00:34:03.312  INFO 9525 --- [           main] o.s.c.d.a.test.NamedChannelTests         : Looking for 'Started LogSink' in logfile for log
14-Dec-2019 00:34:13 2019-12-14 00:34:13.312  INFO 9525 --- [           main] o.s.c.d.a.test.NamedChannelTests         : Requesting log for app TAPHTTP.log-v1-0
14-Dec-2019 00:34:13 2019-12-14 00:34:13.434  INFO 9525 --- [           main] o.s.c.d.a.test.NamedChannelTests         : Retrieved logfile from 'http://10.194.6.129:59389/actuator/logfile
14-Dec-2019 00:34:13 2019-12-14 00:34:13.434  INFO 9525 --- [           main] o.s.c.d.a.test.NamedChannelTests         : Matched all 'Started LogSink' in logfile for app log (source TAPHTTP.log-v1-0)
14-Dec-2019 00:34:13 2019-12-14 00:34:13.434  INFO 9525 --- [           main] o.s.c.d.a.test.NamedChannelTests         : Creating stream 'TAPSTREAM'
14-Dec-2019 00:34:13 2019-12-14 00:34:13.460  INFO 9525 --- [           main] o.s.c.d.a.test.NamedChannelTests         : Deploying stream 'TAPSTREAM' with properties: {app.*.spring.cloud.streamapp.security.enabled=false, app.*.logging.file=${PID}-test.log, app.*.endpoints.logfile.sensitive=false, app.*.management.endpoints.web.exposure.include=*}
14-Dec-2019 00:34:13 2019-12-14 00:34:13.945  INFO 9525 --- [           main] o.s.c.d.a.test.NamedChannelTests         : Checking: Stream=TAPSTREAM, status = deploying, status description = The stream is being deployed.
14-Dec-2019 00:34:13 2019-12-14 00:34:13.945  INFO 9525 --- [           main] o.s.c.d.a.test.NamedChannelTests         : Sleeping to check status of Stream=TAPSTREAM
14-Dec-2019 00:34:24 2019-12-14 00:34:24.001  INFO 9525 --- [           main] o.s.c.d.a.test.NamedChannelTests         : Checking: Stream=TAPSTREAM, status = deployed, status description = The stream has been successfully deployed
14-Dec-2019 00:34:24 2019-12-14 00:34:24.033  INFO 9525 --- [           main] o.s.c.d.a.test.NamedChannelTests         : Sleeping to check status of Stream=TAPSTREAM
14-Dec-2019 00:34:34 2019-12-14 00:34:34.033  INFO 9525 --- [           main] o.s.c.d.a.test.NamedChannelTests         : Stream 'TAPSTREAM' started with status: deployed
14-Dec-2019 00:34:34 2019-12-14 00:34:34.034  INFO 9525 --- [           main] o.s.c.d.a.test.NamedChannelTests         : App 'log' has instances: {TAPSTREAM.log-v1-0=http://10.194.6.129:22716}
14-Dec-2019 00:34:34 2019-12-14 00:34:34.034  INFO 9525 --- [           main] o.s.c.d.a.test.NamedChannelTests         : Looking for 'Started LogSink' in logfile for log
14-Dec-2019 00:34:44 2019-12-14 00:34:44.034  INFO 9525 --- [           main] o.s.c.d.a.test.NamedChannelTests         : Requesting log for app TAPSTREAM.log-v1-0
14-Dec-2019 00:34:44 2019-12-14 00:34:44.334  INFO 9525 --- [           main] o.s.c.d.a.test.NamedChannelTests         : Retrieved logfile from 'http://10.194.6.129:22716/actuator/logfile
14-Dec-2019 00:34:44 2019-12-14 00:34:44.334  INFO 9525 --- [           main] o.s.c.d.a.test.NamedChannelTests         : Matched all 'Started LogSink' in logfile for app log (source TAPSTREAM.log-v1-0)
14-Dec-2019 00:34:44 2019-12-14 00:34:44.550  INFO 9525 --- [           main] o.s.c.d.a.test.NamedChannelTests         : Looking for 'abcdefg' in logfile for log
14-Dec-2019 00:34:54 2019-12-14 00:34:54.550  INFO 9525 --- [           main] o.s.c.d.a.test.NamedChannelTests         : Requesting log for app TAPSTREAM.log-v1-0
14-Dec-2019 00:34:54 2019-12-14 00:34:54.569  INFO 9525 --- [           main] o.s.c.d.a.test.NamedChannelTests         : Retrieved logfile from 'http://10.194.6.129:22716/actuator/logfile
14-Dec-2019 00:34:54 2019-12-14 00:34:54.569  INFO 9525 --- [           main] o.s.c.d.a.test.NamedChannelTests         : Matched all 'abcdefg' in logfile for app log (source TAPSTREAM.log-v1-0)
14-Dec-2019 00:34:54 2019-12-14 00:34:54.573  INFO 9525 --- [           main] junit.logTestName                        : Test testTap(org.springframework.cloud.dataflow.acceptance.test.NamedChannelTests) Succeeded
14-Dec-2019 00:34:54 2019-12-14 00:34:54.573  INFO 9525 --- [           main] junit.logTestName                        : Finished Test testTap(org.springframework.cloud.dataflow.acceptance.test.NamedChannelTests)
14-Dec-2019 00:34:54 2019-12-14 00:34:54.574  INFO 9525 --- [           main] o.s.c.d.a.test.NamedChannelTests         : Destroy all streams
14-Dec-2019 00:34:54 2019-12-14 00:34:54.992  INFO 9525 --- [           main] junit.logTestName                        : Starting Test manyToOneTest(org.springframework.cloud.dataflow.acceptance.test.NamedChannelTests)
14-Dec-2019 00:34:54 2019-12-14 00:34:54.993  INFO 9525 --- [           main] o.s.c.d.a.test.NamedChannelTests         : Creating stream 'MANY-TO-ONE'
14-Dec-2019 00:34:55 2019-12-14 00:34:55.021  INFO 9525 --- [           main] o.s.c.d.a.test.NamedChannelTests         : Deploying stream 'MANY-TO-ONE' with properties: {app.*.spring.cloud.streamapp.security.enabled=false, app.*.logging.file=${PID}-test.log, app.*.endpoints.logfile.sensitive=false, app.*.management.endpoints.web.exposure.include=*}
14-Dec-2019 00:34:55 2019-12-14 00:34:55.468  INFO 9525 --- [           main] o.s.c.d.a.test.NamedChannelTests         : Checking: Stream=MANY-TO-ONE, status = deploying, status description = The stream is being deployed.
14-Dec-2019 00:34:55 2019-12-14 00:34:55.469  INFO 9525 --- [           main] o.s.c.d.a.test.NamedChannelTests         : Sleeping to check status of Stream=MANY-TO-ONE
14-Dec-2019 00:35:05 2019-12-14 00:35:05.498  INFO 9525 --- [           main] o.s.c.d.a.test.NamedChannelTests         : Checking: Stream=MANY-TO-ONE, status = deployed, status description = The stream has been successfully deployed
14-Dec-2019 00:35:05 2019-12-14 00:35:05.531  INFO 9525 --- [           main] o.s.c.d.a.test.NamedChannelTests         : Sleeping to check status of Stream=MANY-TO-ONE
14-Dec-2019 00:35:15 2019-12-14 00:35:15.534  INFO 9525 --- [           main] o.s.c.d.a.test.NamedChannelTests         : Stream 'MANY-TO-ONE' started with status: deployed
14-Dec-2019 00:35:15 2019-12-14 00:35:15.534  INFO 9525 --- [           main] o.s.c.d.a.test.NamedChannelTests         : App 'log' has instances: {MANY-TO-ONE.log-v1-0=http://10.194.6.129:43281}
14-Dec-2019 00:35:15 2019-12-14 00:35:15.534  INFO 9525 --- [           main] o.s.c.d.a.test.NamedChannelTests         : Looking for 'Started LogSink' in logfile for log
14-Dec-2019 00:35:25 2019-12-14 00:35:25.535  INFO 9525 --- [           main] o.s.c.d.a.test.NamedChannelTests         : Requesting log for app MANY-TO-ONE.log-v1-0
14-Dec-2019 00:35:25 2019-12-14 00:35:25.829  INFO 9525 --- [           main] o.s.c.d.a.test.NamedChannelTests         : Retrieved logfile from 'http://10.194.6.129:43281/actuator/logfile
14-Dec-2019 00:35:25 2019-12-14 00:35:25.829  INFO 9525 --- [           main] o.s.c.d.a.test.NamedChannelTests         : Matched all 'Started LogSink' in logfile for app log (source MANY-TO-ONE.log-v1-0)
14-Dec-2019 00:35:25 2019-12-14 00:35:25.829  INFO 9525 --- [           main] o.s.c.d.a.test.NamedChannelTests         : Creating stream 'HTTP-SOURCE-1'
14-Dec-2019 00:35:25 2019-12-14 00:35:25.860  INFO 9525 --- [           main] o.s.c.d.a.test.NamedChannelTests         : Deploying stream 'HTTP-SOURCE-1' with properties: {app.*.spring.cloud.streamapp.security.enabled=false, app.*.logging.file=${PID}-test.log, app.*.endpoints.logfile.sensitive=false, app.*.management.endpoints.web.exposure.include=*}
14-Dec-2019 00:35:26 2019-12-14 00:35:26.299  INFO 9525 --- [           main] o.s.c.d.a.test.NamedChannelTests         : Checking: Stream=HTTP-SOURCE-1, status = deploying, status description = The stream is being deployed.
14-Dec-2019 00:35:26 2019-12-14 00:35:26.299  INFO 9525 --- [           main] o.s.c.d.a.test.NamedChannelTests         : Sleeping to check status of Stream=HTTP-SOURCE-1
14-Dec-2019 00:35:36 2019-12-14 00:35:36.368  INFO 9525 --- [           main] o.s.c.d.a.test.NamedChannelTests         : Checking: Stream=HTTP-SOURCE-1, status = deployed, status description = The stream has been successfully deployed
14-Dec-2019 00:35:36 2019-12-14 00:35:36.401  INFO 9525 --- [           main] o.s.c.d.a.test.NamedChannelTests         : Sleeping to check status of Stream=HTTP-SOURCE-1
14-Dec-2019 00:35:46 2019-12-14 00:35:46.402  INFO 9525 --- [           main] o.s.c.d.a.test.NamedChannelTests         : Stream 'HTTP-SOURCE-1' started with status: deployed
14-Dec-2019 00:35:46 2019-12-14 00:35:46.402  INFO 9525 --- [           main] o.s.c.d.a.test.NamedChannelTests         : App 'http' has instances: {HTTP-SOURCE-1.http-v1-0=http://10.194.6.129:47398}
14-Dec-2019 00:35:46 2019-12-14 00:35:46.402  INFO 9525 --- [           main] o.s.c.d.a.test.NamedChannelTests         : Looking for 'Started HttpSource' in logfile for http
14-Dec-2019 00:35:56 2019-12-14 00:35:56.402  INFO 9525 --- [           main] o.s.c.d.a.test.NamedChannelTests         : Requesting log for app HTTP-SOURCE-1.http-v1-0
14-Dec-2019 00:35:56 2019-12-14 00:35:56.705  INFO 9525 --- [           main] o.s.c.d.a.test.NamedChannelTests         : Retrieved logfile from 'http://10.194.6.129:47398/actuator/logfile
14-Dec-2019 00:35:56 2019-12-14 00:35:56.705  INFO 9525 --- [           main] o.s.c.d.a.test.NamedChannelTests         : Matched all 'Started HttpSource' in logfile for app http (source HTTP-SOURCE-1.http-v1-0)
14-Dec-2019 00:35:56 2019-12-14 00:35:56.705  INFO 9525 --- [           main] o.s.c.d.a.test.NamedChannelTests         : Creating stream 'HTTP-SOURCE-2'
14-Dec-2019 00:35:56 2019-12-14 00:35:56.733  INFO 9525 --- [           main] o.s.c.d.a.test.NamedChannelTests         : Deploying stream 'HTTP-SOURCE-2' with properties: {app.*.spring.cloud.streamapp.security.enabled=false, app.*.logging.file=${PID}-test.log, app.*.endpoints.logfile.sensitive=false, app.*.management.endpoints.web.exposure.include=*}
14-Dec-2019 00:35:57 2019-12-14 00:35:57.257  INFO 9525 --- [           main] o.s.c.d.a.test.NamedChannelTests         : Checking: Stream=HTTP-SOURCE-2, status = deploying, status description = The stream is being deployed.
14-Dec-2019 00:35:57 2019-12-14 00:35:57.257  INFO 9525 --- [           main] o.s.c.d.a.test.NamedChannelTests         : Sleeping to check status of Stream=HTTP-SOURCE-2
14-Dec-2019 00:36:07 2019-12-14 00:36:07.345  INFO 9525 --- [           main] o.s.c.d.a.test.NamedChannelTests         : Checking: Stream=HTTP-SOURCE-2, status = deployed, status description = The stream has been successfully deployed
14-Dec-2019 00:36:07 2019-12-14 00:36:07.385  INFO 9525 --- [           main] o.s.c.d.a.test.NamedChannelTests         : Sleeping to check status of Stream=HTTP-SOURCE-2
14-Dec-2019 00:36:17 2019-12-14 00:36:17.386  INFO 9525 --- [           main] o.s.c.d.a.test.NamedChannelTests         : Stream 'HTTP-SOURCE-2' started with status: deployed
14-Dec-2019 00:36:17 2019-12-14 00:36:17.386  INFO 9525 --- [           main] o.s.c.d.a.test.NamedChannelTests         : App 'http' has instances: {HTTP-SOURCE-2.http-v1-0=http://10.194.6.129:57964}
14-Dec-2019 00:36:17 2019-12-14 00:36:17.386  INFO 9525 --- [           main] o.s.c.d.a.test.NamedChannelTests         : Looking for 'Started HttpSource' in logfile for http
14-Dec-2019 00:36:27 2019-12-14 00:36:27.387  INFO 9525 --- [           main] o.s.c.d.a.test.NamedChannelTests         : Requesting log for app HTTP-SOURCE-2.http-v1-0
14-Dec-2019 00:36:27 2019-12-14 00:36:27.696  INFO 9525 --- [           main] o.s.c.d.a.test.NamedChannelTests         : Retrieved logfile from 'http://10.194.6.129:57964/actuator/logfile
14-Dec-2019 00:36:27 2019-12-14 00:36:27.696  INFO 9525 --- [           main] o.s.c.d.a.test.NamedChannelTests         : Matched all 'Started HttpSource' in logfile for app http (source HTTP-SOURCE-2.http-v1-0)
14-Dec-2019 00:36:27 2019-12-14 00:36:27.827  INFO 9525 --- [           main] o.s.c.d.a.test.NamedChannelTests         : Looking for 'abcdefg' in logfile for log
14-Dec-2019 00:36:37 2019-12-14 00:36:37.827  INFO 9525 --- [           main] o.s.c.d.a.test.NamedChannelTests         : Requesting log for app MANY-TO-ONE.log-v1-0
14-Dec-2019 00:36:37 2019-12-14 00:36:37.845  INFO 9525 --- [           main] o.s.c.d.a.test.NamedChannelTests         : Retrieved logfile from 'http://10.194.6.129:43281/actuator/logfile
14-Dec-2019 00:36:37 2019-12-14 00:36:37.845  INFO 9525 --- [           main] o.s.c.d.a.test.NamedChannelTests         : Matched all 'abcdefg' in logfile for app log (source MANY-TO-ONE.log-v1-0)
14-Dec-2019 00:36:38 2019-12-14 00:36:38.015  INFO 9525 --- [           main] o.s.c.d.a.test.NamedChannelTests         : Looking for 'hijklmn' in logfile for log
14-Dec-2019 00:36:48 2019-12-14 00:36:48.016  INFO 9525 --- [           main] o.s.c.d.a.test.NamedChannelTests         : Requesting log for app MANY-TO-ONE.log-v1-0
14-Dec-2019 00:36:48 2019-12-14 00:36:48.030  INFO 9525 --- [           main] o.s.c.d.a.test.NamedChannelTests         : Retrieved logfile from 'http://10.194.6.129:43281/actuator/logfile
14-Dec-2019 00:36:48 2019-12-14 00:36:48.031  INFO 9525 --- [           main] o.s.c.d.a.test.NamedChannelTests         : Matched all 'hijklmn' in logfile for app log (source MANY-TO-ONE.log-v1-0)
14-Dec-2019 00:36:48 2019-12-14 00:36:48.041  INFO 9525 --- [           main] junit.logTestName                        : Test manyToOneTest(org.springframework.cloud.dataflow.acceptance.test.NamedChannelTests) Succeeded
14-Dec-2019 00:36:48 2019-12-14 00:36:48.041  INFO 9525 --- [           main] junit.logTestName                        : Finished Test manyToOneTest(org.springframework.cloud.dataflow.acceptance.test.NamedChannelTests)
14-Dec-2019 00:36:48 2019-12-14 00:36:48.041  INFO 9525 --- [           main] o.s.c.d.a.test.NamedChannelTests         : Destroy all streams
14-Dec-2019 00:36:48 Tests run: 4, Failures: 0, Errors: 0, Skipped: 1, Time elapsed: 278.582 sec - in org.springframework.cloud.dataflow.acceptance.test.NamedChannelTests
14-Dec-2019 00:36:48 Running org.springframework.cloud.dataflow.acceptance.test.util.PlatformHelperTests
14-Dec-2019 00:36:48 Tests run: 3, Failures: 0, Errors: 0, Skipped: 0, Time elapsed: 0.072 sec - in org.springframework.cloud.dataflow.acceptance.test.util.PlatformHelperTests
14-Dec-2019 00:36:48 Running org.springframework.cloud.dataflow.acceptance.test.util.ApplicationTests
14-Dec-2019 00:36:48 Tests run: 2, Failures: 0, Errors: 0, Skipped: 0, Time elapsed: 0.001 sec - in org.springframework.cloud.dataflow.acceptance.test.util.ApplicationTests
14-Dec-2019 00:36:48 2019-12-14 00:36:48.615  INFO 9525 --- [       Thread-6] o.s.c.support.GenericApplicationContext  : Closing org.springframework.context.support.GenericApplicationContext@7a81065e: startup date [Sat Dec 14 00:18:18 UTC 2019]; root of context hierarchy
14-Dec-2019 00:36:48
14-Dec-2019 00:36:48 Results :
14-Dec-2019 00:36:48
14-Dec-2019 00:36:48 Failed tests:
14-Dec-2019 00:36:48   ComposedTaskTests.ctrLaunch:41->assertTaskExecutions:65 null
14-Dec-2019 00:36:48   ComposedTaskTests.ctrMultipleLaunch:47->assertTaskExecutions:65 null
14-Dec-2019 00:36:48   ComposedTaskTests.ctrMultipleLaunchWithArguments:57->assertTaskExecutions:65 null
14-Dec-2019 00:36:48
14-Dec-2019 00:36:48 Tests run: 22, Failures: 3, Errors: 0, Skipped: 4
14-Dec-2019 00:36:48
14-Dec-2019 00:36:48 [INFO] ------------------------------------------------------------------------
14-Dec-2019 00:36:48 [INFO] BUILD FAILURE
14-Dec-2019 00:36:48 [INFO] ------------------------------------------------------------------------
14-Dec-2019 00:36:48 [INFO] Total time: 21:15 min
14-Dec-2019 00:36:48 [INFO] Finished at: 2019-12-14T00:36:48+00:00
14-Dec-2019 00:36:48 [INFO] Final Memory: 51M/446M
14-Dec-2019 00:36:48 [INFO] ------------------------------------------------------------------------
14-Dec-2019 00:36:48 [ERROR] Failed to execute goal org.apache.maven.plugins:maven-surefire-plugin:2.18.1:test (default-test) on project spring-cloud-dataflow-acceptance-tests: There are test failures.
14-Dec-2019 00:36:48 [ERROR]
14-Dec-2019 00:36:48 [ERROR] Please refer to /opt/bamboo-home/xml-data/build-dir/SCDT-LOCAL20XSKIPPER20X-KAFKA/target/surefire-reports for the individual test results.
14-Dec-2019 00:36:48 [ERROR] -> [Help 1]
14-Dec-2019 00:36:48 [ERROR]
14-Dec-2019 00:36:48 [ERROR] To see the full stack trace of the errors, re-run Maven with the -e switch.
14-Dec-2019 00:36:48 [ERROR] Re-run Maven using the -X switch to enable full debug logging.
14-Dec-2019 00:36:48 [ERROR]
14-Dec-2019 00:36:48 [ERROR] For more information about the errors and possible solutions, please read the following articles:
14-Dec-2019 00:36:48 [ERROR] [Help 1] http://cwiki.apache.org/confluence/display/MAVEN/MojoFailureException
14-Dec-2019 00:36:48 Clean up, clean up, everybody everywhere; clean up clean up, everybody do your share!
14-Dec-2019 00:36:48 Clean up servers
14-Dec-2019 00:36:48 Killing process PID [9418]
14-Dec-2019 00:36:48 Killing process PID [9300]
14-Dec-2019 00:36:49 No stopped containers
14-Dec-2019 00:36:50 Stopping mysql_mysql_1 ...
14-Dec-2019 00:36:52
14-Dec-2019 00:36:52 Stopping mysql_mysql_1 ... done
14-Dec-2019 00:36:52 Removing mysql_mysql_1 ...
14-Dec-2019 00:36:52
14-Dec-2019 00:36:52 Removing mysql_mysql_1 ... done
14-Dec-2019 00:36:52 Going to remove mysql_mysql_1
14-Dec-2019 00:36:53 Stopping kafka_zookeeper_1 ...
14-Dec-2019 00:36:53 Stopping kafka_kafka_1     ...
14-Dec-2019 00:36:56
14-Dec-2019 00:36:56 Stopping kafka_kafka_1     ... done
14-Dec-2019 00:37:03
14-Dec-2019 00:37:03 Stopping kafka_zookeeper_1 ... done
14-Dec-2019 00:37:04 Removing kafka_zookeeper_1 ...
14-Dec-2019 00:37:04 Removing kafka_kafka_1     ...
14-Dec-2019 00:37:04
14-Dec-2019 00:37:04 Removing kafka_zookeeper_1 ... done
14-Dec-2019 00:37:04
14-Dec-2019 00:37:04 Removing kafka_kafka_1     ... done
14-Dec-2019 00:37:04 Going to remove kafka_zookeeper_1, kafka_kafka_1
14-Dec-2019 00:37:04
14-Dec-2019 00:37:04 Finished task 'Execute Acceptance Tests' with result: Success
14-Dec-2019 00:37:04 Starting task 'JUnit Parser' of type 'com.atlassian.bamboo.plugins.testresultparser:task.testresultparser.junit'
14-Dec-2019 00:37:04 Parsing test results under /opt/bamboo-home/xml-data/build-dir/SCDT-LOCAL20XSKIPPER20X-KAFKA...
14-Dec-2019 00:37:04 Failing task since 3 failing test cases were found.
14-Dec-2019 00:37:04 Finished task 'JUnit Parser' with result: Failed
14-Dec-2019 00:37:04 Starting task 'clean up' of type 'com.atlassian.bamboo.plugins.scripttask:task.builder.script'
14-Dec-2019 00:37:04
Beginning to execute external process for build 'Spring Cloud Data Flow Acceptance Tests - Local + SCDF-2.0.4.BS + Skipper 2.0.4.BS (12 am) - Run Data Flow Acceptance Tests for Kafka #196 (SCDT-LOCAL20XSKIPPER20X-KAFKA-196)'
... running command line:
/opt/bamboo-home/temp/SCDT-LOCAL20XSKIPPER20X-KAFKA-196-ScriptBuildTask-5348729218200496691.sh
... in: /opt/bamboo-home/xml-data/build-dir/SCDT-LOCAL20XSKIPPER20X-KAFKA
... using extra environment variables:
bamboo_planRepository_1_branch=master
bamboo_********_username_password=********
bamboo_signing_store_password=********
bamboo_capability_system_builder_ant_Ant_1_9=/opt/ant-1.9
bamboo_capability_system_builder_ant_Ant_1_8=/opt/ant-1.8
bamboo_planRepository_1_branchDisplayName=master
bamboo_repository_274694331_git_username=spring-buildmaster
bamboo_artifactory_override_resolve_repo=libs-milestone
bamboo_capability_system_builder_node_Node_js_10_16=/opt/node-10.16/bin/node
bamboo_repository_revision_number=de5f215a8ff95acbff6f531ccc41df40caef3fbd
bamboo_RIAK_BIN=/usr/sbin/riak
bamboo_buildKey=SCDT-LOCAL20XSKIPPER20X-KAFKA
bamboo_repository_274694331_branch_name=master
bamboo_ge_cache_username=ci
bamboo_bintray_password=********
bamboo_sonar_token_password=********
bamboo_shortJobName=Run Data Flow Acceptance Tests for Kafka
bamboo_artifactory_override_resolver_password=********
bamboo_sonatype_token=RSJChaox
bamboo_capability_system_builder_gradle___gradlew=./gradlew
bamboo_buildResultsUrl=https://build.spring.io/browse/SCDT-LOCAL20XSKIPPER20X-KAFKA-196
bamboo_capability_system_builder_mvn3_Maven_3_3=/opt/maven-3.3
bamboo_capability_system_builder_mvn3_Maven_3_2=/opt/maven-3.2
bamboo_capability_system_builder_mvn3_Maven_3_1=/opt/maven-3.1
bamboo_planRepository_repositoryUrl=https://github.com/spring-cloud/spring-cloud-dataflow-acceptance-tests.git
bamboo_capability_system_builder_mvn3_Maven_3_6=/opt/maven-3.6
bamboo_agentId=286195715
bamboo_capability_system_builder_mvn3_Maven_3_5=/opt/maven-3.5
bamboo_capability_system_builder_mvn3_Maven_3_0=/opt/maven-3.0
bamboo_planRepository_revision=de5f215a8ff95acbff6f531ccc41df40caef3fbd
bamboo_planRepository_previousRevision=de5f215a8ff95acbff6f531ccc41df40caef3fbd
bamboo_capability_remote_build=true
bamboo_repository_branch_name=master
bamboo_sonatype_token_password=********
bamboo_sonatype_user=springsource
bamboo_repository_274694331_name=Git
bamboo_scdf_acceptance_tests_password=********
bamboo_APPLE_AC_PASSWORD=********
bamboo_repository_274694331_git_branch=master
bamboo_planRepository_branch=master
bamboo_capability_system_jdk_JDK_13=/opt/jdk-13
bamboo_planRepository_1_type=gitv2
bamboo_planRepository_branchName=master
bamboo_capability_system_jdk_JDK_12=/opt/jdk-12
bamboo_capability_system_builder_gradlew_gradlew=./
bamboo_capability_system_builder_ant_Ant_1_10=/opt/ant-1.10
bamboo_sonar_password=********
bamboo_hg_cache_directory=/opt/bamboo-home/xml-data/build-dir/_hg-repositories-cache
bamboo_planRepository_1_username=spring-buildmaster
bamboo_repository_274694331_git_repositoryUrl=https://github.com/spring-cloud/spring-cloud-dataflow-acceptance-tests.git
bamboo_planRepository_type=gitv2
bamboo_git_cache_directory=/opt/bamboo-home/xml-data/build-dir/_git-repositories-cache
bamboo_artifactory_username=buildmaster
bamboo_tmp_directory=/opt/bamboo-home/temp
bamboo_planKey=SCDT-LOCAL20XSKIPPER20X
bamboo_planRepository_username=spring-buildmaster
bamboo_JDK8_HOME=/opt/jdk-8
bamboo_repository_274694331_previous_revision_number=de5f215a8ff95acbff6f531ccc41df40caef3fbd
bamboo_planRepository_1_branchName=master
bamboo_sonar_version=6.7.7
bamboo_sonar_jdbc_password=********
bamboo_bintray_api_key_password=********
bamboo_capability_system_jdk_JDK_1_11=/opt/jdk-11
bamboo_resultsUrl=https://build.spring.io/browse/SCDT-LOCAL20XSKIPPER20X-KAFKA-196
bamboo_APPLE_AC_USERNAME_PASSWORD=********
bamboo_capability_system_jdk_JDK_1_10=/opt/jdk-10
bamboo_build_working_directory=/opt/bamboo-home/xml-data/build-dir/SCDT-LOCAL20XSKIPPER20X-KAFKA
bamboo_planRepository_1_name=Git
bamboo_capability_system_os=ubuntu1804
bamboo_nexusPush_stagingProfile=buildmaster
bamboo_shortPlanName=Local + SCDF-2.0.4.BS + Skipper 2.0.4.BS (12 am)
bamboo_planRepository_name=Git
bamboo_buildNumber=196
bamboo_planName=Spring Cloud Data Flow Acceptance Tests - Local + SCDF-2.0.4.BS + Skipper 2.0.4.BS (12 am)
bamboo_JDK7_HOME=/opt/jdk-7
bamboo_build_commandline_com_atlassian_bamboo_plugins_scripttask_task_builder_script_7=/opt/bamboo-home/temp/SCDT-LOCAL20XSKIPPER20X-KAFKA-196-ScriptBuildTask-4054678740919750921.sh
bamboo_shortPlanKey=LOCAL20XSKIPPER20X
bamboo_shortJobKey=KAFKA
bamboo_artifactory_password=********
bamboo_buildTimeStamp=2019-12-14T00:00:11.829Z
bamboo_repository_previous_revision_number=de5f215a8ff95acbff6f531ccc41df40caef3fbd
bamboo_sonar_username=buildmaster
bamboo_********_password=********
bamboo_repository_git_branch=master
bamboo_buildResultKey=SCDT-LOCAL20XSKIPPER20X-KAFKA-196
bamboo_nexusPush_close=true
bamboo_artifactory_override_resolver_username=buildmaster
bamboo_buildPlanName=Spring Cloud Data Flow Acceptance Tests - Local + SCDF-2.0.4.BS + Skipper 2.0.4.BS (12 am) - Run Data Flow Acceptance Tests for Kafka
bamboo_repository_274694331_revision_number=de5f215a8ff95acbff6f531ccc41df40caef3fbd
bamboo_planRepository_1_revision=de5f215a8ff95acbff6f531ccc41df40caef3fbd
bamboo_repository_name=Git
bamboo_signing_key_password=********
bamboo_capability_system_builder_groovy_Groovy_2_5=/opt/groovy-2.5
bamboo_buildFailed=true
bamboo_capability_system_docker_executable=/usr/bin/docker
bamboo_capability_system_jdk_OpenJDK_7=/opt/jdk-7
bamboo_capability_system_builder_groovy_Groovy_2_4=/opt/groovy-2.4
bamboo_artifactory_override_deployer_username=buildmaster
bamboo_capability_system_builder_command_Bash=/bin/bash
bamboo_jobFailed=true
bamboo_agentWorkingDirectory=/opt/bamboo-home/xml-data/build-dir
bamboo_capability_system_git_executable=/usr/bin/git
bamboo_repository_git_username=spring-buildmaster
bamboo_planRepository_1_previousRevision=de5f215a8ff95acbff6f531ccc41df40caef3fbd
bamboo_capability_os_family=unix
bamboo_planRepository_branchDisplayName=master
bamboo_capability_system_builder_maven_Artifactory_Maven_3_6=/opt/maven-3.6
bamboo_capability_system_builder_maven_Artifactory_Maven_3_5=/opt/maven-3.5
bamboo_capability_system_builder_maven_Artifactory_Maven_3_3=/opt/maven-3.3
bamboo_capability_system_builder_maven_Artifactory_Maven_3_2=/opt/maven-3.2
bamboo_s3_properties=/home/bamboo/tools/s3.properties
bamboo_capability_system_builder_maven_Artifactory_Maven_3_1=/opt/maven-3.1
bamboo_artifactory_override_deploy_repo=libs-snapshot-local
bamboo_capability_system_builder_maven_Artifactory_Maven_3_0=/opt/maven-3.0
bamboo_plan_storageTag=plan-274497908
bamboo_bintray_username_password=********
bamboo_repository_git_repositoryUrl=https://github.com/spring-cloud/spring-cloud-dataflow-acceptance-tests.git
bamboo_working_directory=/opt/bamboo-home/xml-data/build-dir/SCDT-LOCAL20XSKIPPER20X-KAFKA
bamboo_planRepository_1_repositoryUrl=https://github.com/spring-cloud/spring-cloud-dataflow-acceptance-tests.git
bamboo_capability_system_jdk_JDK_1_8=/opt/jdk-8
bamboo_artifactory_override_deployer_password=********
bamboo_capability_system_jdk_JDK_1_9=/opt/jdk-9
bamboo_capability_system_jdk_JDK_1_6=/opt/jdk-6
bamboo_sonatype_password=********
bamboo_capability_system_jdk_JDK_1_7=/opt/jdk-7
bamboo_sonar_ip=10.194.6.9
bamboo_ge_cache_password=********
14-Dec-2019 00:37:04 CLEANING UP RESOURCES AFTER RUNNING TESTS
14-Dec-2019 00:37:04 Environment variable JAVA_HOME must be set
14-Dec-2019 00:37:04 FINISHED CLEANING UP RESOURCES
14-Dec-2019 00:37:04 Finished task 'clean up' with result: Success
14-Dec-2019 00:37:04 Running post build plugin 'Docker Container Cleanup'
14-Dec-2019 00:37:04 Running post build plugin 'NCover Results Collector'
14-Dec-2019 00:37:04 Running post build plugin 'Artifactory Release Management Staging'
14-Dec-2019 00:37:04 Running post build plugin 'Artifactory Build Info Copier'
14-Dec-2019 00:37:04 Running post build plugin 'Artifactory Gradle Properties Info Copier'
14-Dec-2019 00:37:04 Running post build plugin 'Clover Results Collector'
14-Dec-2019 00:37:04 Running post build plugin 'npm Cache Cleanup'
14-Dec-2019 00:37:04 Running post build plugin 'Artifact Copier'
14-Dec-2019 00:37:04 Publishing an artifact: App and Server Logs
14-Dec-2019 00:37:04 Finished publishing of artifact Non required job artifact: [App and Server Logs], pattern: [**/*.log] anchored at: [local] in 47.81 ms
14-Dec-2019 00:37:04 Publishing an artifact: Test Results
14-Dec-2019 00:37:04 Finished publishing of artifact Non required job artifact: [Test Results], pattern: [**/target/surefire-reports/**/*.*] in 37.44 ms
14-Dec-2019 00:37:04 Successfully removed working directory at '/opt/bamboo-home/xml-data/build-dir/SCDT-LOCAL20XSKIPPER20X-KAFKA'
14-Dec-2019 00:37:04 Finalising the build...
14-Dec-2019 00:37:04 Stopping timer.
14-Dec-2019 00:37:04 Build SCDT-LOCAL20XSKIPPER20X-KAFKA-196 completed.
14-Dec-2019 00:37:04 Running on server: post build plugin 'NCover Results Collector'
14-Dec-2019 00:37:04 Running on server: post build plugin 'Build Hanging Detection Configuration'
14-Dec-2019 00:37:04 Running on server: post build plugin 'Bamboo project link creator'
14-Dec-2019 00:37:04 Running on server: post build plugin 'Clover Delta Calculator'
14-Dec-2019 00:37:04 Running on server: post build plugin 'Maven Dependencies Postprocessor'
14-Dec-2019 00:37:04 All post build plugins have finished
14-Dec-2019 00:37:04 Generating build results summary...
14-Dec-2019 00:37:04 Saving build results to disk...
14-Dec-2019 00:37:04 Logging substituted variables...
14-Dec-2019 00:37:04 Indexing build results...
14-Dec-2019 00:37:04 Finished building SCDT-LOCAL20XSKIPPER20X-KAFKA-196.