Build: #2 did not complete

Job: Run Data Flow Acceptance Tests for Kafka was successful

Stages & jobs

  1. Test Stage - Kafka

  2. Test Stage - Rabbit

Build log

The build generated 800 lines of output. Download or view full build log

06-Nov-2018 21:59:35 Build Spring Cloud Data Flow Acceptance Tests - Local + SCDF-2.0.0.BS + Skipper 2.0.0.BS - Run Data Flow Acceptance Tests for Kafka #2 (SCDT-LOCAL20XSKIPPER20X-KAFKA-2) started building on agent bamboo-04.af.pivotal.io
06-Nov-2018 21:59:35 Remote agent on host bamboo-04.af.pivotal.io
06-Nov-2018 21:59:35 Build working directory is /opt/bamboo-home/xml-data/build-dir/SCDT-LOCAL20XSKIPPER20X-KAFKA
06-Nov-2018 21:59:35 Executing build Spring Cloud Data Flow Acceptance Tests - Local + SCDF-2.0.0.BS + Skipper 2.0.0.BS - Run Data Flow Acceptance Tests for Kafka #2 (SCDT-LOCAL20XSKIPPER20X-KAFKA-2)
06-Nov-2018 21:59:35 Starting task 'Checkout Default Repository' of type 'com.atlassian.bamboo.plugins.vcs:task.vcs.checkout'
06-Nov-2018 21:59:35 Checking out into /opt/bamboo-home/xml-data/build-dir/SCDT-LOCAL20XSKIPPER20X-KAFKA
06-Nov-2018 21:59:35 Updating source code to revision: 08e5bc520aba466c60a3788b41b49655670899b6
06-Nov-2018 21:59:35 Creating local git repository in '/opt/bamboo-home/xml-data/build-dir/SCDT-LOCAL20XSKIPPER20X-KAFKA/.git'.
06-Nov-2018 21:59:35 Initialized empty Git repository in /opt/bamboo-home/xml-data/build-dir/SCDT-LOCAL20XSKIPPER20X-KAFKA/.git/
06-Nov-2018 21:59:35 Fetching 'refs/heads/master' from 'https://github.com/spring-cloud/spring-cloud-dataflow-acceptance-tests.git'.
06-Nov-2018 21:59:37 From https://github.com/spring-cloud/spring-cloud-dataflow-acceptance-tests
06-Nov-2018 21:59:37 * [new branch]      master     -> master
06-Nov-2018 21:59:37 Checking out revision 08e5bc520aba466c60a3788b41b49655670899b6.
06-Nov-2018 21:59:37 Already on 'master'
06-Nov-2018 21:59:37 Updated source code to revision: 08e5bc520aba466c60a3788b41b49655670899b6
06-Nov-2018 21:59:37 Finished task 'Checkout Default Repository' with result: Success
06-Nov-2018 21:59:37 Running pre-build action: Artifactory Release Staging
06-Nov-2018 21:59:37 Running pre-build action: VCS Version Collector
06-Nov-2018 21:59:37 Starting task 'Execute Acceptance Tests' of type 'com.atlassian.bamboo.plugins.scripttask:task.builder.script'
06-Nov-2018 21:59:37
Beginning to execute external process for build 'Spring Cloud Data Flow Acceptance Tests - Local + SCDF-2.0.0.BS + Skipper 2.0.0.BS - Run Data Flow Acceptance Tests for Kafka #2 (SCDT-LOCAL20XSKIPPER20X-KAFKA-2)'
... running command line:
/opt/bamboo-home/temp/SCDT-LOCAL20XSKIPPER20X-KAFKA-2-ScriptBuildTask-1221401684338795842.sh
... in: /opt/bamboo-home/xml-data/build-dir/SCDT-LOCAL20XSKIPPER20X-KAFKA
... using extra environment variables:
bamboo_planRepository_1_branch=master
bamboo_signing_store_password=********
bamboo_capability_system_builder_ant_Ant_1_9=/opt/ant-1.9
bamboo_capability_system_builder_ant_Ant_1_8=/opt/ant-1.8
bamboo_planRepository_1_branchDisplayName=master
bamboo_repository_274694331_git_username=spring-buildmaster
bamboo_capability_system_jdk_OpenJDK_7u181=/opt/openjdk-7
bamboo_repository_revision_number=08e5bc520aba466c60a3788b41b49655670899b6
bamboo_capability_system_builder_node_Node_js_6=/usr/bin/node
bamboo_RIAK_BIN=/usr/sbin/riak
bamboo_buildKey=SCDT-LOCAL20XSKIPPER20X-KAFKA
bamboo_repository_274694331_branch_name=master
bamboo_sonar_token_password=********
bamboo_shortJobName=Run Data Flow Acceptance Tests for Kafka
bamboo_capability_system_builder_gradle___gradlew=./gradlew
bamboo_buildResultsUrl=https://build.spring.io/browse/SCDT-LOCAL20XSKIPPER20X-KAFKA-2
bamboo_capability_system_builder_mvn3_Maven_3_3=/opt/maven-3.3
bamboo_capability_system_builder_mvn3_Maven_3_2=/opt/maven-3.2
bamboo_capability_system_builder_mvn3_Maven_3_1=/opt/maven-3.1
bamboo_planRepository_repositoryUrl=https://github.com/spring-cloud/spring-cloud-dataflow-acceptance-tests.git
bamboo_agentId=208568323
bamboo_capability_system_builder_mvn3_Maven_3_5=/opt/maven-3.5
bamboo_capability_system_builder_mvn3_Maven_3_0=/opt/maven-3.0
bamboo_planRepository_revision=08e5bc520aba466c60a3788b41b49655670899b6
bamboo_planRepository_previousRevision=0c83aa4efad4b0e7540794d10f3ecde4f6a5a6d6
bamboo_capability_remote_build=true
bamboo_repository_branch_name=master
bamboo_repository_274694331_name=Git
bamboo_scdf_acceptance_tests_password=********
JAVA_HOME=/opt/jdk-8
bamboo_dependenciesDisabled=false
bamboo_repository_274694331_git_branch=master
bamboo_capability_Agent=bamboo-04.af.pivotal.io
bamboo_planRepository_branch=master
bamboo_planRepository_1_type=gitv2
bamboo_planRepository_branchName=master
bamboo_sonar_password=********
bamboo_hg_cache_directory=/opt/bamboo-home/xml-data/build-dir/_hg-repositories-cache
bamboo_planRepository_1_username=spring-buildmaster
bamboo_repository_274694331_git_repositoryUrl=https://github.com/spring-cloud/spring-cloud-dataflow-acceptance-tests.git
bamboo_planRepository_type=gitv2
bamboo_ManualBuildTriggerReason_userName=mpollack
bamboo_git_cache_directory=/opt/bamboo-home/xml-data/build-dir/_git-repositories-cache
bamboo_artifactory_username=buildmaster
bamboo_tmp_directory=/opt/bamboo-home/temp
bamboo_planKey=SCDT-LOCAL20XSKIPPER20X
bamboo_planRepository_username=spring-buildmaster
bamboo_JDK8_HOME=/opt/jdk-8
bamboo_repository_274694331_previous_revision_number=0c83aa4efad4b0e7540794d10f3ecde4f6a5a6d6
bamboo_planRepository_1_branchName=master
bamboo_sonar_version=5.6.3
bamboo_capability_system_jdk_JDK_1_11=/opt/jdk-11
bamboo_resultsUrl=https://build.spring.io/browse/SCDT-LOCAL20XSKIPPER20X-KAFKA-2
bamboo_capability_system_jdk_JDK_1_10=/opt/jdk-10
bamboo_build_working_directory=/opt/bamboo-home/xml-data/build-dir/SCDT-LOCAL20XSKIPPER20X-KAFKA
bamboo_planRepository_1_name=Git
bamboo_capability_system_os=ubuntu1604
bamboo_nexusPush_stagingProfile=buildmaster
bamboo_shortPlanName=Local + SCDF-2.0.0.BS + Skipper 2.0.0.BS
bamboo_planRepository_name=Git
bamboo_buildNumber=2
bamboo_planName=Spring Cloud Data Flow Acceptance Tests - Local + SCDF-2.0.0.BS + Skipper 2.0.0.BS
bamboo_JDK7_HOME=/opt/jdk-7
bamboo_shortPlanKey=LOCAL20XSKIPPER20X
bamboo_shortJobKey=KAFKA
bamboo_artifactory_password=********
bamboo_buildTimeStamp=2018-11-06T21:59:35.143Z
bamboo_repository_previous_revision_number=0c83aa4efad4b0e7540794d10f3ecde4f6a5a6d6
bamboo_sonar_username=buildmaster
bamboo_repository_git_branch=master
bamboo_buildResultKey=SCDT-LOCAL20XSKIPPER20X-KAFKA-2
bamboo_nexusPush_close=true
bamboo_buildPlanName=Spring Cloud Data Flow Acceptance Tests - Local + SCDF-2.0.0.BS + Skipper 2.0.0.BS - Run Data Flow Acceptance Tests for Kafka
bamboo_repository_274694331_revision_number=08e5bc520aba466c60a3788b41b49655670899b6
bamboo_planRepository_1_revision=08e5bc520aba466c60a3788b41b49655670899b6
bamboo_repository_name=Git
bamboo_signing_key_password=********
bamboo_buildFailed=false
bamboo_capability_system_docker_executable=/usr/bin/docker
bamboo_capability_system_builder_groovy_Groovy_2_4=/opt/groovy-2.4
bamboo_capability_system_builder_command_Bash=/bin/bash
bamboo_agentWorkingDirectory=/opt/bamboo-home/xml-data/build-dir
bamboo_capability_system_git_executable=/usr/bin/git
bamboo_repository_git_username=spring-buildmaster
bamboo_planRepository_1_previousRevision=0c83aa4efad4b0e7540794d10f3ecde4f6a5a6d6
bamboo_capability_os_family=unix
bamboo_planRepository_branchDisplayName=master
bamboo_capability_system_builder_maven_Artifactory_Maven_3_5=/opt/maven-3.5
bamboo_capability_system_builder_maven_Artifactory_Maven_3_3=/opt/maven-3.3
bamboo_capability_system_builder_maven_Artifactory_Maven_3_2=/opt/maven-3.2
bamboo_s3_properties=/home/bamboo/tools/s3.properties
bamboo_capability_system_builder_maven_Artifactory_Maven_3_1=/opt/maven-3.1
bamboo_capability_system_builder_maven_Artifactory_Maven_3_0=/opt/maven-3.0
bamboo_plan_storageTag=plan-274497908
bamboo_repository_git_repositoryUrl=https://github.com/spring-cloud/spring-cloud-dataflow-acceptance-tests.git
bamboo_working_directory=/opt/bamboo-home/xml-data/build-dir/SCDT-LOCAL20XSKIPPER20X-KAFKA
bamboo_planRepository_1_repositoryUrl=https://github.com/spring-cloud/spring-cloud-dataflow-acceptance-tests.git
bamboo_capability_system_jdk_JDK_1_8=/opt/jdk-8
bamboo_capability_system_jdk_JDK_1_9=/opt/jdk-9
bamboo_capability_system_jdk_JDK_1_6=/opt/jdk-6
bamboo_capability_system_jdk_JDK_1_7=/opt/jdk-7
bamboo_sonar_ip=10.194.6.9
06-Nov-2018 21:59:37 CLEANING UP RESOURCES BEFORE TESTS
06-Nov-2018 21:59:38 Setting the environment variables
06-Nov-2018 21:59:38 Export the unset env. variables from /opt/bamboo-home/xml-data/build-dir/SCDT-LOCAL20XSKIPPER20X-KAFKA/local/init/env.properties :
06-Nov-2018 21:59:38    SPRING_CLOUD_DATAFLOW_SERVER_DOWNLOAD_URL = http://repo.spring.io/libs-snapshot/org/springframework/cloud/spring-cloud-dataflow-server-local//spring-cloud-dataflow-server-local-.jar
06-Nov-2018 21:59:38    SPRING_CLOUD_SKIPPER_SERVER_DOWNLOAD_URL = http://repo.spring.io/libs-snapshot/org/springframework/cloud/spring-cloud-skipper-server//spring-cloud-skipper-server-.jar
06-Nov-2018 21:59:38    SPRING_DATASOURCE_USERNAME = spring
06-Nov-2018 21:59:38    SPRING_DATASOURCE_PASSWORD = cloud
06-Nov-2018 21:59:38    SPRING_SCHEMA_NAME = dataflow
06-Nov-2018 21:59:38    DOCKER_SERVER = localhost
06-Nov-2018 21:59:38 Setting retries to 60 and WAIT_TIME to 5
06-Nov-2018 21:59:38 Export the unset env. variables from /opt/bamboo-home/xml-data/build-dir/SCDT-LOCAL20XSKIPPER20X-KAFKA/local/binder/rabbit/env.properties :
06-Nov-2018 21:59:38    STREAM_REGISTRATION_RESOURCE = http://repo.spring.io/libs-release/org/springframework/cloud/stream/app/spring-cloud-stream-app-descriptor/Celsius.SR3/spring-cloud-stream-app-descriptor-Celsius.SR3.stream-apps-rabbit-maven
06-Nov-2018 21:59:38    TASK_REGISTRATION_RESOURCE = http://repo.spring.io/libs-release/org/springframework/cloud/task/app/spring-cloud-task-app-descriptor/Clark.RELEASE/spring-cloud-task-app-descriptor-Clark.RELEASE.task-apps-maven
06-Nov-2018 21:59:38 SCDF SERVER URI: http://localhost:9393
06-Nov-2018 21:59:38 Clean up, clean up, everybody everywhere; clean up clean up, everybody do your share!
06-Nov-2018 21:59:41 No stopped containers
06-Nov-2018 21:59:42 No stopped containers
06-Nov-2018 21:59:43 No stopped containers
06-Nov-2018 21:59:43 FINISHED CLEANING UP RESOURCES
06-Nov-2018 21:59:43 Setting the environment variables
06-Nov-2018 21:59:43 Export the unset env. variables from /opt/bamboo-home/xml-data/build-dir/SCDT-LOCAL20XSKIPPER20X-KAFKA/local/init/env.properties :
06-Nov-2018 21:59:43    SPRING_CLOUD_DATAFLOW_SERVER_DOWNLOAD_URL = http://repo.spring.io/libs-snapshot/org/springframework/cloud/spring-cloud-dataflow-server-local/2.0.0.BUILD-SNAPSHOT/spring-cloud-dataflow-server-local-2.0.0.BUILD-SNAPSHOT.jar
06-Nov-2018 21:59:43    SPRING_CLOUD_SKIPPER_SERVER_DOWNLOAD_URL = http://repo.spring.io/libs-snapshot/org/springframework/cloud/spring-cloud-skipper-server/2.0.0.BUILD-SNAPSHOT/spring-cloud-skipper-server-2.0.0.BUILD-SNAPSHOT.jar
06-Nov-2018 21:59:43    SPRING_DATASOURCE_USERNAME = spring
06-Nov-2018 21:59:43    SPRING_DATASOURCE_PASSWORD = cloud
06-Nov-2018 21:59:43    SPRING_SCHEMA_NAME = dataflow
06-Nov-2018 21:59:43    DOCKER_SERVER = localhost
06-Nov-2018 21:59:43 Setting retries to 60 and WAIT_TIME to 5
06-Nov-2018 21:59:43 cleaning up any previous mysql docker containers...
06-Nov-2018 21:59:43 done cleaning up.
06-Nov-2018 21:59:43 Could not find a local mysql server, trying docker.
06-Nov-2018 21:59:44 Pulling mysql (mysql:5.7)...
06-Nov-2018 21:59:45 5.7: Pulling from library/mysql
06-Nov-2018 21:59:57 Digest: sha256:42bab37eda993e417c5e7d751f1008b653c3fd85ad6aa416a519f1616c27e4a8
06-Nov-2018 21:59:57 Status: Downloaded newer image for mysql:5.7
06-Nov-2018 21:59:57 Creating mysql_mysql_1
06-Nov-2018 21:59:58 mysql running on localhost:3306
06-Nov-2018 21:59:58 Service host is localhost
06-Nov-2018 21:59:58 Creating kafka compose file on /opt/bamboo-home/xml-data/build-dir/SCDT-LOCAL20XSKIPPER20X-KAFKA/local/binder/kafka/docker-compose.yml
06-Nov-2018 21:59:58 cleaning up any previous kafka docker containers...
06-Nov-2018 21:59:58 done cleaning up
06-Nov-2018 21:59:58 Could not find a local kafka server, trying docker.
06-Nov-2018 21:59:58 Pulling zookeeper (wurstmeister/zookeeper:latest)...
06-Nov-2018 21:59:59 latest: Pulling from wurstmeister/zookeeper
06-Nov-2018 22:00:25 Digest: sha256:2d71f9e0cb3440d552ee31769a00eb813be87397bf535995aca0bd4eadc151fc
06-Nov-2018 22:00:25 Status: Downloaded newer image for wurstmeister/zookeeper:latest
06-Nov-2018 22:00:25 Pulling kafka (wurstmeister/kafka:0.10.2.1)...
06-Nov-2018 22:00:26 0.10.2.1: Pulling from wurstmeister/kafka
06-Nov-2018 22:00:36 Digest: sha256:62d676b64e77f9ca63276fac126d56b68125701143c578941638159fc5b9319e
06-Nov-2018 22:00:36 Status: Downloaded newer image for wurstmeister/kafka:0.10.2.1
06-Nov-2018 22:00:36 Creating kafka_zookeeper_1
06-Nov-2018 22:00:36 Creating kafka_kafka_1
06-Nov-2018 22:00:37 kafka running on localhost:9092
06-Nov-2018 22:00:37 Export the unset env. variables from /opt/bamboo-home/xml-data/build-dir/SCDT-LOCAL20XSKIPPER20X-KAFKA/local/binder/kafka/env.properties :
06-Nov-2018 22:00:37    STREAM_REGISTRATION_RESOURCE = http://repo.spring.io/libs-release/org/springframework/cloud/stream/app/spring-cloud-stream-app-descriptor/Celsius.SR3/spring-cloud-stream-app-descriptor-Celsius.SR3.stream-apps-kafka-10-maven
06-Nov-2018 22:00:37    TASK_REGISTRATION_RESOURCE = http://repo.spring.io/libs-release/org/springframework/cloud/task/app/spring-cloud-task-app-descriptor/Clark.RELEASE/spring-cloud-task-app-descriptor-Clark.RELEASE.task-apps-maven
06-Nov-2018 22:00:37 cleaning up any previous redis docker containers...
06-Nov-2018 22:00:37 done cleaning up.
06-Nov-2018 22:00:38 redis found on localhost
06-Nov-2018 22:00:38 SKIPPER SERVER URI: http://localhost:7577
06-Nov-2018 22:00:38 Downloading server from http://repo.spring.io/libs-snapshot/org/springframework/cloud/spring-cloud-skipper-server/2.0.0.BUILD-SNAPSHOT/spring-cloud-skipper-server-2.0.0.BUILD-SNAPSHOT.jar
06-Nov-2018 22:01:49 2018-11-06 22:01:49 URL:http://repo.spring.io/libs-snapshot/org/springframework/cloud/spring-cloud-skipper-server/2.0.0.BUILD-SNAPSHOT/spring-cloud-skipper-server-2.0.0.BUILD-SNAPSHOT.jar [75441339/75441339] -> "/opt/bamboo-home/xml-data/build-dir/SCDT-LOCAL20XSKIPPER20X-KAFKA/local/skipper-server/skipper-server.jar" [1]
06-Nov-2018 22:01:49 executing [nohup /opt/jdk-8/bin/java  -Xmx1024m -Xss1024k -jar /opt/bamboo-home/xml-data/build-dir/SCDT-LOCAL20XSKIPPER20X-KAFKA/local/skipper-server/skipper-server.jar  --spring.datasource.driver-class-name=org.mariadb.jdbc.Driver --spring.datasource.url=jdbc:mysql://localhost/dataflow --spring.datasource.username=spring --spring.datasource.password=cloud  --spring.cloud.dataflow.applicationProperties.stream.spring.cloud.stream.kafka.binder.brokers=localhost --spring.cloud.dataflow.applicationProperties.stream.spring.cloud.stream.kafka.binder.zkNodes=localhost  --spring.redis.host=127.0.0.1 --spring.cloud.skipper.server.platform.local.accounts.default.workingDirectoriesRoot=/opt/bamboo-home/xml-data/build-dir/SCDT-LOCAL20XSKIPPER20X-KAFKA/local/skipper-server/app-logs > /opt/bamboo-home/xml-data/build-dir/SCDT-LOCAL20XSKIPPER20X-KAFKA/local/skipper-server/skipper-server.log &]
06-Nov-2018 22:01:49 [/opt/bamboo-home/xml-data/build-dir/SCDT-LOCAL20XSKIPPER20X-KAFKA/local/skipper-server] process pid is [7907]
06-Nov-2018 22:01:49 System props are []
06-Nov-2018 22:01:49 Logs are under [/opt/bamboo-home/xml-data/build-dir/SCDT-LOCAL20XSKIPPER20X-KAFKA/local/skipper-server/skipper-server.log] or from nohup [/opt/bamboo-home/xml-data/build-dir/SCDT-LOCAL20XSKIPPER20X-KAFKA/local/skipper-server/nohup.log]
06-Nov-2018 22:01:49 Failed to connect to localhost:7577. Attempt  #1/60... will try again in [5] seconds
06-Nov-2018 22:01:54 Failed to connect to localhost:7577. Attempt  #2/60... will try again in [5] seconds
06-Nov-2018 22:01:59 Failed to connect to localhost:7577. Attempt  #3/60... will try again in [5] seconds
06-Nov-2018 22:02:04 Failed to connect to localhost:7577. Attempt  #4/60... will try again in [5] seconds
06-Nov-2018 22:02:10 SCDF SERVER URI: http://localhost:9393
06-Nov-2018 22:02:10 Downloading server from http://repo.spring.io/libs-snapshot/org/springframework/cloud/spring-cloud-dataflow-server-local/2.0.0.BUILD-SNAPSHOT/spring-cloud-dataflow-server-local-2.0.0.BUILD-SNAPSHOT.jar
06-Nov-2018 22:03:33 2018-11-06 22:03:33 URL:http://repo.spring.io/libs-snapshot/org/springframework/cloud/spring-cloud-dataflow-server-local/2.0.0.BUILD-SNAPSHOT/spring-cloud-dataflow-server-local-2.0.0.BUILD-SNAPSHOT.jar [71982903/71982903] -> "/opt/bamboo-home/xml-data/build-dir/SCDT-LOCAL20XSKIPPER20X-KAFKA/local/server/scdf-server.jar" [1]
06-Nov-2018 22:03:33 SPRING_PROFILES_ACTIVE []
06-Nov-2018 22:03:33 executing [nohup /opt/jdk-8/bin/java  -Xmx1024m -Xss1024k -jar /opt/bamboo-home/xml-data/build-dir/SCDT-LOCAL20XSKIPPER20X-KAFKA/local/server/scdf-server.jar  --spring.datasource.driver-class-name=org.mariadb.jdbc.Driver --spring.datasource.url=jdbc:mysql://localhost/dataflow --spring.datasource.username=spring --spring.datasource.password=cloud  --spring.cloud.dataflow.applicationProperties.stream.spring.cloud.stream.kafka.binder.brokers=localhost --spring.cloud.dataflow.applicationProperties.stream.spring.cloud.stream.kafka.binder.zkNodes=localhost  --spring.redis.host=127.0.0.1 --spring.cloud.skipper.server.platform.local.accounts.default.workingDirectoriesRoot=/opt/bamboo-home/xml-data/build-dir/SCDT-LOCAL20XSKIPPER20X-KAFKA/local/skipper-server/app-logs --spring.cloud.dataflow.features.skipper-enabled=true > /opt/bamboo-home/xml-data/build-dir/SCDT-LOCAL20XSKIPPER20X-KAFKA/local/server/scdf-server.log &]
06-Nov-2018 22:03:33 [/opt/bamboo-home/xml-data/build-dir/SCDT-LOCAL20XSKIPPER20X-KAFKA/local/server] process pid is [8131]
06-Nov-2018 22:03:33 System props are []
06-Nov-2018 22:03:33 Logs are under [/opt/bamboo-home/xml-data/build-dir/SCDT-LOCAL20XSKIPPER20X-KAFKA/local/server/scdf-server.log] or from nohup [/opt/bamboo-home/xml-data/build-dir/SCDT-LOCAL20XSKIPPER20X-KAFKA/local/server/nohup.log]
06-Nov-2018 22:03:33 Failed to connect to localhost:9393. Attempt  #1/60... will try again in [5] seconds
06-Nov-2018 22:03:38 Failed to connect to localhost:9393. Attempt  #2/60... will try again in [5] seconds
06-Nov-2018 22:03:43 Failed to connect to localhost:9393. Attempt  #3/60... will try again in [5] seconds
06-Nov-2018 22:03:48 Failed to connect to localhost:9393. Attempt  #4/60... will try again in [5] seconds
06-Nov-2018 22:03:53 SCDF SERVER ABOUT:
06-Nov-2018 22:03:55 {
06-Nov-2018 22:03:55     "_links": {
06-Nov-2018 22:03:55         "self": {
06-Nov-2018 22:03:55             "href": "http://localhost:9393/about"
06-Nov-2018 22:03:55         }
06-Nov-2018 22:03:55     },
06-Nov-2018 22:03:55     "featureInfo": {
06-Nov-2018 22:03:55         "analyticsEnabled": true,
06-Nov-2018 22:03:55         "schedulerEnabled": false,
06-Nov-2018 22:03:55         "skipperEnabled": true,
06-Nov-2018 22:03:55         "streamsEnabled": true,
06-Nov-2018 22:03:55         "tasksEnabled": true
06-Nov-2018 22:03:55     },
06-Nov-2018 22:03:55     "runtimeEnvironment": {
06-Nov-2018 22:03:55         "appDeployer": {
06-Nov-2018 22:03:55             "deployerImplementationVersion": "2.0.0.BUILD-SNAPSHOT",
06-Nov-2018 22:03:55             "deployerName": "Spring Cloud Skipper Server",
06-Nov-2018 22:03:55             "deployerSpiVersion": "2.0.0.BUILD-SNAPSHOT",
06-Nov-2018 22:03:55             "javaVersion": "1.8.0_144",
06-Nov-2018 22:03:55             "platformApiVersion": "",
06-Nov-2018 22:03:55             "platformClientVersion": "",
06-Nov-2018 22:03:55             "platformHostVersion": "",
06-Nov-2018 22:03:55             "platformSpecificInfo": {
06-Nov-2018 22:03:55                 "default": "local"
06-Nov-2018 22:03:55             },
06-Nov-2018 22:03:55             "platformType": "Skipper Managed",
06-Nov-2018 22:03:55             "springBootVersion": "2.0.4.RELEASE",
06-Nov-2018 22:03:55             "springVersion": "5.0.8.RELEASE"
06-Nov-2018 22:03:55         },
06-Nov-2018 22:03:55         "taskLauncher": {
06-Nov-2018 22:03:55             "deployerImplementationVersion": "1.3.9.RELEASE",
06-Nov-2018 22:03:55             "deployerName": "LocalTaskLauncher",
06-Nov-2018 22:03:55             "deployerSpiVersion": "1.3.4.RELEASE",
06-Nov-2018 22:03:55             "javaVersion": "1.8.0_144",
06-Nov-2018 22:03:55             "platformApiVersion": "Linux 4.4.0-138-generic",
06-Nov-2018 22:03:55             "platformClientVersion": "4.4.0-138-generic",
06-Nov-2018 22:03:55             "platformHostVersion": "4.4.0-138-generic",
06-Nov-2018 22:03:55             "platformSpecificInfo": {},
06-Nov-2018 22:03:55             "platformType": "Local",
06-Nov-2018 22:03:55             "springBootVersion": "2.0.4.RELEASE",
06-Nov-2018 22:03:55             "springVersion": "5.0.8.RELEASE"
06-Nov-2018 22:03:55         }
06-Nov-2018 22:03:55     },
06-Nov-2018 22:03:55     "securityInfo": {
06-Nov-2018 22:03:55         "authenticated": false,
06-Nov-2018 22:03:55         "authenticationEnabled": false,
06-Nov-2018 22:03:55         "authorizationEnabled": false,
06-Nov-2018 22:03:55         "formLogin": false,
06-Nov-2018 22:03:55         "roles": [],
06-Nov-2018 22:03:55         "username": null
06-Nov-2018 22:03:55     },
06-Nov-2018 22:03:55     "versionInfo": {
06-Nov-2018 22:03:55         "core": {
06-Nov-2018 22:03:55             "name": "Spring Cloud Data Flow Core",
06-Nov-2018 22:03:55             "version": "2.0.0.BUILD-SNAPSHOT"
06-Nov-2018 22:03:55         },
06-Nov-2018 22:03:55         "dashboard": {
06-Nov-2018 22:03:55             "name": "Spring Cloud Dataflow UI",
06-Nov-2018 22:03:55             "version": "1.7.0.RELEASE"
06-Nov-2018 22:03:55         },
06-Nov-2018 22:03:55         "implementation": {
06-Nov-2018 22:03:55             "name": "spring-cloud-dataflow-server-local",
06-Nov-2018 22:03:55             "version": "2.0.0.BUILD-SNAPSHOT"
06-Nov-2018 22:03:55         },
06-Nov-2018 22:03:55         "shell": {
06-Nov-2018 22:03:55             "name": "Spring Cloud Data Flow Shell",
06-Nov-2018 22:03:55             "url": "https://repo.spring.io/libs-snapshot/org/springframework/cloud/spring-cloud-dataflow-shell/2.0.0.BUILD-SNAPSHOT/spring-cloud-dataflow-shell-2.0.0.BUILD-SNAPSHOT.jar",
06-Nov-2018 22:03:55             "version": "2.0.0.BUILD-SNAPSHOT"
06-Nov-2018 22:03:55         }
06-Nov-2018 22:03:55     }
06-Nov-2018 22:03:55 }
06-Nov-2018 22:03:55 SKIPPER SERVER ABOUT:
06-Nov-2018 22:03:55 {
06-Nov-2018 22:03:55     "versionInfo": {
06-Nov-2018 22:03:55         "server": {
06-Nov-2018 22:03:55             "name": "Spring Cloud Skipper Server",
06-Nov-2018 22:03:55             "version": "2.0.0.BUILD-SNAPSHOT"
06-Nov-2018 22:03:55         },
06-Nov-2018 22:03:55         "shell": {
06-Nov-2018 22:03:55             "name": "Spring Cloud Skipper Shell",
06-Nov-2018 22:03:55             "url": "https://repo.spring.io/libs-snapshot/org/springframework/cloud/spring-cloud-skipper-shell/2.0.0.BUILD-SNAPSHOT/spring-cloud-skipper-shell-2.0.0.BUILD-SNAPSHOT.jar",
06-Nov-2018 22:03:55             "version": "2.0.0.BUILD-SNAPSHOT"
06-Nov-2018 22:03:55         }
06-Nov-2018 22:03:55     }
06-Nov-2018 22:03:55 }
06-Nov-2018 22:03:57 [INFO] Scanning for projects...
06-Nov-2018 22:03:58 [INFO]                                                                         
06-Nov-2018 22:03:58 [INFO] ------------------------------------------------------------------------
06-Nov-2018 22:03:58 [INFO] Building Data Flow Acceptance Tests 1.1.0.BUILD-SNAPSHOT
06-Nov-2018 22:03:58 [INFO] ------------------------------------------------------------------------
06-Nov-2018 22:04:02 [INFO]
06-Nov-2018 22:04:02 [INFO] --- maven-checkstyle-plugin:2.17:check (checkstyle-validation) @ spring-cloud-dataflow-acceptance-tests ---
06-Nov-2018 22:04:04 [INFO]
06-Nov-2018 22:04:04 [INFO] --- maven-resources-plugin:2.6:resources (default-resources) @ spring-cloud-dataflow-acceptance-tests ---
06-Nov-2018 22:04:04 [INFO] Using 'UTF-8' encoding to copy filtered resources.
06-Nov-2018 22:04:04 [INFO] skip non existing resourceDirectory /opt/bamboo-home/xml-data/build-dir/SCDT-LOCAL20XSKIPPER20X-KAFKA/src/main/resources
06-Nov-2018 22:04:04 [INFO] skip non existing resourceDirectory /opt/bamboo-home/xml-data/build-dir/SCDT-LOCAL20XSKIPPER20X-KAFKA/src/main/resources
06-Nov-2018 22:04:04 [INFO]
06-Nov-2018 22:04:04 [INFO] --- maven-compiler-plugin:3.1:compile (default-compile) @ spring-cloud-dataflow-acceptance-tests ---
06-Nov-2018 22:04:04 [INFO] Changes detected - recompiling the module!
06-Nov-2018 22:04:04 [INFO] Compiling 8 source files to /opt/bamboo-home/xml-data/build-dir/SCDT-LOCAL20XSKIPPER20X-KAFKA/target/classes
06-Nov-2018 22:04:06 [INFO]
06-Nov-2018 22:04:06 [INFO] --- maven-resources-plugin:2.6:testResources (default-testResources) @ spring-cloud-dataflow-acceptance-tests ---
06-Nov-2018 22:04:06 [INFO] Using 'UTF-8' encoding to copy filtered resources.
06-Nov-2018 22:04:06 [INFO] Copying 1 resource
06-Nov-2018 22:04:06 [INFO]
06-Nov-2018 22:04:06 [INFO] --- maven-compiler-plugin:3.1:testCompile (default-testCompile) @ spring-cloud-dataflow-acceptance-tests ---
06-Nov-2018 22:04:06 [INFO] Changes detected - recompiling the module!
06-Nov-2018 22:04:06 [INFO] Compiling 15 source files to /opt/bamboo-home/xml-data/build-dir/SCDT-LOCAL20XSKIPPER20X-KAFKA/target/test-classes
06-Nov-2018 22:04:07 [WARNING] /opt/bamboo-home/xml-data/build-dir/SCDT-LOCAL20XSKIPPER20X-KAFKA/src/test/java/org/springframework/cloud/dataflow/acceptance/test/AbstractTaskTests.java: Some input files use unchecked or unsafe operations.
06-Nov-2018 22:04:07 [WARNING] /opt/bamboo-home/xml-data/build-dir/SCDT-LOCAL20XSKIPPER20X-KAFKA/src/test/java/org/springframework/cloud/dataflow/acceptance/test/AbstractTaskTests.java: Recompile with -Xlint:unchecked for details.
06-Nov-2018 22:04:07 [INFO]
06-Nov-2018 22:04:07 [INFO] --- maven-surefire-plugin:2.18.1:test (default-test) @ spring-cloud-dataflow-acceptance-tests ---
06-Nov-2018 22:04:07 [INFO] Surefire report directory: /opt/bamboo-home/xml-data/build-dir/SCDT-LOCAL20XSKIPPER20X-KAFKA/target/surefire-reports
06-Nov-2018 22:04:08
06-Nov-2018 22:04:08 -------------------------------------------------------
06-Nov-2018 22:04:08 T E S T S
06-Nov-2018 22:04:08 -------------------------------------------------------
06-Nov-2018 22:04:09 2018-11-06 22:04:09.317  INFO   --- [           main] .b.t.c.SpringBootTestContextBootstrapper : Neither @ContextConfiguration nor @ContextHierarchy found for test class [org.springframework.cloud.dataflow.acceptance.test.AnalyticsTests], using SpringBootContextLoader
06-Nov-2018 22:04:09 2018-11-06 22:04:09.429  INFO   --- [           main] .b.t.c.SpringBootTestContextBootstrapper : Loaded default TestExecutionListener class names from location [META-INF/spring.factories]: [org.springframework.boot.test.mock.mockito.MockitoTestExecutionListener, org.springframework.boot.test.mock.mockito.ResetMocksTestExecutionListener, org.springframework.boot.test.autoconfigure.restdocs.RestDocsTestExecutionListener, org.springframework.boot.test.autoconfigure.web.client.MockRestServiceServerResetTestExecutionListener, org.springframework.boot.test.autoconfigure.web.servlet.MockMvcPrintOnlyOnFailureTestExecutionListener, org.springframework.boot.test.autoconfigure.web.servlet.WebDriverTestExecutionListener, org.springframework.test.context.web.ServletTestExecutionListener, org.springframework.test.context.support.DirtiesContextBeforeModesTestExecutionListener, org.springframework.test.context.support.DependencyInjectionTestExecutionListener, org.springframework.test.context.support.DirtiesContextTestExecutionListener, org.springframework.test.context.transaction.TransactionalTestExecutionListener, org.springframework.test.context.jdbc.SqlScriptsTestExecutionListener]
06-Nov-2018 22:04:09 2018-11-06 22:04:09.457  INFO   --- [           main] .b.t.c.SpringBootTestContextBootstrapper : Using TestExecutionListeners: [org.springframework.test.context.web.ServletTestExecutionListener@63355449, org.springframework.test.context.support.DirtiesContextBeforeModesTestExecutionListener@9353778, org.springframework.boot.test.autoconfigure.SpringBootDependencyInjectionTestExecutionListener@6a28ffa4, org.springframework.test.context.support.DirtiesContextTestExecutionListener@48ae9b55, org.springframework.test.context.transaction.TransactionalTestExecutionListener@1700915, org.springframework.test.context.jdbc.SqlScriptsTestExecutionListener@21de60b4, org.springframework.boot.test.autoconfigure.restdocs.RestDocsTestExecutionListener@c267ef4, org.springframework.boot.test.autoconfigure.web.servlet.MockMvcPrintOnlyOnFailureTestExecutionListener@30ee2816, org.springframework.boot.test.mock.mockito.ResetMocksTestExecutionListener@31d7b7bf, org.springframework.boot.test.autoconfigure.web.client.MockRestServiceServerResetTestExecutionListener@635eaaf1, org.springframework.boot.test.autoconfigure.web.servlet.WebDriverTestExecutionListener@5c30a9b0, org.springframework.boot.test.mock.mockito.MockitoTestExecutionListener@1ddf84b8]
06-Nov-2018 22:04:09 2018-11-06 22:04:09.465  INFO   --- [           main] .b.t.c.SpringBootTestContextBootstrapper : Neither @ContextConfiguration nor @ContextHierarchy found for test class [org.springframework.cloud.dataflow.acceptance.test.WoodChuckTests], using SpringBootContextLoader
06-Nov-2018 22:04:09 2018-11-06 22:04:09.489  INFO   --- [           main] .b.t.c.SpringBootTestContextBootstrapper : Loaded default TestExecutionListener class names from location [META-INF/spring.factories]: [org.springframework.boot.test.mock.mockito.MockitoTestExecutionListener, org.springframework.boot.test.mock.mockito.ResetMocksTestExecutionListener, org.springframework.boot.test.autoconfigure.restdocs.RestDocsTestExecutionListener, org.springframework.boot.test.autoconfigure.web.client.MockRestServiceServerResetTestExecutionListener, org.springframework.boot.test.autoconfigure.web.servlet.MockMvcPrintOnlyOnFailureTestExecutionListener, org.springframework.boot.test.autoconfigure.web.servlet.WebDriverTestExecutionListener, org.springframework.test.context.web.ServletTestExecutionListener, org.springframework.test.context.support.DirtiesContextBeforeModesTestExecutionListener, org.springframework.test.context.support.DependencyInjectionTestExecutionListener, org.springframework.test.context.support.DirtiesContextTestExecutionListener, org.springframework.test.context.transaction.TransactionalTestExecutionListener, org.springframework.test.context.jdbc.SqlScriptsTestExecutionListener]
06-Nov-2018 22:04:09 2018-11-06 22:04:09.494  INFO   --- [           main] .b.t.c.SpringBootTestContextBootstrapper : Using TestExecutionListeners: [org.springframework.test.context.web.ServletTestExecutionListener@3febb011, org.springframework.test.context.support.DirtiesContextBeforeModesTestExecutionListener@10e31a9a, org.springframework.boot.test.autoconfigure.SpringBootDependencyInjectionTestExecutionListener@131774fe, org.springframework.test.context.support.DirtiesContextTestExecutionListener@158d2680, org.springframework.test.context.transaction.TransactionalTestExecutionListener@77847718, org.springframework.test.context.jdbc.SqlScriptsTestExecutionListener@7f3b84b8, org.springframework.boot.test.autoconfigure.restdocs.RestDocsTestExecutionListener@57a3af25, org.springframework.boot.test.autoconfigure.web.servlet.MockMvcPrintOnlyOnFailureTestExecutionListener@2b662a77, org.springframework.boot.test.mock.mockito.ResetMocksTestExecutionListener@7f0eb4b4, org.springframework.boot.test.autoconfigure.web.client.MockRestServiceServerResetTestExecutionListener@5c33f1a9, org.springframework.boot.test.autoconfigure.web.servlet.WebDriverTestExecutionListener@1623b78d, org.springframework.boot.test.mock.mockito.MockitoTestExecutionListener@c8c12ac]
06-Nov-2018 22:04:09 2018-11-06 22:04:09.496  INFO   --- [           main] .b.t.c.SpringBootTestContextBootstrapper : Neither @ContextConfiguration nor @ContextHierarchy found for test class [org.springframework.cloud.dataflow.acceptance.test.HttpSourceTests], using SpringBootContextLoader
06-Nov-2018 22:04:09 2018-11-06 22:04:09.512  INFO   --- [           main] .b.t.c.SpringBootTestContextBootstrapper : Loaded default TestExecutionListener class names from location [META-INF/spring.factories]: [org.springframework.boot.test.mock.mockito.MockitoTestExecutionListener, org.springframework.boot.test.mock.mockito.ResetMocksTestExecutionListener, org.springframework.boot.test.autoconfigure.restdocs.RestDocsTestExecutionListener, org.springframework.boot.test.autoconfigure.web.client.MockRestServiceServerResetTestExecutionListener, org.springframework.boot.test.autoconfigure.web.servlet.MockMvcPrintOnlyOnFailureTestExecutionListener, org.springframework.boot.test.autoconfigure.web.servlet.WebDriverTestExecutionListener, org.springframework.test.context.web.ServletTestExecutionListener, org.springframework.test.context.support.DirtiesContextBeforeModesTestExecutionListener, org.springframework.test.context.support.DependencyInjectionTestExecutionListener, org.springframework.test.context.support.DirtiesContextTestExecutionListener, org.springframework.test.context.transaction.TransactionalTestExecutionListener, org.springframework.test.context.jdbc.SqlScriptsTestExecutionListener]
06-Nov-2018 22:04:09 2018-11-06 22:04:09.518  INFO   --- [           main] .b.t.c.SpringBootTestContextBootstrapper : Using TestExecutionListeners: [org.springframework.test.context.web.ServletTestExecutionListener@233795b6, org.springframework.test.context.support.DirtiesContextBeforeModesTestExecutionListener@3eb738bb, org.springframework.boot.test.autoconfigure.SpringBootDependencyInjectionTestExecutionListener@5bda8e08, org.springframework.test.context.support.DirtiesContextTestExecutionListener@1e800aaa, org.springframework.test.context.transaction.TransactionalTestExecutionListener@185a6e9, org.springframework.test.context.jdbc.SqlScriptsTestExecutionListener@6f03482, org.springframework.boot.test.autoconfigure.restdocs.RestDocsTestExecutionListener@9d5509a, org.springframework.boot.test.autoconfigure.web.servlet.MockMvcPrintOnlyOnFailureTestExecutionListener@179ece50, org.springframework.boot.test.mock.mockito.ResetMocksTestExecutionListener@3b0090a4, org.springframework.boot.test.autoconfigure.web.client.MockRestServiceServerResetTestExecutionListener@3cd3e762, org.springframework.boot.test.autoconfigure.web.servlet.WebDriverTestExecutionListener@1fa121e2, org.springframework.boot.test.mock.mockito.MockitoTestExecutionListener@7eac9008]
06-Nov-2018 22:04:09 2018-11-06 22:04:09.543  INFO   --- [           main] .b.t.c.SpringBootTestContextBootstrapper : Neither @ContextConfiguration nor @ContextHierarchy found for test class [org.springframework.cloud.dataflow.acceptance.test.TickTockTests], using SpringBootContextLoader
06-Nov-2018 22:04:09 2018-11-06 22:04:09.558  INFO   --- [           main] .b.t.c.SpringBootTestContextBootstrapper : Loaded default TestExecutionListener class names from location [META-INF/spring.factories]: [org.springframework.boot.test.mock.mockito.MockitoTestExecutionListener, org.springframework.boot.test.mock.mockito.ResetMocksTestExecutionListener, org.springframework.boot.test.autoconfigure.restdocs.RestDocsTestExecutionListener, org.springframework.boot.test.autoconfigure.web.client.MockRestServiceServerResetTestExecutionListener, org.springframework.boot.test.autoconfigure.web.servlet.MockMvcPrintOnlyOnFailureTestExecutionListener, org.springframework.boot.test.autoconfigure.web.servlet.WebDriverTestExecutionListener, org.springframework.test.context.web.ServletTestExecutionListener, org.springframework.test.context.support.DirtiesContextBeforeModesTestExecutionListener, org.springframework.test.context.support.DependencyInjectionTestExecutionListener, org.springframework.test.context.support.DirtiesContextTestExecutionListener, org.springframework.test.context.transaction.TransactionalTestExecutionListener, org.springframework.test.context.jdbc.SqlScriptsTestExecutionListener]
06-Nov-2018 22:04:09 2018-11-06 22:04:09.563  INFO   --- [           main] .b.t.c.SpringBootTestContextBootstrapper : Using TestExecutionListeners: [org.springframework.test.context.web.ServletTestExecutionListener@79da8dc5, org.springframework.test.context.support.DirtiesContextBeforeModesTestExecutionListener@1eb5174b, org.springframework.boot.test.autoconfigure.SpringBootDependencyInjectionTestExecutionListener@67080771, org.springframework.test.context.support.DirtiesContextTestExecutionListener@72cde7cc, org.springframework.test.context.transaction.TransactionalTestExecutionListener@5fd4f8f5, org.springframework.test.context.jdbc.SqlScriptsTestExecutionListener@696da30b, org.springframework.boot.test.autoconfigure.restdocs.RestDocsTestExecutionListener@4e7912d8, org.springframework.boot.test.autoconfigure.web.servlet.MockMvcPrintOnlyOnFailureTestExecutionListener@53976f5c, org.springframework.boot.test.mock.mockito.ResetMocksTestExecutionListener@2bfc268b, org.springframework.boot.test.autoconfigure.web.client.MockRestServiceServerResetTestExecutionListener@2f8dad04, org.springframework.boot.test.autoconfigure.web.servlet.WebDriverTestExecutionListener@29e495ff, org.springframework.boot.test.mock.mockito.MockitoTestExecutionListener@41e1e210]
06-Nov-2018 22:04:09 2018-11-06 22:04:09.565  INFO   --- [           main] .b.t.c.SpringBootTestContextBootstrapper : Neither @ContextConfiguration nor @ContextHierarchy found for test class [org.springframework.cloud.dataflow.acceptance.test.TransformTests], using SpringBootContextLoader
06-Nov-2018 22:04:09 2018-11-06 22:04:09.579  INFO   --- [           main] .b.t.c.SpringBootTestContextBootstrapper : Loaded default TestExecutionListener class names from location [META-INF/spring.factories]: [org.springframework.boot.test.mock.mockito.MockitoTestExecutionListener, org.springframework.boot.test.mock.mockito.ResetMocksTestExecutionListener, org.springframework.boot.test.autoconfigure.restdocs.RestDocsTestExecutionListener, org.springframework.boot.test.autoconfigure.web.client.MockRestServiceServerResetTestExecutionListener, org.springframework.boot.test.autoconfigure.web.servlet.MockMvcPrintOnlyOnFailureTestExecutionListener, org.springframework.boot.test.autoconfigure.web.servlet.WebDriverTestExecutionListener, org.springframework.test.context.web.ServletTestExecutionListener, org.springframework.test.context.support.DirtiesContextBeforeModesTestExecutionListener, org.springframework.test.context.support.DependencyInjectionTestExecutionListener, org.springframework.test.context.support.DirtiesContextTestExecutionListener, org.springframework.test.context.transaction.TransactionalTestExecutionListener, org.springframework.test.context.jdbc.SqlScriptsTestExecutionListener]
06-Nov-2018 22:04:09 2018-11-06 22:04:09.583  INFO   --- [           main] .b.t.c.SpringBootTestContextBootstrapper : Using TestExecutionListeners: [org.springframework.test.context.web.ServletTestExecutionListener@74751b3, org.springframework.test.context.support.DirtiesContextBeforeModesTestExecutionListener@741a8937, org.springframework.boot.test.autoconfigure.SpringBootDependencyInjectionTestExecutionListener@306e95ec, org.springframework.test.context.support.DirtiesContextTestExecutionListener@52af26ee, org.springframework.test.context.transaction.TransactionalTestExecutionListener@6fd83fc1, org.springframework.test.context.jdbc.SqlScriptsTestExecutionListener@4f2b503c, org.springframework.boot.test.autoconfigure.restdocs.RestDocsTestExecutionListener@bae7dc0, org.springframework.boot.test.autoconfigure.web.servlet.MockMvcPrintOnlyOnFailureTestExecutionListener@209da20d, org.springframework.boot.test.mock.mockito.ResetMocksTestExecutionListener@e15b7e8, org.springframework.boot.test.autoconfigure.web.client.MockRestServiceServerResetTestExecutionListener@1b2abca6, org.springframework.boot.test.autoconfigure.web.servlet.WebDriverTestExecutionListener@6392827e, org.springframework.boot.test.mock.mockito.MockitoTestExecutionListener@2ed2d9cb]
06-Nov-2018 22:04:09 2018-11-06 22:04:09.601  INFO   --- [           main] .b.t.c.SpringBootTestContextBootstrapper : Neither @ContextConfiguration nor @ContextHierarchy found for test class [org.springframework.cloud.dataflow.acceptance.test.NamedChannelTests], using SpringBootContextLoader
06-Nov-2018 22:04:09 2018-11-06 22:04:09.615  INFO   --- [           main] .b.t.c.SpringBootTestContextBootstrapper : Loaded default TestExecutionListener class names from location [META-INF/spring.factories]: [org.springframework.boot.test.mock.mockito.MockitoTestExecutionListener, org.springframework.boot.test.mock.mockito.ResetMocksTestExecutionListener, org.springframework.boot.test.autoconfigure.restdocs.RestDocsTestExecutionListener, org.springframework.boot.test.autoconfigure.web.client.MockRestServiceServerResetTestExecutionListener, org.springframework.boot.test.autoconfigure.web.servlet.MockMvcPrintOnlyOnFailureTestExecutionListener, org.springframework.boot.test.autoconfigure.web.servlet.WebDriverTestExecutionListener, org.springframework.test.context.web.ServletTestExecutionListener, org.springframework.test.context.support.DirtiesContextBeforeModesTestExecutionListener, org.springframework.test.context.support.DependencyInjectionTestExecutionListener, org.springframework.test.context.support.DirtiesContextTestExecutionListener, org.springframework.test.context.transaction.TransactionalTestExecutionListener, org.springframework.test.context.jdbc.SqlScriptsTestExecutionListener]
06-Nov-2018 22:04:09 2018-11-06 22:04:09.619  INFO   --- [           main] .b.t.c.SpringBootTestContextBootstrapper : Using TestExecutionListeners: [org.springframework.test.context.web.ServletTestExecutionListener@5890e879, org.springframework.test.context.support.DirtiesContextBeforeModesTestExecutionListener@6440112d, org.springframework.boot.test.autoconfigure.SpringBootDependencyInjectionTestExecutionListener@31ea9581, org.springframework.test.context.support.DirtiesContextTestExecutionListener@231f98ef, org.springframework.test.context.transaction.TransactionalTestExecutionListener@7c137fd5, org.springframework.test.context.jdbc.SqlScriptsTestExecutionListener@183ec003, org.springframework.boot.test.autoconfigure.restdocs.RestDocsTestExecutionListener@7d9d0818, org.springframework.boot.test.autoconfigure.web.servlet.MockMvcPrintOnlyOnFailureTestExecutionListener@221a3fa4, org.springframework.boot.test.mock.mockito.ResetMocksTestExecutionListener@451001e5, org.springframework.boot.test.autoconfigure.web.client.MockRestServiceServerResetTestExecutionListener@2b40ff9c, org.springframework.boot.test.autoconfigure.web.servlet.WebDriverTestExecutionListener@3e08ff24, org.springframework.boot.test.mock.mockito.MockitoTestExecutionListener@4d1c005e]
06-Nov-2018 22:04:09 Running org.springframework.cloud.dataflow.acceptance.test.AnalyticsTests
06-Nov-2018 22:04:09 2018-11-06 22:04:09.673  INFO   --- [           main] .b.t.c.SpringBootTestContextBootstrapper : Neither @ContextConfiguration nor @ContextHierarchy found for test class [org.springframework.cloud.dataflow.acceptance.test.AnalyticsTests], using SpringBootContextLoader
06-Nov-2018 22:04:09 2018-11-06 22:04:09.685  INFO   --- [           main] .b.t.c.SpringBootTestContextBootstrapper : Loaded default TestExecutionListener class names from location [META-INF/spring.factories]: [org.springframework.boot.test.mock.mockito.MockitoTestExecutionListener, org.springframework.boot.test.mock.mockito.ResetMocksTestExecutionListener, org.springframework.boot.test.autoconfigure.restdocs.RestDocsTestExecutionListener, org.springframework.boot.test.autoconfigure.web.client.MockRestServiceServerResetTestExecutionListener, org.springframework.boot.test.autoconfigure.web.servlet.MockMvcPrintOnlyOnFailureTestExecutionListener, org.springframework.boot.test.autoconfigure.web.servlet.WebDriverTestExecutionListener, org.springframework.test.context.web.ServletTestExecutionListener, org.springframework.test.context.support.DirtiesContextBeforeModesTestExecutionListener, org.springframework.test.context.support.DependencyInjectionTestExecutionListener, org.springframework.test.context.support.DirtiesContextTestExecutionListener, org.springframework.test.context.transaction.TransactionalTestExecutionListener, org.springframework.test.context.jdbc.SqlScriptsTestExecutionListener]
06-Nov-2018 22:04:09 2018-11-06 22:04:09.689  INFO   --- [           main] .b.t.c.SpringBootTestContextBootstrapper : Using TestExecutionListeners: [org.springframework.test.context.web.ServletTestExecutionListener@4e0ae11f, org.springframework.test.context.support.DirtiesContextBeforeModesTestExecutionListener@238d68ff, org.springframework.boot.test.autoconfigure.SpringBootDependencyInjectionTestExecutionListener@4b86805d, org.springframework.test.context.support.DirtiesContextTestExecutionListener@5852c06f, org.springframework.test.context.transaction.TransactionalTestExecutionListener@4149c063, org.springframework.test.context.jdbc.SqlScriptsTestExecutionListener@9cb8225, org.springframework.boot.test.autoconfigure.restdocs.RestDocsTestExecutionListener@76b07f29, org.springframework.boot.test.autoconfigure.web.servlet.MockMvcPrintOnlyOnFailureTestExecutionListener@38af9828, org.springframework.boot.test.mock.mockito.ResetMocksTestExecutionListener@376a0d86, org.springframework.boot.test.autoconfigure.web.client.MockRestServiceServerResetTestExecutionListener@62656be4, org.springframework.boot.test.autoconfigure.web.servlet.WebDriverTestExecutionListener@17d919b6, org.springframework.boot.test.mock.mockito.MockitoTestExecutionListener@53f3bdbd]
06-Nov-2018 22:04:10 2018-11-06 22:04:10.805  INFO 8261 --- [           main] s.c.a.AnnotationConfigApplicationContext : Refreshing org.springframework.context.annotation.AnnotationConfigApplicationContext@68ed96ca: startup date [Tue Nov 06 22:04:10 UTC 2018]; root of context hierarchy
06-Nov-2018 22:04:11 2018-11-06 22:04:11.228  INFO 8261 --- [           main] trationDelegate$BeanPostProcessorChecker : Bean 'configurationPropertiesRebinderAutoConfiguration' of type [class org.springframework.cloud.autoconfigure.ConfigurationPropertiesRebinderAutoConfiguration$$EnhancerBySpringCGLIB$$70cac85b] is not eligible for getting processed by all BeanPostProcessors (for example: not eligible for auto-proxying)
06-Nov-2018 22:04:11
06-Nov-2018 22:04:11   .   ____          _            __ _ _
06-Nov-2018 22:04:11 /\\ / ___'_ __ _ _(_)_ __  __ _ \ \ \ \
06-Nov-2018 22:04:11 ( ( )\___ | '_ | '_| | '_ \/ _` | \ \ \ \
06-Nov-2018 22:04:11 \\/  ___)| |_)| | | | | || (_| |  ) ) ) )
06-Nov-2018 22:04:11   '  |____| .__|_| |_|_| |_\__, | / / / /
06-Nov-2018 22:04:11 =========|_|==============|___/=/_/_/_/
06-Nov-2018 22:04:11 :: Spring Boot ::        (v1.4.1.RELEASE)
06-Nov-2018 22:04:11
06-Nov-2018 22:04:11 2018-11-06 22:04:11.762  INFO 8261 --- [           main] c.c.c.ConfigServicePropertySourceLocator : Fetching config from server at: http://localhost:8888
06-Nov-2018 22:04:11 2018-11-06 22:04:11.931  WARN 8261 --- [           main] c.c.c.ConfigServicePropertySourceLocator : Could not locate PropertySource: I/O error on GET request for "http://localhost:8888//blah": Connection refused (Connection refused); nested exception is java.net.ConnectException: Connection refused (Connection refused)
06-Nov-2018 22:04:11 2018-11-06 22:04:11.947  INFO 8261 --- [           main] o.s.c.d.acceptance.test.AnalyticsTests   : The following profiles are active: blah
06-Nov-2018 22:04:12 2018-11-06 22:04:12.377  INFO 8261 --- [           main] o.s.c.d.acceptance.test.AnalyticsTests   : Started AnalyticsTests in 2.565 seconds (JVM running for 4.006)
06-Nov-2018 22:04:12 2018-11-06 22:04:12.776  INFO 8261 --- [           main] junit.logTestName                        : Starting Test analyticsTest(org.springframework.cloud.dataflow.acceptance.test.AnalyticsTests)
06-Nov-2018 22:04:12 2018-11-06 22:04:12.810  INFO 8261 --- [           main] o.s.c.d.acceptance.test.AnalyticsTests   : Importing stream apps from uri resource: http://repo.spring.io/libs-release/org/springframework/cloud/stream/app/spring-cloud-stream-app-descriptor/Celsius.SR3/spring-cloud-stream-app-descriptor-Celsius.SR3.stream-apps-kafka-10-maven
06-Nov-2018 22:04:14 2018-11-06 22:04:14.882  INFO 8261 --- [           main] o.s.c.d.acceptance.test.AnalyticsTests   : Creating stream 'httpCounter'
06-Nov-2018 22:04:15 2018-11-06 22:04:15.105  INFO 8261 --- [           main] o.s.c.d.acceptance.test.AnalyticsTests   : Deploying stream 'httpCounter' with properties: {app.*.logging.file=${PID}-test.log, app.*.endpoints.logfile.sensitive=false, app.*.management.endpoints.web.exposure.include=*}
06-Nov-2018 22:04:17 2018-11-06 22:04:17.047  INFO 8261 --- [           main] o.s.c.d.acceptance.test.AnalyticsTests   : Checking: Stream=httpCounter, status = deploying, status description = The stream is being deployed.
06-Nov-2018 22:04:17 2018-11-06 22:04:17.048  INFO 8261 --- [           main] o.s.c.d.acceptance.test.AnalyticsTests   : Sleeping to check status of Stream=httpCounter
06-Nov-2018 22:04:27 2018-11-06 22:04:27.143  INFO 8261 --- [           main] o.s.c.d.acceptance.test.AnalyticsTests   : Checking: Stream=httpCounter, status = deploying, status description = The stream is being deployed.
06-Nov-2018 22:04:27 2018-11-06 22:04:27.143  INFO 8261 --- [           main] o.s.c.d.acceptance.test.AnalyticsTests   : Sleeping to check status of Stream=httpCounter
06-Nov-2018 22:04:37 2018-11-06 22:04:37.252  INFO 8261 --- [           main] o.s.c.d.acceptance.test.AnalyticsTests   : Checking: Stream=httpCounter, status = deploying, status description = The stream is being deployed.
06-Nov-2018 22:04:37 2018-11-06 22:04:37.252  INFO 8261 --- [           main] o.s.c.d.acceptance.test.AnalyticsTests   : Sleeping to check status of Stream=httpCounter
06-Nov-2018 22:04:47 2018-11-06 22:04:47.355  INFO 8261 --- [           main] o.s.c.d.acceptance.test.AnalyticsTests   : Checking: Stream=httpCounter, status = deployed, status description = The stream has been successfully deployed
06-Nov-2018 22:04:47 2018-11-06 22:04:47.540  INFO 8261 --- [           main] o.s.c.d.acceptance.test.AnalyticsTests   : Sleeping to check status of Stream=httpCounter
06-Nov-2018 22:04:57 2018-11-06 22:04:57.541  INFO 8261 --- [           main] o.s.c.d.acceptance.test.AnalyticsTests   : Stream 'httpCounter' started with status: deployed
06-Nov-2018 22:04:57 2018-11-06 22:04:57.541  INFO 8261 --- [           main] o.s.c.d.acceptance.test.AnalyticsTests   : App 'http' has instances: {httpCounter.http-v1-0=http://10.194.6.14:40922}
06-Nov-2018 22:04:57 2018-11-06 22:04:57.541  INFO 8261 --- [           main] o.s.c.d.acceptance.test.AnalyticsTests   : App 'counter' has instances: {httpCounter.counter-v1-0=http://10.194.6.14:42455}
06-Nov-2018 22:04:57 2018-11-06 22:04:57.542  INFO 8261 --- [           main] o.s.c.d.acceptance.test.AnalyticsTests   : Looking for 'Started HttpSource' in logfile for http
06-Nov-2018 22:05:07 2018-11-06 22:05:07.542  INFO 8261 --- [           main] o.s.c.d.acceptance.test.AnalyticsTests   : Requesting log for app httpCounter.http-v1-0
06-Nov-2018 22:05:07 2018-11-06 22:05:07.832  INFO 8261 --- [           main] o.s.c.d.acceptance.test.AnalyticsTests   : Retrieved logfile from 'http://10.194.6.14:40922/logfile
06-Nov-2018 22:05:07 2018-11-06 22:05:07.839  INFO 8261 --- [           main] o.s.c.d.acceptance.test.AnalyticsTests   : Matched all 'Started HttpSource' in logfile for instance httpCounter.http-v1-0 of app http
06-Nov-2018 22:05:07 2018-11-06 22:05:07.839  INFO 8261 --- [           main] o.s.c.d.acceptance.test.AnalyticsTests   : Looking for 'Started CounterSink' in logfile for counter
06-Nov-2018 22:05:17 2018-11-06 22:05:17.840  INFO 8261 --- [           main] o.s.c.d.acceptance.test.AnalyticsTests   : Requesting log for app httpCounter.counter-v1-0
06-Nov-2018 22:05:18 2018-11-06 22:05:18.113  INFO 8261 --- [           main] o.s.c.d.acceptance.test.AnalyticsTests   : Retrieved logfile from 'http://10.194.6.14:42455/logfile
06-Nov-2018 22:05:18 2018-11-06 22:05:18.113  INFO 8261 --- [           main] o.s.c.d.acceptance.test.AnalyticsTests   : Matched all 'Started CounterSink' in logfile for instance httpCounter.counter-v1-0 of app counter
06-Nov-2018 22:05:28 2018-11-06 22:05:28.705  INFO 8261 --- [           main] junit.logTestName                        : Test analyticsTest(org.springframework.cloud.dataflow.acceptance.test.AnalyticsTests) Succeeded
06-Nov-2018 22:05:28 2018-11-06 22:05:28.706  INFO 8261 --- [           main] junit.logTestName                        : Finished Test analyticsTest(org.springframework.cloud.dataflow.acceptance.test.AnalyticsTests)
06-Nov-2018 22:05:28 2018-11-06 22:05:28.707  INFO 8261 --- [           main] o.s.c.d.acceptance.test.AnalyticsTests   : Destroy all streams
06-Nov-2018 22:05:29 Tests run: 1, Failures: 0, Errors: 0, Skipped: 0, Time elapsed: 79.394 sec - in org.springframework.cloud.dataflow.acceptance.test.AnalyticsTests
06-Nov-2018 22:05:29 Running org.springframework.cloud.dataflow.acceptance.test.WoodChuckTests
06-Nov-2018 22:05:29 2018-11-06 22:05:29.062  INFO 8261 --- [           main] .b.t.c.SpringBootTestContextBootstrapper : Neither @ContextConfiguration nor @ContextHierarchy found for test class [org.springframework.cloud.dataflow.acceptance.test.WoodChuckTests], using SpringBootContextLoader
06-Nov-2018 22:05:29 2018-11-06 22:05:29.089  INFO 8261 --- [           main] .b.t.c.SpringBootTestContextBootstrapper : Loaded default TestExecutionListener class names from location [META-INF/spring.factories]: [org.springframework.boot.test.mock.mockito.MockitoTestExecutionListener, org.springframework.boot.test.mock.mockito.ResetMocksTestExecutionListener, org.springframework.boot.test.autoconfigure.restdocs.RestDocsTestExecutionListener, org.springframework.boot.test.autoconfigure.web.client.MockRestServiceServerResetTestExecutionListener, org.springframework.boot.test.autoconfigure.web.servlet.MockMvcPrintOnlyOnFailureTestExecutionListener, org.springframework.boot.test.autoconfigure.web.servlet.WebDriverTestExecutionListener, org.springframework.test.context.web.ServletTestExecutionListener, org.springframework.test.context.support.DirtiesContextBeforeModesTestExecutionListener, org.springframework.test.context.support.DependencyInjectionTestExecutionListener, org.springframework.test.context.support.DirtiesContextTestExecutionListener, org.springframework.test.context.transaction.TransactionalTestExecutionListener, org.springframework.test.context.jdbc.SqlScriptsTestExecutionListener]
06-Nov-2018 22:05:29 2018-11-06 22:05:29.097  INFO 8261 --- [           main] .b.t.c.SpringBootTestContextBootstrapper : Using TestExecutionListeners: [org.springframework.test.context.web.ServletTestExecutionListener@4ce94d2f, org.springframework.test.context.support.DirtiesContextBeforeModesTestExecutionListener@68ab0936, org.springframework.boot.test.autoconfigure.SpringBootDependencyInjectionTestExecutionListener@3cd9aa64, org.springframework.test.context.support.DirtiesContextTestExecutionListener@42b84286, org.springframework.test.context.transaction.TransactionalTestExecutionListener@443effcb, org.springframework.test.context.jdbc.SqlScriptsTestExecutionListener@74ecacc3, org.springframework.boot.test.autoconfigure.restdocs.RestDocsTestExecutionListener@517a2b0, org.springframework.boot.test.autoconfigure.web.servlet.MockMvcPrintOnlyOnFailureTestExecutionListener@53b7ce6, org.springframework.boot.test.mock.mockito.ResetMocksTestExecutionListener@36480b2d, org.springframework.boot.test.autoconfigure.web.client.MockRestServiceServerResetTestExecutionListener@27d33393, org.springframework.boot.test.autoconfigure.web.servlet.WebDriverTestExecutionListener@1f6917fb, org.springframework.boot.test.mock.mockito.MockitoTestExecutionListener@41eb94bc]
06-Nov-2018 22:05:29 2018-11-06 22:05:29.257  INFO 8261 --- [           main] junit.logTestName                        : Starting Test testPartitioning(org.springframework.cloud.dataflow.acceptance.test.WoodChuckTests)
06-Nov-2018 22:05:29 2018-11-06 22:05:29.259  INFO 8261 --- [           main] o.s.c.d.acceptance.test.WoodChuckTests   : Creating stream 'WOODCHUCK-TEST'
06-Nov-2018 22:05:29 2018-11-06 22:05:29.304  INFO 8261 --- [           main] o.s.c.d.acceptance.test.WoodChuckTests   : Deploying stream 'WOODCHUCK-TEST' with properties: {app.log.logging.pattern.level=WOODCHUCK-${INSTANCE_INDEX:${CF_INSTANCE_INDEX:${spring.cloud.stream.instanceIndex:0}}} %5p, app.*.logging.file=${PID}-test.log, app.splitter.producer.partitionKeyExpression=payload, app.*.endpoints.logfile.sensitive=false, app.log.spring.cloud.stream.kafka.bindings.input.consumer.autoRebalanceEnabled=false, app.*.management.endpoints.web.exposure.include=*, deployer.log.count=2}
06-Nov-2018 22:05:35 2018-11-06 22:05:35.105  INFO 8261 --- [           main] o.s.c.d.acceptance.test.WoodChuckTests   : Checking: Stream=WOODCHUCK-TEST, status = deploying, status description = The stream is being deployed.
06-Nov-2018 22:05:35 2018-11-06 22:05:35.105  INFO 8261 --- [           main] o.s.c.d.acceptance.test.WoodChuckTests   : Sleeping to check status of Stream=WOODCHUCK-TEST
06-Nov-2018 22:05:45 2018-11-06 22:05:45.253  INFO 8261 --- [           main] o.s.c.d.acceptance.test.WoodChuckTests   : Checking: Stream=WOODCHUCK-TEST, status = deploying, status description = The stream is being deployed.
06-Nov-2018 22:05:45 2018-11-06 22:05:45.254  INFO 8261 --- [           main] o.s.c.d.acceptance.test.WoodChuckTests   : Sleeping to check status of Stream=WOODCHUCK-TEST
06-Nov-2018 22:05:55 2018-11-06 22:05:55.393  INFO 8261 --- [           main] o.s.c.d.acceptance.test.WoodChuckTests   : Checking: Stream=WOODCHUCK-TEST, status = deploying, status description = The stream is being deployed.
06-Nov-2018 22:05:55 2018-11-06 22:05:55.394  INFO 8261 --- [           main] o.s.c.d.acceptance.test.WoodChuckTests   : Sleeping to check status of Stream=WOODCHUCK-TEST
06-Nov-2018 22:06:05 2018-11-06 22:06:05.542  INFO 8261 --- [           main] o.s.c.d.acceptance.test.WoodChuckTests   : Checking: Stream=WOODCHUCK-TEST, status = deploying, status description = The stream is being deployed.
06-Nov-2018 22:06:05 2018-11-06 22:06:05.543  INFO 8261 --- [           main] o.s.c.d.acceptance.test.WoodChuckTests   : Sleeping to check status of Stream=WOODCHUCK-TEST
06-Nov-2018 22:06:15 2018-11-06 22:06:15.695  INFO 8261 --- [           main] o.s.c.d.acceptance.test.WoodChuckTests   : Checking: Stream=WOODCHUCK-TEST, status = deploying, status description = The stream is being deployed.
06-Nov-2018 22:06:15 2018-11-06 22:06:15.695  INFO 8261 --- [           main] o.s.c.d.acceptance.test.WoodChuckTests   : Sleeping to check status of Stream=WOODCHUCK-TEST
06-Nov-2018 22:06:25 2018-11-06 22:06:25.849  INFO 8261 --- [           main] o.s.c.d.acceptance.test.WoodChuckTests   : Checking: Stream=WOODCHUCK-TEST, status = deployed, status description = The stream has been successfully deployed
06-Nov-2018 22:06:25 2018-11-06 22:06:25.969  INFO 8261 --- [           main] o.s.c.d.acceptance.test.WoodChuckTests   : Sleeping to check status of Stream=WOODCHUCK-TEST
06-Nov-2018 22:06:35 2018-11-06 22:06:35.970  INFO 8261 --- [           main] o.s.c.d.acceptance.test.WoodChuckTests   : Stream 'WOODCHUCK-TEST' started with status: deployed
06-Nov-2018 22:06:35 2018-11-06 22:06:35.971  INFO 8261 --- [           main] o.s.c.d.acceptance.test.WoodChuckTests   : App 'log' has instances: {WOODCHUCK-TEST.log-v1-0=http://10.194.6.14:10745, WOODCHUCK-TEST.log-v1-1=http://10.194.6.14:24147}
06-Nov-2018 22:06:35 2018-11-06 22:06:35.972  INFO 8261 --- [           main] o.s.c.d.acceptance.test.WoodChuckTests   : App 'http' has instances: {WOODCHUCK-TEST.http-v1-0=http://10.194.6.14:35430}
06-Nov-2018 22:06:35 2018-11-06 22:06:35.972  INFO 8261 --- [           main] o.s.c.d.acceptance.test.WoodChuckTests   : App 'splitter' has instances: {WOODCHUCK-TEST.splitter-v1-0=http://10.194.6.14:27323}
06-Nov-2018 22:06:35 2018-11-06 22:06:35.972  INFO 8261 --- [           main] o.s.c.d.acceptance.test.WoodChuckTests   : Looking for 'Started HttpSource' in logfile for http
06-Nov-2018 22:06:45 2018-11-06 22:06:45.972  INFO 8261 --- [           main] o.s.c.d.acceptance.test.WoodChuckTests   : Requesting log for app WOODCHUCK-TEST.http-v1-0
06-Nov-2018 22:06:46 2018-11-06 22:06:46.292  INFO 8261 --- [           main] o.s.c.d.acceptance.test.WoodChuckTests   : Retrieved logfile from 'http://10.194.6.14:35430/logfile
06-Nov-2018 22:06:46 2018-11-06 22:06:46.293  INFO 8261 --- [           main] o.s.c.d.acceptance.test.WoodChuckTests   : Matched all 'Started HttpSource' in logfile for instance WOODCHUCK-TEST.http-v1-0 of app http
06-Nov-2018 22:06:46 2018-11-06 22:06:46.294  INFO 8261 --- [           main] o.s.c.d.acceptance.test.WoodChuckTests   : Looking for 'Started SplitterProcessor' in logfile for splitter
06-Nov-2018 22:06:56 2018-11-06 22:06:56.294  INFO 8261 --- [           main] o.s.c.d.acceptance.test.WoodChuckTests   : Requesting log for app WOODCHUCK-TEST.splitter-v1-0
06-Nov-2018 22:06:56 2018-11-06 22:06:56.658  INFO 8261 --- [           main] o.s.c.d.acceptance.test.WoodChuckTests   : Retrieved logfile from 'http://10.194.6.14:27323/logfile
06-Nov-2018 22:06:56 2018-11-06 22:06:56.658  INFO 8261 --- [           main] o.s.c.d.acceptance.test.WoodChuckTests   : Matched all 'Started SplitterProcessor' in logfile for instance WOODCHUCK-TEST.splitter-v1-0 of app splitter
06-Nov-2018 22:06:56 2018-11-06 22:06:56.658  INFO 8261 --- [           main] o.s.c.d.acceptance.test.WoodChuckTests   : Looking for 'Started LogSink' in logfile for log
06-Nov-2018 22:07:06 2018-11-06 22:07:06.658  INFO 8261 --- [           main] o.s.c.d.acceptance.test.WoodChuckTests   : Requesting log for app WOODCHUCK-TEST.log-v1-0
06-Nov-2018 22:07:06 2018-11-06 22:07:06.986  INFO 8261 --- [           main] o.s.c.d.acceptance.test.WoodChuckTests   : Retrieved logfile from 'http://10.194.6.14:10745/logfile
06-Nov-2018 22:07:06 2018-11-06 22:07:06.987  INFO 8261 --- [           main] o.s.c.d.acceptance.test.WoodChuckTests   : Matched all 'Started LogSink' in logfile for instance WOODCHUCK-TEST.log-v1-0 of app log
06-Nov-2018 22:07:07 2018-11-06 22:07:07.232  INFO 8261 --- [           main] o.s.c.d.acceptance.test.WoodChuckTests   : Looking for 'WOODCHUCK-0,How,chuck' in logfile for log
06-Nov-2018 22:07:17 2018-11-06 22:07:17.232  INFO 8261 --- [           main] o.s.c.d.acceptance.test.WoodChuckTests   : Requesting log for app WOODCHUCK-TEST.log-v1-0
06-Nov-2018 22:07:17 2018-11-06 22:07:17.266  INFO 8261 --- [           main] o.s.c.d.acceptance.test.WoodChuckTests   : Retrieved logfile from 'http://10.194.6.14:10745/logfile
06-Nov-2018 22:07:17 2018-11-06 22:07:17.266  INFO 8261 --- [           main] o.s.c.d.acceptance.test.WoodChuckTests   : Matched all 'WOODCHUCK-0,How,chuck' in logfile for instance WOODCHUCK-TEST.log-v1-0 of app log
06-Nov-2018 22:07:17 2018-11-06 22:07:17.266  INFO 8261 --- [           main] o.s.c.d.acceptance.test.WoodChuckTests   : Looking for 'WOODCHUCK-1,much,wood,would,if,a,woodchuck,could' in logfile for log
06-Nov-2018 22:07:27 2018-11-06 22:07:27.266  INFO 8261 --- [           main] o.s.c.d.acceptance.test.WoodChuckTests   : Requesting log for app WOODCHUCK-TEST.log-v1-0
06-Nov-2018 22:07:27 2018-11-06 22:07:27.285  INFO 8261 --- [           main] o.s.c.d.acceptance.test.WoodChuckTests   : Retrieved logfile from 'http://10.194.6.14:10745/logfile
06-Nov-2018 22:07:27 2018-11-06 22:07:27.285  INFO 8261 --- [           main] o.s.c.d.acceptance.test.WoodChuckTests   : Requesting log for app WOODCHUCK-TEST.log-v1-1
06-Nov-2018 22:07:27 2018-11-06 22:07:27.514  INFO 8261 --- [           main] o.s.c.d.acceptance.test.WoodChuckTests   : Retrieved logfile from 'http://10.194.6.14:24147/logfile
06-Nov-2018 22:07:27 2018-11-06 22:07:27.515  INFO 8261 --- [           main] o.s.c.d.acceptance.test.WoodChuckTests   : Matched all 'WOODCHUCK-1,much,wood,would,if,a,woodchuck,could' in logfile for instance WOODCHUCK-TEST.log-v1-1 of app log
06-Nov-2018 22:07:27 2018-11-06 22:07:27.516  INFO 8261 --- [           main] junit.logTestName                        : Test testPartitioning(org.springframework.cloud.dataflow.acceptance.test.WoodChuckTests) Succeeded
06-Nov-2018 22:07:27 2018-11-06 22:07:27.517  INFO 8261 --- [           main] junit.logTestName                        : Finished Test testPartitioning(org.springframework.cloud.dataflow.acceptance.test.WoodChuckTests)
06-Nov-2018 22:07:27 2018-11-06 22:07:27.517  INFO 8261 --- [           main] o.s.c.d.acceptance.test.WoodChuckTests   : Destroy all streams
06-Nov-2018 22:07:27 Tests run: 1, Failures: 0, Errors: 0, Skipped: 0, Time elapsed: 118.724 sec - in org.springframework.cloud.dataflow.acceptance.test.WoodChuckTests
06-Nov-2018 22:07:27 Running org.springframework.cloud.dataflow.acceptance.test.HttpSourceTests
06-Nov-2018 22:07:27 2018-11-06 22:07:27.814  INFO 8261 --- [           main] .b.t.c.SpringBootTestContextBootstrapper : Neither @ContextConfiguration nor @ContextHierarchy found for test class [org.springframework.cloud.dataflow.acceptance.test.HttpSourceTests], using SpringBootContextLoader
06-Nov-2018 22:07:27 2018-11-06 22:07:27.839  INFO 8261 --- [           main] .b.t.c.SpringBootTestContextBootstrapper : Loaded default TestExecutionListener class names from location [META-INF/spring.factories]: [org.springframework.boot.test.mock.mockito.MockitoTestExecutionListener, org.springframework.boot.test.mock.mockito.ResetMocksTestExecutionListener, org.springframework.boot.test.autoconfigure.restdocs.RestDocsTestExecutionListener, org.springframework.boot.test.autoconfigure.web.client.MockRestServiceServerResetTestExecutionListener, org.springframework.boot.test.autoconfigure.web.servlet.MockMvcPrintOnlyOnFailureTestExecutionListener, org.springframework.boot.test.autoconfigure.web.servlet.WebDriverTestExecutionListener, org.springframework.test.context.web.ServletTestExecutionListener, org.springframework.test.context.support.DirtiesContextBeforeModesTestExecutionListener, org.springframework.test.context.support.DependencyInjectionTestExecutionListener, org.springframework.test.context.support.DirtiesContextTestExecutionListener, org.springframework.test.context.transaction.TransactionalTestExecutionListener, org.springframework.test.context.jdbc.SqlScriptsTestExecutionListener]
06-Nov-2018 22:07:27 2018-11-06 22:07:27.850  INFO 8261 --- [           main] .b.t.c.SpringBootTestContextBootstrapper : Using TestExecutionListeners: [org.springframework.test.context.web.ServletTestExecutionListener@788ddc1f, org.springframework.test.context.support.DirtiesContextBeforeModesTestExecutionListener@2dc3271b, org.springframework.boot.test.autoconfigure.SpringBootDependencyInjectionTestExecutionListener@254f906e, org.springframework.test.context.support.DirtiesContextTestExecutionListener@3d0035d2, org.springframework.test.context.transaction.TransactionalTestExecutionListener@2bfb6b49, org.springframework.test.context.jdbc.SqlScriptsTestExecutionListener@1f346ad2, org.springframework.boot.test.autoconfigure.restdocs.RestDocsTestExecutionListener@46a145ba, org.springframework.boot.test.autoconfigure.web.servlet.MockMvcPrintOnlyOnFailureTestExecutionListener@7ab34619, org.springframework.boot.test.mock.mockito.ResetMocksTestExecutionListener@ae2db25, org.springframework.boot.test.autoconfigure.web.client.MockRestServiceServerResetTestExecutionListener@363c4251, org.springframework.boot.test.autoconfigure.web.servlet.WebDriverTestExecutionListener@7afc4db9, org.springframework.boot.test.mock.mockito.MockitoTestExecutionListener@1a1f5f71]
06-Nov-2018 22:07:28 2018-11-06 22:07:28.106  INFO 8261 --- [           main] junit.logTestName                        : Starting Test httpSourceTests(org.springframework.cloud.dataflow.acceptance.test.HttpSourceTests)
06-Nov-2018 22:07:28 2018-11-06 22:07:28.108  INFO 8261 --- [           main] o.s.c.d.acceptance.test.HttpSourceTests  : Creating stream 'HTTP-TEST'
06-Nov-2018 22:07:28 2018-11-06 22:07:28.151  INFO 8261 --- [           main] o.s.c.d.acceptance.test.HttpSourceTests  : Deploying stream 'HTTP-TEST' with properties: {app.*.logging.file=${PID}-test.log, app.*.endpoints.logfile.sensitive=false, app.*.management.endpoints.web.exposure.include=*}
06-Nov-2018 22:07:33 2018-11-06 22:07:33.777  INFO 8261 --- [           main] o.s.c.d.acceptance.test.HttpSourceTests  : Checking: Stream=HTTP-TEST, status = deploying, status description = The stream is being deployed.
06-Nov-2018 22:07:33 2018-11-06 22:07:33.777  INFO 8261 --- [           main] o.s.c.d.acceptance.test.HttpSourceTests  : Sleeping to check status of Stream=HTTP-TEST
06-Nov-2018 22:07:43 2018-11-06 22:07:43.844  INFO 8261 --- [           main] o.s.c.d.acceptance.test.HttpSourceTests  : Checking: Stream=HTTP-TEST, status = deploying, status description = The stream is being deployed.
06-Nov-2018 22:07:43 2018-11-06 22:07:43.845  INFO 8261 --- [           main] o.s.c.d.acceptance.test.HttpSourceTests  : Sleeping to check status of Stream=HTTP-TEST
06-Nov-2018 22:07:53 2018-11-06 22:07:53.972  INFO 8261 --- [           main] o.s.c.d.acceptance.test.HttpSourceTests  : Checking: Stream=HTTP-TEST, status = deploying, status description = The stream is being deployed.
06-Nov-2018 22:07:53 2018-11-06 22:07:53.973  INFO 8261 --- [           main] o.s.c.d.acceptance.test.HttpSourceTests  : Sleeping to check status of Stream=HTTP-TEST
06-Nov-2018 22:08:04 2018-11-06 22:08:04.054  INFO 8261 --- [           main] o.s.c.d.acceptance.test.HttpSourceTests  : Checking: Stream=HTTP-TEST, status = deployed, status description = The stream has been successfully deployed
06-Nov-2018 22:08:04 2018-11-06 22:08:04.149  INFO 8261 --- [           main] o.s.c.d.acceptance.test.HttpSourceTests  : Sleeping to check status of Stream=HTTP-TEST
06-Nov-2018 22:08:14 2018-11-06 22:08:14.150  INFO 8261 --- [           main] o.s.c.d.acceptance.test.HttpSourceTests  : Stream 'HTTP-TEST' started with status: deployed
06-Nov-2018 22:08:14 2018-11-06 22:08:14.150  INFO 8261 --- [           main] o.s.c.d.acceptance.test.HttpSourceTests  : App 'log' has instances: {HTTP-TEST.log-v1-0=http://10.194.6.14:54449}
06-Nov-2018 22:08:14 2018-11-06 22:08:14.150  INFO 8261 --- [           main] o.s.c.d.acceptance.test.HttpSourceTests  : App 'http' has instances: {HTTP-TEST.http-v1-0=http://10.194.6.14:22610}
06-Nov-2018 22:08:14 2018-11-06 22:08:14.159  INFO 8261 --- [           main] o.s.c.d.acceptance.test.HttpSourceTests  : Looking for 'Started HttpSource' in logfile for http
06-Nov-2018 22:08:24 2018-11-06 22:08:24.160  INFO 8261 --- [           main] o.s.c.d.acceptance.test.HttpSourceTests  : Requesting log for app HTTP-TEST.http-v1-0
06-Nov-2018 22:08:24 2018-11-06 22:08:24.391  INFO 8261 --- [           main] o.s.c.d.acceptance.test.HttpSourceTests  : Retrieved logfile from 'http://10.194.6.14:22610/logfile
06-Nov-2018 22:08:24 2018-11-06 22:08:24.392  INFO 8261 --- [           main] o.s.c.d.acceptance.test.HttpSourceTests  : Matched all 'Started HttpSource' in logfile for instance HTTP-TEST.http-v1-0 of app http
06-Nov-2018 22:08:24 2018-11-06 22:08:24.392  INFO 8261 --- [           main] o.s.c.d.acceptance.test.HttpSourceTests  : Looking for 'Started LogSink' in logfile for log
06-Nov-2018 22:08:34 2018-11-06 22:08:34.392  INFO 8261 --- [           main] o.s.c.d.acceptance.test.HttpSourceTests  : Requesting log for app HTTP-TEST.log-v1-0
06-Nov-2018 22:08:34 2018-11-06 22:08:34.639  INFO 8261 --- [           main] o.s.c.d.acceptance.test.HttpSourceTests  : Retrieved logfile from 'http://10.194.6.14:54449/logfile
06-Nov-2018 22:08:34 2018-11-06 22:08:34.639  INFO 8261 --- [           main] o.s.c.d.acceptance.test.HttpSourceTests  : Matched all 'Started LogSink' in logfile for instance HTTP-TEST.log-v1-0 of app log
06-Nov-2018 22:08:34 2018-11-06 22:08:34.799  INFO 8261 --- [           main] o.s.c.d.acceptance.test.HttpSourceTests  : Looking for 'cdc417c1-daed-4c9b-9fab-91f506f47214' in logfile for log
06-Nov-2018 22:08:44 2018-11-06 22:08:44.800  INFO 8261 --- [           main] o.s.c.d.acceptance.test.HttpSourceTests  : Requesting log for app HTTP-TEST.log-v1-0
06-Nov-2018 22:08:44 2018-11-06 22:08:44.822  INFO 8261 --- [           main] o.s.c.d.acceptance.test.HttpSourceTests  : Retrieved logfile from 'http://10.194.6.14:54449/logfile
06-Nov-2018 22:08:44 2018-11-06 22:08:44.823  INFO 8261 --- [           main] o.s.c.d.acceptance.test.HttpSourceTests  : Matched all 'cdc417c1-daed-4c9b-9fab-91f506f47214' in logfile for instance HTTP-TEST.log-v1-0 of app log
06-Nov-2018 22:08:44 2018-11-06 22:08:44.826  INFO 8261 --- [           main] junit.logTestName                        : Test httpSourceTests(org.springframework.cloud.dataflow.acceptance.test.HttpSourceTests) Succeeded
06-Nov-2018 22:08:44 2018-11-06 22:08:44.826  INFO 8261 --- [           main] junit.logTestName                        : Finished Test httpSourceTests(org.springframework.cloud.dataflow.acceptance.test.HttpSourceTests)
06-Nov-2018 22:08:44 2018-11-06 22:08:44.827  INFO 8261 --- [           main] o.s.c.d.acceptance.test.HttpSourceTests  : Destroy all streams
06-Nov-2018 22:08:45 Tests run: 1, Failures: 0, Errors: 0, Skipped: 0, Time elapsed: 77.214 sec - in org.springframework.cloud.dataflow.acceptance.test.HttpSourceTests
06-Nov-2018 22:08:45 Running org.springframework.cloud.dataflow.acceptance.test.TimestampTaskTests
06-Nov-2018 22:08:45 2018-11-06 22:08:45.053  INFO 8261 --- [           main] o.s.c.support.GenericApplicationContext  : Refreshing org.springframework.context.support.GenericApplicationContext@e4e1ef5: startup date [Tue Nov 06 22:08:45 UTC 2018]; root of context hierarchy
06-Nov-2018 22:08:45 2018-11-06 22:08:45.303  INFO 8261 --- [           main] junit.logTestName                        : Starting Test timeStampTests(org.springframework.cloud.dataflow.acceptance.test.TimestampTaskTests)
06-Nov-2018 22:08:45 2018-11-06 22:08:45.305  INFO 8261 --- [           main] o.s.c.d.a.test.AbstractTaskTests         : Importing task apps from uri resource: http://repo.spring.io/libs-release/org/springframework/cloud/task/app/spring-cloud-task-app-descriptor/Clark.RELEASE/spring-cloud-task-app-descriptor-Clark.RELEASE.task-apps-maven
06-Nov-2018 22:08:45 2018-11-06 22:08:45.558  INFO 8261 --- [           main] o.s.c.d.a.test.AbstractTaskTests         : Done importing task apps.
06-Nov-2018 22:08:56 2018-11-06 22:08:56.195  INFO 8261 --- [           main] junit.logTestName                        : Test timeStampTests(org.springframework.cloud.dataflow.acceptance.test.TimestampTaskTests) Succeeded
06-Nov-2018 22:08:56 2018-11-06 22:08:56.196  INFO 8261 --- [           main] junit.logTestName                        : Finished Test timeStampTests(org.springframework.cloud.dataflow.acceptance.test.TimestampTaskTests)
06-Nov-2018 22:08:56 2018-11-06 22:08:56.295  INFO 8261 --- [           main] junit.logTestName                        : Starting Test timeStampTestsMultipleLaunch(org.springframework.cloud.dataflow.acceptance.test.TimestampTaskTests)
06-Nov-2018 22:09:16 2018-11-06 22:09:16.558  INFO 8261 --- [           main] junit.logTestName                        : Test timeStampTestsMultipleLaunch(org.springframework.cloud.dataflow.acceptance.test.TimestampTaskTests) Succeeded
06-Nov-2018 22:09:16 2018-11-06 22:09:16.558  INFO 8261 --- [           main] junit.logTestName                        : Finished Test timeStampTestsMultipleLaunch(org.springframework.cloud.dataflow.acceptance.test.TimestampTaskTests)
06-Nov-2018 22:09:16 Tests run: 2, Failures: 0, Errors: 0, Skipped: 0, Time elapsed: 31.526 sec - in org.springframework.cloud.dataflow.acceptance.test.TimestampTaskTests
06-Nov-2018 22:09:16 Running org.springframework.cloud.dataflow.acceptance.test.TickTockTests
06-Nov-2018 22:09:16 2018-11-06 22:09:16.560  INFO 8261 --- [           main] .b.t.c.SpringBootTestContextBootstrapper : Neither @ContextConfiguration nor @ContextHierarchy found for test class [org.springframework.cloud.dataflow.acceptance.test.TickTockTests], using SpringBootContextLoader
06-Nov-2018 22:09:16 2018-11-06 22:09:16.573  INFO 8261 --- [           main] .b.t.c.SpringBootTestContextBootstrapper : Loaded default TestExecutionListener class names from location [META-INF/spring.factories]: [org.springframework.boot.test.mock.mockito.MockitoTestExecutionListener, org.springframework.boot.test.mock.mockito.ResetMocksTestExecutionListener, org.springframework.boot.test.autoconfigure.restdocs.RestDocsTestExecutionListener, org.springframework.boot.test.autoconfigure.web.client.MockRestServiceServerResetTestExecutionListener, org.springframework.boot.test.autoconfigure.web.servlet.MockMvcPrintOnlyOnFailureTestExecutionListener, org.springframework.boot.test.autoconfigure.web.servlet.WebDriverTestExecutionListener, org.springframework.test.context.web.ServletTestExecutionListener, org.springframework.test.context.support.DirtiesContextBeforeModesTestExecutionListener, org.springframework.test.context.support.DependencyInjectionTestExecutionListener, org.springframework.test.context.support.DirtiesContextTestExecutionListener, org.springframework.test.context.transaction.TransactionalTestExecutionListener, org.springframework.test.context.jdbc.SqlScriptsTestExecutionListener]
06-Nov-2018 22:09:16 2018-11-06 22:09:16.579  INFO 8261 --- [           main] .b.t.c.SpringBootTestContextBootstrapper : Using TestExecutionListeners: [org.springframework.test.context.web.ServletTestExecutionListener@41dc0598, org.springframework.test.context.support.DirtiesContextBeforeModesTestExecutionListener@196ae579, org.springframework.boot.test.autoconfigure.SpringBootDependencyInjectionTestExecutionListener@6a2c717f, org.springframework.test.context.support.DirtiesContextTestExecutionListener@41853299, org.springframework.test.context.transaction.TransactionalTestExecutionListener@60d40ff4, org.springframework.test.context.jdbc.SqlScriptsTestExecutionListener@2e5b7fba, org.springframework.boot.test.autoconfigure.restdocs.RestDocsTestExecutionListener@27755487, org.springframework.boot.test.autoconfigure.web.servlet.MockMvcPrintOnlyOnFailureTestExecutionListener@4f0cab0a, org.springframework.boot.test.mock.mockito.ResetMocksTestExecutionListener@fe7b6b0, org.springframework.boot.test.autoconfigure.web.client.MockRestServiceServerResetTestExecutionListener@7ab4ae59, org.springframework.boot.test.autoconfigure.web.servlet.WebDriverTestExecutionListener@77681ce4, org.springframework.boot.test.mock.mockito.MockitoTestExecutionListener@5d96bdf8]
06-Nov-2018 22:09:16 2018-11-06 22:09:16.696  INFO 8261 --- [           main] junit.logTestName                        : Starting Test tickTockTests(org.springframework.cloud.dataflow.acceptance.test.TickTockTests)
06-Nov-2018 22:09:16 2018-11-06 22:09:16.698  INFO 8261 --- [           main] o.s.c.d.acceptance.test.TickTockTests    : Creating stream 'TICKTOCK'
06-Nov-2018 22:09:16 2018-11-06 22:09:16.737  INFO 8261 --- [           main] o.s.c.d.acceptance.test.TickTockTests    : Deploying stream 'TICKTOCK' with properties: {app.*.logging.file=${PID}-test.log, app.*.endpoints.logfile.sensitive=false, app.log.log.expression='TICKTOCK - TIMESTAMP: '.concat(payload), app.*.management.endpoints.web.exposure.include=*}
06-Nov-2018 22:09:17 2018-11-06 22:09:17.272  INFO 8261 --- [           main] o.s.c.d.acceptance.test.TickTockTests    : Checking: Stream=TICKTOCK, status = deploying, status description = The stream is being deployed.
06-Nov-2018 22:09:17 2018-11-06 22:09:17.272  INFO 8261 --- [           main] o.s.c.d.acceptance.test.TickTockTests    : Sleeping to check status of Stream=TICKTOCK
06-Nov-2018 22:09:27 2018-11-06 22:09:27.382  INFO 8261 --- [           main] o.s.c.d.acceptance.test.TickTockTests    : Checking: Stream=TICKTOCK, status = deploying, status description = The stream is being deployed.
06-Nov-2018 22:09:27 2018-11-06 22:09:27.382  INFO 8261 --- [           main] o.s.c.d.acceptance.test.TickTockTests    : Sleeping to check status of Stream=TICKTOCK
06-Nov-2018 22:09:37 2018-11-06 22:09:37.468  INFO 8261 --- [           main] o.s.c.d.acceptance.test.TickTockTests    : Checking: Stream=TICKTOCK, status = deploying, status description = The stream is being deployed.
06-Nov-2018 22:09:37 2018-11-06 22:09:37.469  INFO 8261 --- [           main] o.s.c.d.acceptance.test.TickTockTests    : Sleeping to check status of Stream=TICKTOCK
06-Nov-2018 22:09:47 2018-11-06 22:09:47.549  INFO 8261 --- [           main] o.s.c.d.acceptance.test.TickTockTests    : Checking: Stream=TICKTOCK, status = deployed, status description = The stream has been successfully deployed
06-Nov-2018 22:09:47 2018-11-06 22:09:47.606  INFO 8261 --- [           main] o.s.c.d.acceptance.test.TickTockTests    : Sleeping to check status of Stream=TICKTOCK
06-Nov-2018 22:09:57 2018-11-06 22:09:57.607  INFO 8261 --- [           main] o.s.c.d.acceptance.test.TickTockTests    : Stream 'TICKTOCK' started with status: deployed
06-Nov-2018 22:09:57 2018-11-06 22:09:57.607  INFO 8261 --- [           main] o.s.c.d.acceptance.test.TickTockTests    : App 'log' has instances: {TICKTOCK.log-v1-0=http://10.194.6.14:41045}
06-Nov-2018 22:09:57 2018-11-06 22:09:57.607  INFO 8261 --- [           main] o.s.c.d.acceptance.test.TickTockTests    : App 'time' has instances: {TICKTOCK.time-v1-0=http://10.194.6.14:61036}
06-Nov-2018 22:09:57 2018-11-06 22:09:57.608  INFO 8261 --- [           main] o.s.c.d.acceptance.test.TickTockTests    : Looking for 'Started TimeSource' in logfile for time
06-Nov-2018 22:10:07 2018-11-06 22:10:07.608  INFO 8261 --- [           main] o.s.c.d.acceptance.test.TickTockTests    : Requesting log for app TICKTOCK.time-v1-0
06-Nov-2018 22:10:07 2018-11-06 22:10:07.864  INFO 8261 --- [           main] o.s.c.d.acceptance.test.TickTockTests    : Retrieved logfile from 'http://10.194.6.14:61036/logfile
06-Nov-2018 22:10:07 2018-11-06 22:10:07.864  INFO 8261 --- [           main] o.s.c.d.acceptance.test.TickTockTests    : Matched all 'Started TimeSource' in logfile for instance TICKTOCK.time-v1-0 of app time
06-Nov-2018 22:10:07 2018-11-06 22:10:07.864  INFO 8261 --- [           main] o.s.c.d.acceptance.test.TickTockTests    : Looking for 'Started LogSink' in logfile for log
06-Nov-2018 22:10:17 2018-11-06 22:10:17.864  INFO 8261 --- [           main] o.s.c.d.acceptance.test.TickTockTests    : Requesting log for app TICKTOCK.log-v1-0
06-Nov-2018 22:10:18 2018-11-06 22:10:18.124  INFO 8261 --- [           main] o.s.c.d.acceptance.test.TickTockTests    : Retrieved logfile from 'http://10.194.6.14:41045/logfile
06-Nov-2018 22:10:18 2018-11-06 22:10:18.125  INFO 8261 --- [           main] o.s.c.d.acceptance.test.TickTockTests    : Matched all 'Started LogSink' in logfile for instance TICKTOCK.log-v1-0 of app log
06-Nov-2018 22:10:18 2018-11-06 22:10:18.125  INFO 8261 --- [           main] o.s.c.d.acceptance.test.TickTockTests    : Looking for 'TICKTOCK - TIMESTAMP:' in logfile for log
06-Nov-2018 22:10:28 2018-11-06 22:10:28.125  INFO 8261 --- [           main] o.s.c.d.acceptance.test.TickTockTests    : Requesting log for app TICKTOCK.log-v1-0
06-Nov-2018 22:10:28 2018-11-06 22:10:28.148  INFO 8261 --- [           main] o.s.c.d.acceptance.test.TickTockTests    : Retrieved logfile from 'http://10.194.6.14:41045/logfile
06-Nov-2018 22:10:28 2018-11-06 22:10:28.149  INFO 8261 --- [           main] o.s.c.d.acceptance.test.TickTockTests    : Matched all 'TICKTOCK - TIMESTAMP:' in logfile for instance TICKTOCK.log-v1-0 of app log
06-Nov-2018 22:10:28 2018-11-06 22:10:28.151  INFO 8261 --- [           main] junit.logTestName                        : Test tickTockTests(org.springframework.cloud.dataflow.acceptance.test.TickTockTests) Succeeded
06-Nov-2018 22:10:28 2018-11-06 22:10:28.151  INFO 8261 --- [           main] junit.logTestName                        : Finished Test tickTockTests(org.springframework.cloud.dataflow.acceptance.test.TickTockTests)
06-Nov-2018 22:10:28 2018-11-06 22:10:28.151  INFO 8261 --- [           main] o.s.c.d.acceptance.test.TickTockTests    : Destroy all streams
06-Nov-2018 22:10:28 2018-11-06 22:10:28.469  INFO 8261 --- [           main] junit.logTestName                        : Starting Test tickTockTestsFromConfigServer(org.springframework.cloud.dataflow.acceptance.test.TickTockTests)
06-Nov-2018 22:10:28 2018-11-06 22:10:28.507  INFO 8261 --- [           main] junit.logTestName                        : Finished Test tickTockTestsFromConfigServer(org.springframework.cloud.dataflow.acceptance.test.TickTockTests)
06-Nov-2018 22:10:28 2018-11-06 22:10:28.508  INFO 8261 --- [           main] o.s.c.d.acceptance.test.TickTockTests    : Destroy all streams
06-Nov-2018 22:10:28 Tests run: 2, Failures: 0, Errors: 0, Skipped: 1, Time elapsed: 71.954 sec - in org.springframework.cloud.dataflow.acceptance.test.TickTockTests
06-Nov-2018 22:10:28 Running org.springframework.cloud.dataflow.acceptance.test.TransformTests
06-Nov-2018 22:10:28 2018-11-06 22:10:28.516  INFO 8261 --- [           main] .b.t.c.SpringBootTestContextBootstrapper : Neither @ContextConfiguration nor @ContextHierarchy found for test class [org.springframework.cloud.dataflow.acceptance.test.TransformTests], using SpringBootContextLoader
06-Nov-2018 22:10:28 2018-11-06 22:10:28.528  INFO 8261 --- [           main] .b.t.c.SpringBootTestContextBootstrapper : Loaded default TestExecutionListener class names from location [META-INF/spring.factories]: [org.springframework.boot.test.mock.mockito.MockitoTestExecutionListener, org.springframework.boot.test.mock.mockito.ResetMocksTestExecutionListener, org.springframework.boot.test.autoconfigure.restdocs.RestDocsTestExecutionListener, org.springframework.boot.test.autoconfigure.web.client.MockRestServiceServerResetTestExecutionListener, org.springframework.boot.test.autoconfigure.web.servlet.MockMvcPrintOnlyOnFailureTestExecutionListener, org.springframework.boot.test.autoconfigure.web.servlet.WebDriverTestExecutionListener, org.springframework.test.context.web.ServletTestExecutionListener, org.springframework.test.context.support.DirtiesContextBeforeModesTestExecutionListener, org.springframework.test.context.support.DependencyInjectionTestExecutionListener, org.springframework.test.context.support.DirtiesContextTestExecutionListener, org.springframework.test.context.transaction.TransactionalTestExecutionListener, org.springframework.test.context.jdbc.SqlScriptsTestExecutionListener]
06-Nov-2018 22:10:28 2018-11-06 22:10:28.533  INFO 8261 --- [           main] .b.t.c.SpringBootTestContextBootstrapper : Using TestExecutionListeners: [org.springframework.test.context.web.ServletTestExecutionListener@869d87c, org.springframework.test.context.support.DirtiesContextBeforeModesTestExecutionListener@2f3166a, org.springframework.boot.test.autoconfigure.SpringBootDependencyInjectionTestExecutionListener@37637a24, org.springframework.test.context.support.DirtiesContextTestExecutionListener@31e76a8d, org.springframework.test.context.transaction.TransactionalTestExecutionListener@770beef5, org.springframework.test.context.jdbc.SqlScriptsTestExecutionListener@6dd1f638, org.springframework.boot.test.autoconfigure.restdocs.RestDocsTestExecutionListener@414f13fc, org.springframework.boot.test.autoconfigure.web.servlet.MockMvcPrintOnlyOnFailureTestExecutionListener@4b76aa5a, org.springframework.boot.test.mock.mockito.ResetMocksTestExecutionListener@63a28987, org.springframework.boot.test.autoconfigure.web.client.MockRestServiceServerResetTestExecutionListener@120d3fd, org.springframework.boot.test.autoconfigure.web.servlet.WebDriverTestExecutionListener@38c9e0d6, org.springframework.boot.test.mock.mockito.MockitoTestExecutionListener@4693a9ef]
06-Nov-2018 22:10:28 2018-11-06 22:10:28.651  INFO 8261 --- [           main] junit.logTestName                        : Starting Test transformTests(org.springframework.cloud.dataflow.acceptance.test.TransformTests)
06-Nov-2018 22:10:28 2018-11-06 22:10:28.653  INFO 8261 --- [           main] o.s.c.d.acceptance.test.TransformTests   : Creating stream 'TRANSFORM-TEST'
06-Nov-2018 22:10:28 2018-11-06 22:10:28.694  INFO 8261 --- [           main] o.s.c.d.acceptance.test.TransformTests   : Deploying stream 'TRANSFORM-TEST' with properties: {app.*.logging.file=${PID}-test.log, app.*.endpoints.logfile.sensitive=false, app.*.management.endpoints.web.exposure.include=*}
06-Nov-2018 22:10:34 2018-11-06 22:10:34.270  INFO 8261 --- [           main] o.s.c.d.acceptance.test.TransformTests   : Checking: Stream=TRANSFORM-TEST, status = deploying, status description = The stream is being deployed.
06-Nov-2018 22:10:34 2018-11-06 22:10:34.270  INFO 8261 --- [           main] o.s.c.d.acceptance.test.TransformTests   : Sleeping to check status of Stream=TRANSFORM-TEST
06-Nov-2018 22:10:44 2018-11-06 22:10:44.424  INFO 8261 --- [           main] o.s.c.d.acceptance.test.TransformTests   : Checking: Stream=TRANSFORM-TEST, status = deploying, status description = The stream is being deployed.
06-Nov-2018 22:10:44 2018-11-06 22:10:44.425  INFO 8261 --- [           main] o.s.c.d.acceptance.test.TransformTests   : Sleeping to check status of Stream=TRANSFORM-TEST
06-Nov-2018 22:10:54 2018-11-06 22:10:54.544  INFO 8261 --- [           main] o.s.c.d.acceptance.test.TransformTests   : Checking: Stream=TRANSFORM-TEST, status = deploying, status description = The stream is being deployed.
06-Nov-2018 22:10:54 2018-11-06 22:10:54.545  INFO 8261 --- [           main] o.s.c.d.acceptance.test.TransformTests   : Sleeping to check status of Stream=TRANSFORM-TEST
06-Nov-2018 22:11:04 2018-11-06 22:11:04.638  INFO 8261 --- [           main] o.s.c.d.acceptance.test.TransformTests   : Checking: Stream=TRANSFORM-TEST, status = deploying, status description = The stream is being deployed.
06-Nov-2018 22:11:04 2018-11-06 22:11:04.639  INFO 8261 --- [           main] o.s.c.d.acceptance.test.TransformTests   : Sleeping to check status of Stream=TRANSFORM-TEST
06-Nov-2018 22:11:14 2018-11-06 22:11:14.743  INFO 8261 --- [           main] o.s.c.d.acceptance.test.TransformTests   : Checking: Stream=TRANSFORM-TEST, status = deployed, status description = The stream has been successfully deployed
06-Nov-2018 22:11:14 2018-11-06 22:11:14.818  INFO 8261 --- [           main] o.s.c.d.acceptance.test.TransformTests   : Sleeping to check status of Stream=TRANSFORM-TEST
06-Nov-2018 22:11:24 2018-11-06 22:11:24.818  INFO 8261 --- [           main] o.s.c.d.acceptance.test.TransformTests   : Stream 'TRANSFORM-TEST' started with status: deployed
06-Nov-2018 22:11:24 2018-11-06 22:11:24.819  INFO 8261 --- [           main] o.s.c.d.acceptance.test.TransformTests   : App 'transform' has instances: {TRANSFORM-TEST.transform-v1-0=http://10.194.6.14:35164}
06-Nov-2018 22:11:24 2018-11-06 22:11:24.819  INFO 8261 --- [           main] o.s.c.d.acceptance.test.TransformTests   : App 'log' has instances: {TRANSFORM-TEST.log-v1-0=http://10.194.6.14:32206}
06-Nov-2018 22:11:24 2018-11-06 22:11:24.819  INFO 8261 --- [           main] o.s.c.d.acceptance.test.TransformTests   : App 'http' has instances: {TRANSFORM-TEST.http-v1-0=http://10.194.6.14:46181}
06-Nov-2018 22:11:24 2018-11-06 22:11:24.819  INFO 8261 --- [           main] o.s.c.d.acceptance.test.TransformTests   : Looking for 'Started HttpSource' in logfile for http
06-Nov-2018 22:11:34 2018-11-06 22:11:34.819  INFO 8261 --- [           main] o.s.c.d.acceptance.test.TransformTests   : Requesting log for app TRANSFORM-TEST.http-v1-0
06-Nov-2018 22:11:35 2018-11-06 22:11:35.096  INFO 8261 --- [           main] o.s.c.d.acceptance.test.TransformTests   : Retrieved logfile from 'http://10.194.6.14:46181/logfile
06-Nov-2018 22:11:35 2018-11-06 22:11:35.097  INFO 8261 --- [           main] o.s.c.d.acceptance.test.TransformTests   : Matched all 'Started HttpSource' in logfile for instance TRANSFORM-TEST.http-v1-0 of app http
06-Nov-2018 22:11:35 2018-11-06 22:11:35.259  INFO 8261 --- [           main] o.s.c.d.acceptance.test.TransformTests   : Looking for 'Started LogSink' in logfile for log
06-Nov-2018 22:11:45 2018-11-06 22:11:45.260  INFO 8261 --- [           main] o.s.c.d.acceptance.test.TransformTests   : Requesting log for app TRANSFORM-TEST.log-v1-0
06-Nov-2018 22:11:45 2018-11-06 22:11:45.516  INFO 8261 --- [           main] o.s.c.d.acceptance.test.TransformTests   : Retrieved logfile from 'http://10.194.6.14:32206/logfile
06-Nov-2018 22:11:45 2018-11-06 22:11:45.516  INFO 8261 --- [           main] o.s.c.d.acceptance.test.TransformTests   : Matched all 'Started LogSink' in logfile for instance TRANSFORM-TEST.log-v1-0 of app log
06-Nov-2018 22:11:45 2018-11-06 22:11:45.517  INFO 8261 --- [           main] o.s.c.d.acceptance.test.TransformTests   : Looking for 'ABCDEFG' in logfile for log
06-Nov-2018 22:11:55 2018-11-06 22:11:55.517  INFO 8261 --- [           main] o.s.c.d.acceptance.test.TransformTests   : Requesting log for app TRANSFORM-TEST.log-v1-0
06-Nov-2018 22:11:55 2018-11-06 22:11:55.540  INFO 8261 --- [           main] o.s.c.d.acceptance.test.TransformTests   : Retrieved logfile from 'http://10.194.6.14:32206/logfile
06-Nov-2018 22:11:55 2018-11-06 22:11:55.540  INFO 8261 --- [           main] o.s.c.d.acceptance.test.TransformTests   : Matched all 'ABCDEFG' in logfile for instance TRANSFORM-TEST.log-v1-0 of app log
06-Nov-2018 22:11:55 2018-11-06 22:11:55.542  INFO 8261 --- [           main] junit.logTestName                        : Test transformTests(org.springframework.cloud.dataflow.acceptance.test.TransformTests) Succeeded
06-Nov-2018 22:11:55 2018-11-06 22:11:55.543  INFO 8261 --- [           main] junit.logTestName                        : Finished Test transformTests(org.springframework.cloud.dataflow.acceptance.test.TransformTests)
06-Nov-2018 22:11:55 2018-11-06 22:11:55.554  INFO 8261 --- [           main] o.s.c.d.acceptance.test.TransformTests   : Destroy all streams
06-Nov-2018 22:11:56 Tests run: 1, Failures: 0, Errors: 0, Skipped: 0, Time elapsed: 87.51 sec - in org.springframework.cloud.dataflow.acceptance.test.TransformTests
06-Nov-2018 22:11:56 Running org.springframework.cloud.dataflow.acceptance.test.SchedulerTests
06-Nov-2018 22:11:56 2018-11-06 22:11:56.399  INFO 8261 --- [           main] s.c.a.AnnotationConfigApplicationContext : Refreshing org.springframework.context.annotation.AnnotationConfigApplicationContext@3c66b7d8: startup date [Tue Nov 06 22:11:56 UTC 2018]; root of context hierarchy
06-Nov-2018 22:11:56 2018-11-06 22:11:56.572  INFO 8261 --- [           main] trationDelegate$BeanPostProcessorChecker : Bean 'configurationPropertiesRebinderAutoConfiguration' of type [class org.springframework.cloud.autoconfigure.ConfigurationPropertiesRebinderAutoConfiguration$$EnhancerBySpringCGLIB$$70cac85b] is not eligible for getting processed by all BeanPostProcessors (for example: not eligible for auto-proxying)
06-Nov-2018 22:11:56
06-Nov-2018 22:11:56   .   ____          _            __ _ _
06-Nov-2018 22:11:56 /\\ / ___'_ __ _ _(_)_ __  __ _ \ \ \ \
06-Nov-2018 22:11:56 ( ( )\___ | '_ | '_| | '_ \/ _` | \ \ \ \
06-Nov-2018 22:11:56 \\/  ___)| |_)| | | | | || (_| |  ) ) ) )
06-Nov-2018 22:11:56   '  |____| .__|_| |_|_| |_\__, | / / / /
06-Nov-2018 22:11:56 =========|_|==============|___/=/_/_/_/
06-Nov-2018 22:11:56 :: Spring Boot ::        (v1.4.1.RELEASE)
06-Nov-2018 22:11:56
06-Nov-2018 22:11:56 2018-11-06 22:11:56.772  INFO 8261 --- [           main] c.c.c.ConfigServicePropertySourceLocator : Fetching config from server at: http://localhost:8888
06-Nov-2018 22:11:56 2018-11-06 22:11:56.776  WARN 8261 --- [           main] c.c.c.ConfigServicePropertySourceLocator : Could not locate PropertySource: I/O error on GET request for "http://localhost:8888//blah": Connection refused (Connection refused); nested exception is java.net.ConnectException: Connection refused (Connection refused)
06-Nov-2018 22:11:56 2018-11-06 22:11:56.778  INFO 8261 --- [           main] o.a.maven.surefire.booter.ForkedBooter   : The following profiles are active: blah
06-Nov-2018 22:11:56 2018-11-06 22:11:56.780  INFO 8261 --- [           main] s.c.a.AnnotationConfigApplicationContext : Refreshing org.springframework.context.annotation.AnnotationConfigApplicationContext@69d3cf7e: startup date [Tue Nov 06 22:11:56 UTC 2018]; parent: org.springframework.context.annotation.AnnotationConfigApplicationContext@3c66b7d8
06-Nov-2018 22:11:56 2018-11-06 22:11:56.915  INFO 8261 --- [           main] o.a.maven.surefire.booter.ForkedBooter   : Started ForkedBooter in 0.832 seconds (JVM running for 468.544)
06-Nov-2018 22:11:56 2018-11-06 22:11:56.916  INFO 8261 --- [           main] s.c.a.AnnotationConfigApplicationContext : Closing org.springframework.context.annotation.AnnotationConfigApplicationContext@69d3cf7e: startup date [Tue Nov 06 22:11:56 UTC 2018]; parent: org.springframework.context.annotation.AnnotationConfigApplicationContext@3c66b7d8
06-Nov-2018 22:11:56 2018-11-06 22:11:56.930 ERROR 8261 --- [           main] o.s.c.d.a.test.util.SchedulerRule        : SCHEDULER IS NOT AVAILABLE, SKIPPING TESTS
06-Nov-2018 22:11:56
06-Nov-2018 22:11:56 java.lang.IllegalArgumentException: no SchedulerOperations bean is available.  Skipping test.
06-Nov-2018 22:11:56         at org.springframework.util.Assert.notNull(Assert.java:115)
06-Nov-2018 22:11:56         at org.springframework.cloud.dataflow.acceptance.test.util.SchedulerRule.obtainResource(SchedulerRule.java:57)
06-Nov-2018 22:11:56         at org.springframework.cloud.scheduler.spi.junit.AbstractExternalResourceTestSupport.apply(AbstractExternalResourceTestSupport.java:58)
06-Nov-2018 22:11:56         at org.junit.rules.RunRules.applyAll(RunRules.java:26)
06-Nov-2018 22:11:56         at org.junit.rules.RunRules.<init>(RunRules.java:15)
06-Nov-2018 22:11:56         at org.junit.runners.ParentRunner.withClassRules(ParentRunner.java:245)
06-Nov-2018 22:11:56         at org.junit.runners.ParentRunner.classBlock(ParentRunner.java:194)
06-Nov-2018 22:11:56         at org.junit.runners.ParentRunner.run(ParentRunner.java:362)
06-Nov-2018 22:11:56         at org.springframework.test.context.junit4.SpringJUnit4ClassRunner.run(SpringJUnit4ClassRunner.java:191)
06-Nov-2018 22:11:56         at org.apache.maven.surefire.junit4.JUnit4Provider.execute(JUnit4Provider.java:283)
06-Nov-2018 22:11:56         at org.apache.maven.surefire.junit4.JUnit4Provider.executeWithRerun(JUnit4Provider.java:173)
06-Nov-2018 22:11:56         at org.apache.maven.surefire.junit4.JUnit4Provider.executeTestSet(JUnit4Provider.java:153)
06-Nov-2018 22:11:56         at org.apache.maven.surefire.junit4.JUnit4Provider.invoke(JUnit4Provider.java:128)
06-Nov-2018 22:11:56         at org.apache.maven.surefire.booter.ForkedBooter.invokeProviderInSameClassLoader(ForkedBooter.java:203)
06-Nov-2018 22:11:56         at org.apache.maven.surefire.booter.ForkedBooter.runSuitesInProcess(ForkedBooter.java:155)
06-Nov-2018 22:11:56         at org.apache.maven.surefire.booter.ForkedBooter.main(ForkedBooter.java:103)
06-Nov-2018 22:11:56
06-Nov-2018 22:11:56 Tests run: 1, Failures: 0, Errors: 0, Skipped: 1, Time elapsed: 0.9 sec - in org.springframework.cloud.dataflow.acceptance.test.SchedulerTests
06-Nov-2018 22:11:56 Running org.springframework.cloud.dataflow.acceptance.test.NamedChannelTests
06-Nov-2018 22:11:56 2018-11-06 22:11:56.933  INFO 8261 --- [           main] .b.t.c.SpringBootTestContextBootstrapper : Neither @ContextConfiguration nor @ContextHierarchy found for test class [org.springframework.cloud.dataflow.acceptance.test.NamedChannelTests], using SpringBootContextLoader
06-Nov-2018 22:11:56 2018-11-06 22:11:56.944  INFO 8261 --- [           main] .b.t.c.SpringBootTestContextBootstrapper : Loaded default TestExecutionListener class names from location [META-INF/spring.factories]: [org.springframework.boot.test.mock.mockito.MockitoTestExecutionListener, org.springframework.boot.test.mock.mockito.ResetMocksTestExecutionListener, org.springframework.boot.test.autoconfigure.restdocs.RestDocsTestExecutionListener, org.springframework.boot.test.autoconfigure.web.client.MockRestServiceServerResetTestExecutionListener, org.springframework.boot.test.autoconfigure.web.servlet.MockMvcPrintOnlyOnFailureTestExecutionListener, org.springframework.boot.test.autoconfigure.web.servlet.WebDriverTestExecutionListener, org.springframework.test.context.web.ServletTestExecutionListener, org.springframework.test.context.support.DirtiesContextBeforeModesTestExecutionListener, org.springframework.test.context.support.DependencyInjectionTestExecutionListener, org.springframework.test.context.support.DirtiesContextTestExecutionListener, org.springframework.test.context.transaction.TransactionalTestExecutionListener, org.springframework.test.context.jdbc.SqlScriptsTestExecutionListener]
06-Nov-2018 22:11:56 2018-11-06 22:11:56.950  INFO 8261 --- [           main] .b.t.c.SpringBootTestContextBootstrapper : Using TestExecutionListeners: [org.springframework.test.context.web.ServletTestExecutionListener@318c68d5, org.springframework.test.context.support.DirtiesContextBeforeModesTestExecutionListener@4cfa83f9, org.springframework.boot.test.autoconfigure.SpringBootDependencyInjectionTestExecutionListener@321ca237, org.springframework.test.context.support.DirtiesContextTestExecutionListener@4c5a2baf, org.springframework.test.context.transaction.TransactionalTestExecutionListener@1ec22831, org.springframework.test.context.jdbc.SqlScriptsTestExecutionListener@63f855b, org.springframework.boot.test.autoconfigure.restdocs.RestDocsTestExecutionListener@516592b1, org.springframework.boot.test.autoconfigure.web.servlet.MockMvcPrintOnlyOnFailureTestExecutionListener@4cffcc61, org.springframework.boot.test.mock.mockito.ResetMocksTestExecutionListener@4373f66f, org.springframework.boot.test.autoconfigure.web.client.MockRestServiceServerResetTestExecutionListener@399ca607, org.springframework.boot.test.autoconfigure.web.servlet.WebDriverTestExecutionListener@44114b9f, org.springframework.boot.test.mock.mockito.MockitoTestExecutionListener@76bf1bb8]
06-Nov-2018 22:11:57 2018-11-06 22:11:57.088  INFO 8261 --- [           main] junit.logTestName                        : Starting Test testDestination(org.springframework.cloud.dataflow.acceptance.test.NamedChannelTests)
06-Nov-2018 22:11:57 2018-11-06 22:11:57.091  INFO 8261 --- [           main] o.s.c.d.a.test.NamedChannelTests         : Creating stream 'LOG-DESTINATION-SINK'
06-Nov-2018 22:11:57 2018-11-06 22:11:57.143  INFO 8261 --- [           main] o.s.c.d.a.test.NamedChannelTests         : Deploying stream 'LOG-DESTINATION-SINK' with properties: {app.*.logging.file=${PID}-test.log, app.*.endpoints.logfile.sensitive=false, app.*.management.endpoints.web.exposure.include=*}
06-Nov-2018 22:12:02 2018-11-06 22:12:02.447  INFO 8261 --- [           main] o.s.c.d.a.test.NamedChannelTests         : Checking: Stream=LOG-DESTINATION-SINK, status = deploying, status description = The stream is being deployed.
06-Nov-2018 22:12:02 2018-11-06 22:12:02.447  INFO 8261 --- [           main] o.s.c.d.a.test.NamedChannelTests         : Sleeping to check status of Stream=LOG-DESTINATION-SINK
06-Nov-2018 22:12:12 2018-11-06 22:12:12.494  INFO 8261 --- [           main] o.s.c.d.a.test.NamedChannelTests         : Checking: Stream=LOG-DESTINATION-SINK, status = deploying, status description = The stream is being deployed.
06-Nov-2018 22:12:12 2018-11-06 22:12:12.495  INFO 8261 --- [           main] o.s.c.d.a.test.NamedChannelTests         : Sleeping to check status of Stream=LOG-DESTINATION-SINK
06-Nov-2018 22:12:22 2018-11-06 22:12:22.543  INFO 8261 --- [           main] o.s.c.d.a.test.NamedChannelTests         : Checking: Stream=LOG-DESTINATION-SINK, status = deployed, status description = The stream has been successfully deployed
06-Nov-2018 22:12:22 2018-11-06 22:12:22.582  INFO 8261 --- [           main] o.s.c.d.a.test.NamedChannelTests         : Sleeping to check status of Stream=LOG-DESTINATION-SINK
06-Nov-2018 22:12:32 2018-11-06 22:12:32.582  INFO 8261 --- [           main] o.s.c.d.a.test.NamedChannelTests         : Stream 'LOG-DESTINATION-SINK' started with status: deployed
06-Nov-2018 22:12:32 2018-11-06 22:12:32.583  INFO 8261 --- [           main] o.s.c.d.a.test.NamedChannelTests         : App 'log' has instances: {LOG-DESTINATION-SINK.log-v1-0=http://10.194.6.14:34451}
06-Nov-2018 22:12:32 2018-11-06 22:12:32.583  INFO 8261 --- [           main] o.s.c.d.a.test.NamedChannelTests         : Looking for 'Started LogSink' in logfile for log
06-Nov-2018 22:12:42 2018-11-06 22:12:42.583  INFO 8261 --- [           main] o.s.c.d.a.test.NamedChannelTests         : Requesting log for app LOG-DESTINATION-SINK.log-v1-0
06-Nov-2018 22:12:42 2018-11-06 22:12:42.831  INFO 8261 --- [           main] o.s.c.d.a.test.NamedChannelTests         : Retrieved logfile from 'http://10.194.6.14:34451/logfile
06-Nov-2018 22:12:42 2018-11-06 22:12:42.831  INFO 8261 --- [           main] o.s.c.d.a.test.NamedChannelTests         : Matched all 'Started LogSink' in logfile for instance LOG-DESTINATION-SINK.log-v1-0 of app log
06-Nov-2018 22:12:42 2018-11-06 22:12:42.832  INFO 8261 --- [           main] o.s.c.d.a.test.NamedChannelTests         : Creating stream 'HTTP-DESTINATION-SOURCE'
06-Nov-2018 22:12:42 2018-11-06 22:12:42.875  INFO 8261 --- [           main] o.s.c.d.a.test.NamedChannelTests         : Deploying stream 'HTTP-DESTINATION-SOURCE' with properties: {app.*.logging.file=${PID}-test.log, app.*.endpoints.logfile.sensitive=false, app.*.management.endpoints.web.exposure.include=*}
06-Nov-2018 22:12:43 2018-11-06 22:12:43.306  INFO 8261 --- [           main] o.s.c.d.a.test.NamedChannelTests         : Checking: Stream=HTTP-DESTINATION-SOURCE, status = deploying, status description = The stream is being deployed.
06-Nov-2018 22:12:43 2018-11-06 22:12:43.306  INFO 8261 --- [           main] o.s.c.d.a.test.NamedChannelTests         : Sleeping to check status of Stream=HTTP-DESTINATION-SOURCE
06-Nov-2018 22:12:53 2018-11-06 22:12:53.400  INFO 8261 --- [           main] o.s.c.d.a.test.NamedChannelTests         : Checking: Stream=HTTP-DESTINATION-SOURCE, status = deploying, status description = The stream is being deployed.
06-Nov-2018 22:12:53 2018-11-06 22:12:53.400  INFO 8261 --- [           main] o.s.c.d.a.test.NamedChannelTests         : Sleeping to check status of Stream=HTTP-DESTINATION-SOURCE
06-Nov-2018 22:13:03 2018-11-06 22:13:03.469  INFO 8261 --- [           main] o.s.c.d.a.test.NamedChannelTests         : Checking: Stream=HTTP-DESTINATION-SOURCE, status = deployed, status description = The stream has been successfully deployed
06-Nov-2018 22:13:03 2018-11-06 22:13:03.527  INFO 8261 --- [           main] o.s.c.d.a.test.NamedChannelTests         : Sleeping to check status of Stream=HTTP-DESTINATION-SOURCE
06-Nov-2018 22:13:13 2018-11-06 22:13:13.528  INFO 8261 --- [           main] o.s.c.d.a.test.NamedChannelTests         : Stream 'HTTP-DESTINATION-SOURCE' started with status: deployed
06-Nov-2018 22:13:13 2018-11-06 22:13:13.529  INFO 8261 --- [           main] o.s.c.d.a.test.NamedChannelTests         : App 'http' has instances: {HTTP-DESTINATION-SOURCE.http-v1-0=http://10.194.6.14:47414}
06-Nov-2018 22:13:13 2018-11-06 22:13:13.529  INFO 8261 --- [           main] o.s.c.d.a.test.NamedChannelTests         : Looking for 'Started HttpSource' in logfile for http
06-Nov-2018 22:13:23 2018-11-06 22:13:23.529  INFO 8261 --- [           main] o.s.c.d.a.test.NamedChannelTests         : Requesting log for app HTTP-DESTINATION-SOURCE.http-v1-0
06-Nov-2018 22:13:23 2018-11-06 22:13:23.762  INFO 8261 --- [           main] o.s.c.d.a.test.NamedChannelTests         : Retrieved logfile from 'http://10.194.6.14:47414/logfile
06-Nov-2018 22:13:23 2018-11-06 22:13:23.763  INFO 8261 --- [           main] o.s.c.d.a.test.NamedChannelTests         : Matched all 'Started HttpSource' in logfile for instance HTTP-DESTINATION-SOURCE.http-v1-0 of app http
06-Nov-2018 22:13:23 2018-11-06 22:13:23.915  INFO 8261 --- [           main] o.s.c.d.a.test.NamedChannelTests         : Looking for 'abcdefg' in logfile for log
06-Nov-2018 22:13:33 2018-11-06 22:13:33.915  INFO 8261 --- [           main] o.s.c.d.a.test.NamedChannelTests         : Requesting log for app LOG-DESTINATION-SINK.log-v1-0
06-Nov-2018 22:13:33 2018-11-06 22:13:33.937  INFO 8261 --- [           main] o.s.c.d.a.test.NamedChannelTests         : Retrieved logfile from 'http://10.194.6.14:34451/logfile
06-Nov-2018 22:13:33 2018-11-06 22:13:33.937  INFO 8261 --- [           main] o.s.c.d.a.test.NamedChannelTests         : Matched all 'abcdefg' in logfile for instance LOG-DESTINATION-SINK.log-v1-0 of app log
06-Nov-2018 22:13:33 2018-11-06 22:13:33.939  INFO 8261 --- [           main] junit.logTestName                        : Test testDestination(org.springframework.cloud.dataflow.acceptance.test.NamedChannelTests) Succeeded
06-Nov-2018 22:13:33 2018-11-06 22:13:33.944  INFO 8261 --- [           main] junit.logTestName                        : Finished Test testDestination(org.springframework.cloud.dataflow.acceptance.test.NamedChannelTests)
06-Nov-2018 22:13:33 2018-11-06 22:13:33.945  INFO 8261 --- [           main] o.s.c.d.a.test.NamedChannelTests         : Destroy all streams
06-Nov-2018 22:13:34 2018-11-06 22:13:34.480  INFO 8261 --- [           main] junit.logTestName                        : Starting Test testTap(org.springframework.cloud.dataflow.acceptance.test.NamedChannelTests)
06-Nov-2018 22:13:34 2018-11-06 22:13:34.482  INFO 8261 --- [           main] o.s.c.d.a.test.NamedChannelTests         : Creating stream 'TAPHTTP'
06-Nov-2018 22:13:34 2018-11-06 22:13:34.519  INFO 8261 --- [           main] o.s.c.d.a.test.NamedChannelTests         : Deploying stream 'TAPHTTP' with properties: {app.*.logging.file=${PID}-test.log, app.*.endpoints.logfile.sensitive=false, app.*.management.endpoints.web.exposure.include=*}
06-Nov-2018 22:13:35 2018-11-06 22:13:35.061  INFO 8261 --- [           main] o.s.c.d.a.test.NamedChannelTests         : Checking: Stream=TAPHTTP, status = deploying, status description = The stream is being deployed.
06-Nov-2018 22:13:35 2018-11-06 22:13:35.061  INFO 8261 --- [           main] o.s.c.d.a.test.NamedChannelTests         : Sleeping to check status of Stream=TAPHTTP
06-Nov-2018 22:13:45 2018-11-06 22:13:45.125  INFO 8261 --- [           main] o.s.c.d.a.test.NamedChannelTests         : Checking: Stream=TAPHTTP, status = deploying, status description = The stream is being deployed.
06-Nov-2018 22:13:45 2018-11-06 22:13:45.125  INFO 8261 --- [           main] o.s.c.d.a.test.NamedChannelTests         : Sleeping to check status of Stream=TAPHTTP
06-Nov-2018 22:13:55 2018-11-06 22:13:55.178  INFO 8261 --- [           main] o.s.c.d.a.test.NamedChannelTests         : Checking: Stream=TAPHTTP, status = deploying, status description = The stream is being deployed.
06-Nov-2018 22:13:55 2018-11-06 22:13:55.178  INFO 8261 --- [           main] o.s.c.d.a.test.NamedChannelTests         : Sleeping to check status of Stream=TAPHTTP
06-Nov-2018 22:14:05 2018-11-06 22:14:05.241  INFO 8261 --- [           main] o.s.c.d.a.test.NamedChannelTests         : Checking: Stream=TAPHTTP, status = deployed, status description = The stream has been successfully deployed
06-Nov-2018 22:14:05 2018-11-06 22:14:05.313  INFO 8261 --- [           main] o.s.c.d.a.test.NamedChannelTests         : Sleeping to check status of Stream=TAPHTTP
06-Nov-2018 22:14:15 2018-11-06 22:14:15.313  INFO 8261 --- [           main] o.s.c.d.a.test.NamedChannelTests         : Stream 'TAPHTTP' started with status: deployed
06-Nov-2018 22:14:15 2018-11-06 22:14:15.315  INFO 8261 --- [           main] o.s.c.d.a.test.NamedChannelTests         : App 'log' has instances: {TAPHTTP.log-v1-0=http://10.194.6.14:24630}
06-Nov-2018 22:14:15 2018-11-06 22:14:15.315  INFO 8261 --- [           main] o.s.c.d.a.test.NamedChannelTests         : App 'http' has instances: {TAPHTTP.http-v1-0=http://10.194.6.14:29499}
06-Nov-2018 22:14:15 2018-11-06 22:14:15.315  INFO 8261 --- [           main] o.s.c.d.a.test.NamedChannelTests         : Looking for 'Started HttpSource' in logfile for http
06-Nov-2018 22:14:25 2018-11-06 22:14:25.315  INFO 8261 --- [           main] o.s.c.d.a.test.NamedChannelTests         : Requesting log for app TAPHTTP.http-v1-0
06-Nov-2018 22:14:25 2018-11-06 22:14:25.547  INFO 8261 --- [           main] o.s.c.d.a.test.NamedChannelTests         : Retrieved logfile from 'http://10.194.6.14:29499/logfile
06-Nov-2018 22:14:25 2018-11-06 22:14:25.547  INFO 8261 --- [           main] o.s.c.d.a.test.NamedChannelTests         : Matched all 'Started HttpSource' in logfile for instance TAPHTTP.http-v1-0 of app http
06-Nov-2018 22:14:25 2018-11-06 22:14:25.547  INFO 8261 --- [           main] o.s.c.d.a.test.NamedChannelTests         : Looking for 'Started LogSink' in logfile for log
06-Nov-2018 22:14:35 2018-11-06 22:14:35.548  INFO 8261 --- [           main] o.s.c.d.a.test.NamedChannelTests         : Requesting log for app TAPHTTP.log-v1-0
06-Nov-2018 22:14:35 2018-11-06 22:14:35.804  INFO 8261 --- [           main] o.s.c.d.a.test.NamedChannelTests         : Retrieved logfile from 'http://10.194.6.14:24630/logfile
06-Nov-2018 22:14:35 2018-11-06 22:14:35.804  INFO 8261 --- [           main] o.s.c.d.a.test.NamedChannelTests         : Matched all 'Started LogSink' in logfile for instance TAPHTTP.log-v1-0 of app log
06-Nov-2018 22:14:35 2018-11-06 22:14:35.805  INFO 8261 --- [           main] o.s.c.d.a.test.NamedChannelTests         : Creating stream 'TAPSTREAM'
06-Nov-2018 22:14:35 2018-11-06 22:14:35.841  INFO 8261 --- [           main] o.s.c.d.a.test.NamedChannelTests         : Deploying stream 'TAPSTREAM' with properties: {app.*.logging.file=${PID}-test.log, app.*.endpoints.logfile.sensitive=false, app.*.management.endpoints.web.exposure.include=*}
06-Nov-2018 22:14:36 2018-11-06 22:14:36.259  INFO 8261 --- [           main] o.s.c.d.a.test.NamedChannelTests         : Checking: Stream=TAPSTREAM, status = deploying, status description = The stream is being deployed.
06-Nov-2018 22:14:36 2018-11-06 22:14:36.259  INFO 8261 --- [           main] o.s.c.d.a.test.NamedChannelTests         : Sleeping to check status of Stream=TAPSTREAM
06-Nov-2018 22:14:46 2018-11-06 22:14:46.368  INFO 8261 --- [           main] o.s.c.d.a.test.NamedChannelTests         : Checking: Stream=TAPSTREAM, status = deploying, status description = The stream is being deployed.
06-Nov-2018 22:14:46 2018-11-06 22:14:46.368  INFO 8261 --- [           main] o.s.c.d.a.test.NamedChannelTests         : Sleeping to check status of Stream=TAPSTREAM
06-Nov-2018 22:14:56 2018-11-06 22:14:56.434  INFO 8261 --- [           main] o.s.c.d.a.test.NamedChannelTests         : Checking: Stream=TAPSTREAM, status = deployed, status description = The stream has been successfully deployed
06-Nov-2018 22:14:56 2018-11-06 22:14:56.511  INFO 8261 --- [           main] o.s.c.d.a.test.NamedChannelTests         : Sleeping to check status of Stream=TAPSTREAM
06-Nov-2018 22:15:06 2018-11-06 22:15:06.512  INFO 8261 --- [           main] o.s.c.d.a.test.NamedChannelTests         : Stream 'TAPSTREAM' started with status: deployed
06-Nov-2018 22:15:06 2018-11-06 22:15:06.512  INFO 8261 --- [           main] o.s.c.d.a.test.NamedChannelTests         : App 'log' has instances: {TAPSTREAM.log-v1-0=http://10.194.6.14:55692}
06-Nov-2018 22:15:06 2018-11-06 22:15:06.512  INFO 8261 --- [           main] o.s.c.d.a.test.NamedChannelTests         : Looking for 'Started LogSink' in logfile for log
06-Nov-2018 22:15:16 2018-11-06 22:15:16.512  INFO 8261 --- [           main] o.s.c.d.a.test.NamedChannelTests         : Requesting log for app TAPSTREAM.log-v1-0
06-Nov-2018 22:15:16 2018-11-06 22:15:16.788  INFO 8261 --- [           main] o.s.c.d.a.test.NamedChannelTests         : Retrieved logfile from 'http://10.194.6.14:55692/logfile
06-Nov-2018 22:15:16 2018-11-06 22:15:16.788  INFO 8261 --- [           main] o.s.c.d.a.test.NamedChannelTests         : Matched all 'Started LogSink' in logfile for instance TAPSTREAM.log-v1-0 of app log
06-Nov-2018 22:15:16 2018-11-06 22:15:16.953  INFO 8261 --- [           main] o.s.c.d.a.test.NamedChannelTests         : Looking for 'abcdefg' in logfile for log
06-Nov-2018 22:15:26 2018-11-06 22:15:26.953  INFO 8261 --- [           main] o.s.c.d.a.test.NamedChannelTests         : Requesting log for app TAPSTREAM.log-v1-0
06-Nov-2018 22:15:26 2018-11-06 22:15:26.976  INFO 8261 --- [           main] o.s.c.d.a.test.NamedChannelTests         : Retrieved logfile from 'http://10.194.6.14:55692/logfile
06-Nov-2018 22:15:26 2018-11-06 22:15:26.976  INFO 8261 --- [           main] o.s.c.d.a.test.NamedChannelTests         : Matched all 'abcdefg' in logfile for instance TAPSTREAM.log-v1-0 of app log
06-Nov-2018 22:15:26 2018-11-06 22:15:26.977  INFO 8261 --- [           main] junit.logTestName                        : Test testTap(org.springframework.cloud.dataflow.acceptance.test.NamedChannelTests) Succeeded
06-Nov-2018 22:15:26 2018-11-06 22:15:26.977  INFO 8261 --- [           main] junit.logTestName                        : Finished Test testTap(org.springframework.cloud.dataflow.acceptance.test.NamedChannelTests)
06-Nov-2018 22:15:26 2018-11-06 22:15:26.977  INFO 8261 --- [           main] o.s.c.d.a.test.NamedChannelTests         : Destroy all streams
06-Nov-2018 22:15:27 2018-11-06 22:15:27.484  INFO 8261 --- [           main] junit.logTestName                        : Starting Test manyToOneTest(org.springframework.cloud.dataflow.acceptance.test.NamedChannelTests)
06-Nov-2018 22:15:27 2018-11-06 22:15:27.486  INFO 8261 --- [           main] o.s.c.d.a.test.NamedChannelTests         : Creating stream 'MANY-TO-ONE'
06-Nov-2018 22:15:27 2018-11-06 22:15:27.525  INFO 8261 --- [           main] o.s.c.d.a.test.NamedChannelTests         : Deploying stream 'MANY-TO-ONE' with properties: {app.*.logging.file=${PID}-test.log, app.*.endpoints.logfile.sensitive=false, app.*.management.endpoints.web.exposure.include=*}
06-Nov-2018 22:15:27 2018-11-06 22:15:27.956  INFO 8261 --- [           main] o.s.c.d.a.test.NamedChannelTests         : Checking: Stream=MANY-TO-ONE, status = deploying, status description = The stream is being deployed.
06-Nov-2018 22:15:27 2018-11-06 22:15:27.956  INFO 8261 --- [           main] o.s.c.d.a.test.NamedChannelTests         : Sleeping to check status of Stream=MANY-TO-ONE
06-Nov-2018 22:15:37 2018-11-06 22:15:37.992  INFO 8261 --- [           main] o.s.c.d.a.test.NamedChannelTests         : Checking: Stream=MANY-TO-ONE, status = deploying, status description = The stream is being deployed.
06-Nov-2018 22:15:37 2018-11-06 22:15:37.993  INFO 8261 --- [           main] o.s.c.d.a.test.NamedChannelTests         : Sleeping to check status of Stream=MANY-TO-ONE
06-Nov-2018 22:15:48 2018-11-06 22:15:48.033  INFO 8261 --- [           main] o.s.c.d.a.test.NamedChannelTests         : Checking: Stream=MANY-TO-ONE, status = deployed, status description = The stream has been successfully deployed
06-Nov-2018 22:15:48 2018-11-06 22:15:48.099  INFO 8261 --- [           main] o.s.c.d.a.test.NamedChannelTests         : Sleeping to check status of Stream=MANY-TO-ONE
06-Nov-2018 22:15:58 2018-11-06 22:15:58.100  INFO 8261 --- [           main] o.s.c.d.a.test.NamedChannelTests         : Stream 'MANY-TO-ONE' started with status: deployed
06-Nov-2018 22:15:58 2018-11-06 22:15:58.100  INFO 8261 --- [           main] o.s.c.d.a.test.NamedChannelTests         : App 'log' has instances: {MANY-TO-ONE.log-v1-0=http://10.194.6.14:33193}
06-Nov-2018 22:15:58 2018-11-06 22:15:58.100  INFO 8261 --- [           main] o.s.c.d.a.test.NamedChannelTests         : Looking for 'Started LogSink' in logfile for log
06-Nov-2018 22:16:08 2018-11-06 22:16:08.100  INFO 8261 --- [           main] o.s.c.d.a.test.NamedChannelTests         : Requesting log for app MANY-TO-ONE.log-v1-0
06-Nov-2018 22:16:08 2018-11-06 22:16:08.352  INFO 8261 --- [           main] o.s.c.d.a.test.NamedChannelTests         : Retrieved logfile from 'http://10.194.6.14:33193/logfile
06-Nov-2018 22:16:08 2018-11-06 22:16:08.352  INFO 8261 --- [           main] o.s.c.d.a.test.NamedChannelTests         : Matched all 'Started LogSink' in logfile for instance MANY-TO-ONE.log-v1-0 of app log
06-Nov-2018 22:16:08 2018-11-06 22:16:08.352  INFO 8261 --- [           main] o.s.c.d.a.test.NamedChannelTests         : Creating stream 'HTTP-SOURCE-1'
06-Nov-2018 22:16:08 2018-11-06 22:16:08.383  INFO 8261 --- [           main] o.s.c.d.a.test.NamedChannelTests         : Deploying stream 'HTTP-SOURCE-1' with properties: {app.*.logging.file=${PID}-test.log, app.*.endpoints.logfile.sensitive=false, app.*.management.endpoints.web.exposure.include=*}
06-Nov-2018 22:16:13 2018-11-06 22:16:13.746  INFO 8261 --- [           main] o.s.c.d.a.test.NamedChannelTests         : Checking: Stream=HTTP-SOURCE-1, status = deploying, status description = The stream is being deployed.
06-Nov-2018 22:16:13 2018-11-06 22:16:13.746  INFO 8261 --- [           main] o.s.c.d.a.test.NamedChannelTests         : Sleeping to check status of Stream=HTTP-SOURCE-1
06-Nov-2018 22:16:23 2018-11-06 22:16:23.841  INFO 8261 --- [           main] o.s.c.d.a.test.NamedChannelTests         : Checking: Stream=HTTP-SOURCE-1, status = deploying, status description = The stream is being deployed.
06-Nov-2018 22:16:23 2018-11-06 22:16:23.841  INFO 8261 --- [           main] o.s.c.d.a.test.NamedChannelTests         : Sleeping to check status of Stream=HTTP-SOURCE-1
06-Nov-2018 22:16:33 2018-11-06 22:16:33.918  INFO 8261 --- [           main] o.s.c.d.a.test.NamedChannelTests         : Checking: Stream=HTTP-SOURCE-1, status = deployed, status description = The stream has been successfully deployed
06-Nov-2018 22:16:33 2018-11-06 22:16:33.977  INFO 8261 --- [           main] o.s.c.d.a.test.NamedChannelTests         : Sleeping to check status of Stream=HTTP-SOURCE-1
06-Nov-2018 22:16:43 2018-11-06 22:16:43.978  INFO 8261 --- [           main] o.s.c.d.a.test.NamedChannelTests         : Stream 'HTTP-SOURCE-1' started with status: deployed
06-Nov-2018 22:16:43 2018-11-06 22:16:43.978  INFO 8261 --- [           main] o.s.c.d.a.test.NamedChannelTests         : App 'http' has instances: {HTTP-SOURCE-1.http-v1-0=http://10.194.6.14:12666}
06-Nov-2018 22:16:43 2018-11-06 22:16:43.978  INFO 8261 --- [           main] o.s.c.d.a.test.NamedChannelTests         : Looking for 'Started HttpSource' in logfile for http
06-Nov-2018 22:16:53 2018-11-06 22:16:53.978  INFO 8261 --- [           main] o.s.c.d.a.test.NamedChannelTests         : Requesting log for app HTTP-SOURCE-1.http-v1-0
06-Nov-2018 22:16:54 2018-11-06 22:16:54.200  INFO 8261 --- [           main] o.s.c.d.a.test.NamedChannelTests         : Retrieved logfile from 'http://10.194.6.14:12666/logfile
06-Nov-2018 22:16:54 2018-11-06 22:16:54.200  INFO 8261 --- [           main] o.s.c.d.a.test.NamedChannelTests         : Matched all 'Started HttpSource' in logfile for instance HTTP-SOURCE-1.http-v1-0 of app http
06-Nov-2018 22:16:54 2018-11-06 22:16:54.200  INFO 8261 --- [           main] o.s.c.d.a.test.NamedChannelTests         : Creating stream 'HTTP-SOURCE-2'
06-Nov-2018 22:16:54 2018-11-06 22:16:54.236  INFO 8261 --- [           main] o.s.c.d.a.test.NamedChannelTests         : Deploying stream 'HTTP-SOURCE-2' with properties: {app.*.logging.file=${PID}-test.log, app.*.endpoints.logfile.sensitive=false, app.*.management.endpoints.web.exposure.include=*}
06-Nov-2018 22:16:54 2018-11-06 22:16:54.637  INFO 8261 --- [           main] o.s.c.d.a.test.NamedChannelTests         : Checking: Stream=HTTP-SOURCE-2, status = deploying, status description = The stream is being deployed.
06-Nov-2018 22:16:54 2018-11-06 22:16:54.637  INFO 8261 --- [           main] o.s.c.d.a.test.NamedChannelTests         : Sleeping to check status of Stream=HTTP-SOURCE-2
06-Nov-2018 22:17:04 2018-11-06 22:17:04.757  INFO 8261 --- [           main] o.s.c.d.a.test.NamedChannelTests         : Checking: Stream=HTTP-SOURCE-2, status = deploying, status description = The stream is being deployed.
06-Nov-2018 22:17:04 2018-11-06 22:17:04.757  INFO 8261 --- [           main] o.s.c.d.a.test.NamedChannelTests         : Sleeping to check status of Stream=HTTP-SOURCE-2
06-Nov-2018 22:17:14 2018-11-06 22:17:14.891  INFO 8261 --- [           main] o.s.c.d.a.test.NamedChannelTests         : Checking: Stream=HTTP-SOURCE-2, status = deployed, status description = The stream has been successfully deployed
06-Nov-2018 22:17:14 2018-11-06 22:17:14.983  INFO 8261 --- [           main] o.s.c.d.a.test.NamedChannelTests         : Sleeping to check status of Stream=HTTP-SOURCE-2
06-Nov-2018 22:17:24 2018-11-06 22:17:24.984  INFO 8261 --- [           main] o.s.c.d.a.test.NamedChannelTests         : Stream 'HTTP-SOURCE-2' started with status: deployed
06-Nov-2018 22:17:24 2018-11-06 22:17:24.984  INFO 8261 --- [           main] o.s.c.d.a.test.NamedChannelTests         : App 'http' has instances: {HTTP-SOURCE-2.http-v1-0=http://10.194.6.14:46563}
06-Nov-2018 22:17:24 2018-11-06 22:17:24.984  INFO 8261 --- [           main] o.s.c.d.a.test.NamedChannelTests         : Looking for 'Started HttpSource' in logfile for http
06-Nov-2018 22:17:34 2018-11-06 22:17:34.984  INFO 8261 --- [           main] o.s.c.d.a.test.NamedChannelTests         : Requesting log for app HTTP-SOURCE-2.http-v1-0
06-Nov-2018 22:17:35 2018-11-06 22:17:35.207  INFO 8261 --- [           main] o.s.c.d.a.test.NamedChannelTests         : Retrieved logfile from 'http://10.194.6.14:46563/logfile
06-Nov-2018 22:17:35 2018-11-06 22:17:35.207  INFO 8261 --- [           main] o.s.c.d.a.test.NamedChannelTests         : Matched all 'Started HttpSource' in logfile for instance HTTP-SOURCE-2.http-v1-0 of app http
06-Nov-2018 22:17:35 2018-11-06 22:17:35.366  INFO 8261 --- [           main] o.s.c.d.a.test.NamedChannelTests         : Looking for 'abcdefg' in logfile for log
06-Nov-2018 22:17:45 2018-11-06 22:17:45.367  INFO 8261 --- [           main] o.s.c.d.a.test.NamedChannelTests         : Requesting log for app MANY-TO-ONE.log-v1-0
06-Nov-2018 22:17:45 2018-11-06 22:17:45.393  INFO 8261 --- [           main] o.s.c.d.a.test.NamedChannelTests         : Retrieved logfile from 'http://10.194.6.14:33193/logfile
06-Nov-2018 22:17:45 2018-11-06 22:17:45.393  INFO 8261 --- [           main] o.s.c.d.a.test.NamedChannelTests         : Matched all 'abcdefg' in logfile for instance MANY-TO-ONE.log-v1-0 of app log
06-Nov-2018 22:17:45 2018-11-06 22:17:45.556  INFO 8261 --- [           main] o.s.c.d.a.test.NamedChannelTests         : Looking for 'hijklmn' in logfile for log
06-Nov-2018 22:17:55 2018-11-06 22:17:55.556  INFO 8261 --- [           main] o.s.c.d.a.test.NamedChannelTests         : Requesting log for app MANY-TO-ONE.log-v1-0
06-Nov-2018 22:17:55 2018-11-06 22:17:55.570  INFO 8261 --- [           main] o.s.c.d.a.test.NamedChannelTests         : Retrieved logfile from 'http://10.194.6.14:33193/logfile
06-Nov-2018 22:17:55 2018-11-06 22:17:55.570  INFO 8261 --- [           main] o.s.c.d.a.test.NamedChannelTests         : Matched all 'hijklmn' in logfile for instance MANY-TO-ONE.log-v1-0 of app log
06-Nov-2018 22:17:55 2018-11-06 22:17:55.572  INFO 8261 --- [           main] junit.logTestName                        : Test manyToOneTest(org.springframework.cloud.dataflow.acceptance.test.NamedChannelTests) Succeeded
06-Nov-2018 22:17:55 2018-11-06 22:17:55.572  INFO 8261 --- [           main] junit.logTestName                        : Finished Test manyToOneTest(org.springframework.cloud.dataflow.acceptance.test.NamedChannelTests)
06-Nov-2018 22:17:55 2018-11-06 22:17:55.572  INFO 8261 --- [           main] o.s.c.d.a.test.NamedChannelTests         : Destroy all streams
06-Nov-2018 22:17:56 2018-11-06 22:17:56.119  INFO 8261 --- [           main] junit.logTestName                        : Starting Test directedGraphTest(org.springframework.cloud.dataflow.acceptance.test.NamedChannelTests)
06-Nov-2018 22:17:56 2018-11-06 22:17:56.120  INFO 8261 --- [           main] o.s.c.d.a.test.NamedChannelTests         : Creating stream 'DIRECTED-GRAPH-DESTINATION1'
06-Nov-2018 22:17:56 2018-11-06 22:17:56.152  INFO 8261 --- [           main] o.s.c.d.a.test.NamedChannelTests         : Deploying stream 'DIRECTED-GRAPH-DESTINATION1' with properties: {app.*.logging.file=${PID}-test.log, app.*.endpoints.logfile.sensitive=false, app.*.management.endpoints.web.exposure.include=*}
06-Nov-2018 22:18:01 2018-11-06 22:18:01.522  INFO 8261 --- [           main] o.s.c.d.a.test.NamedChannelTests         : Checking: Stream=DIRECTED-GRAPH-DESTINATION1, status = deploying, status description = The stream is being deployed.
06-Nov-2018 22:18:01 2018-11-06 22:18:01.522  INFO 8261 --- [           main] o.s.c.d.a.test.NamedChannelTests         : Sleeping to check status of Stream=DIRECTED-GRAPH-DESTINATION1
06-Nov-2018 22:18:11 2018-11-06 22:18:11.569  INFO 8261 --- [           main] o.s.c.d.a.test.NamedChannelTests         : Checking: Stream=DIRECTED-GRAPH-DESTINATION1, status = deploying, status description = The stream is being deployed.
06-Nov-2018 22:18:11 2018-11-06 22:18:11.569  INFO 8261 --- [           main] o.s.c.d.a.test.NamedChannelTests         : Sleeping to check status of Stream=DIRECTED-GRAPH-DESTINATION1
06-Nov-2018 22:18:21 2018-11-06 22:18:21.612  INFO 8261 --- [           main] o.s.c.d.a.test.NamedChannelTests         : Checking: Stream=DIRECTED-GRAPH-DESTINATION1, status = deploying, status description = The stream is being deployed.
06-Nov-2018 22:18:21 2018-11-06 22:18:21.612  INFO 8261 --- [           main] o.s.c.d.a.test.NamedChannelTests         : Sleeping to check status of Stream=DIRECTED-GRAPH-DESTINATION1
06-Nov-2018 22:18:31 2018-11-06 22:18:31.663  INFO 8261 --- [           main] o.s.c.d.a.test.NamedChannelTests         : Checking: Stream=DIRECTED-GRAPH-DESTINATION1, status = deployed, status description = The stream has been successfully deployed
06-Nov-2018 22:18:31 2018-11-06 22:18:31.728  INFO 8261 --- [           main] o.s.c.d.a.test.NamedChannelTests         : Sleeping to check status of Stream=DIRECTED-GRAPH-DESTINATION1
06-Nov-2018 22:18:41 2018-11-06 22:18:41.728  INFO 8261 --- [           main] o.s.c.d.a.test.NamedChannelTests         : Stream 'DIRECTED-GRAPH-DESTINATION1' started with status: deployed
06-Nov-2018 22:18:41 2018-11-06 22:18:41.729  INFO 8261 --- [           main] o.s.c.d.a.test.NamedChannelTests         : App 'transform' has instances: {DIRECTED-GRAPH-DESTINATION1.transform-v1-0=http://10.194.6.14:24132}
06-Nov-2018 22:18:41 2018-11-06 22:18:41.729  INFO 8261 --- [           main] o.s.c.d.a.test.NamedChannelTests         : App 'log' has instances: {DIRECTED-GRAPH-DESTINATION1.log-v1-0=http://10.194.6.14:52144}
06-Nov-2018 22:18:41 2018-11-06 22:18:41.729  INFO 8261 --- [           main] o.s.c.d.a.test.NamedChannelTests         : Looking for 'Started LogSink' in logfile for log
06-Nov-2018 22:18:51 2018-11-06 22:18:51.729  INFO 8261 --- [           main] o.s.c.d.a.test.NamedChannelTests         : Requesting log for app DIRECTED-GRAPH-DESTINATION1.log-v1-0
06-Nov-2018 22:18:51 2018-11-06 22:18:51.997  INFO 8261 --- [           main] o.s.c.d.a.test.NamedChannelTests         : Retrieved logfile from 'http://10.194.6.14:52144/logfile
06-Nov-2018 22:18:51 2018-11-06 22:18:51.997  INFO 8261 --- [           main] o.s.c.d.a.test.NamedChannelTests         : Matched all 'Started LogSink' in logfile for instance DIRECTED-GRAPH-DESTINATION1.log-v1-0 of app log
06-Nov-2018 22:18:51 2018-11-06 22:18:51.998  INFO 8261 --- [           main] o.s.c.d.a.test.NamedChannelTests         : Creating stream 'DIRECTED-GRAPH-DESTINATION2'
06-Nov-2018 22:18:52 2018-11-06 22:18:52.033  INFO 8261 --- [           main] o.s.c.d.a.test.NamedChannelTests         : Deploying stream 'DIRECTED-GRAPH-DESTINATION2' with properties: {app.*.logging.file=${PID}-test.log, app.*.endpoints.logfile.sensitive=false, app.*.management.endpoints.web.exposure.include=*}
06-Nov-2018 22:18:52 2018-11-06 22:18:52.522  INFO 8261 --- [           main] o.s.c.d.a.test.NamedChannelTests         : Checking: Stream=DIRECTED-GRAPH-DESTINATION2, status = deploying, status description = The stream is being deployed.
06-Nov-2018 22:18:52 2018-11-06 22:18:52.522  INFO 8261 --- [           main] o.s.c.d.a.test.NamedChannelTests         : Sleeping to check status of Stream=DIRECTED-GRAPH-DESTINATION2
06-Nov-2018 22:19:02 2018-11-06 22:19:02.639  INFO 8261 --- [           main] o.s.c.d.a.test.NamedChannelTests         : Checking: Stream=DIRECTED-GRAPH-DESTINATION2, status = deploying, status description = The stream is being deployed.
06-Nov-2018 22:19:02 2018-11-06 22:19:02.640  INFO 8261 --- [           main] o.s.c.d.a.test.NamedChannelTests         : Sleeping to check status of Stream=DIRECTED-GRAPH-DESTINATION2
06-Nov-2018 22:19:12 2018-11-06 22:19:12.723  INFO 8261 --- [           main] o.s.c.d.a.test.NamedChannelTests         : Checking: Stream=DIRECTED-GRAPH-DESTINATION2, status = deploying, status description = The stream is being deployed.
06-Nov-2018 22:19:12 2018-11-06 22:19:12.723  INFO 8261 --- [           main] o.s.c.d.a.test.NamedChannelTests         : Sleeping to check status of Stream=DIRECTED-GRAPH-DESTINATION2
06-Nov-2018 22:19:22 2018-11-06 22:19:22.807  INFO 8261 --- [           main] o.s.c.d.a.test.NamedChannelTests         : Checking: Stream=DIRECTED-GRAPH-DESTINATION2, status = deployed, status description = The stream has been successfully deployed
06-Nov-2018 22:19:22 2018-11-06 22:19:22.896  INFO 8261 --- [           main] o.s.c.d.a.test.NamedChannelTests         : Sleeping to check status of Stream=DIRECTED-GRAPH-DESTINATION2
06-Nov-2018 22:19:32 2018-11-06 22:19:32.896  INFO 8261 --- [           main] o.s.c.d.a.test.NamedChannelTests         : Stream 'DIRECTED-GRAPH-DESTINATION2' started with status: deployed
06-Nov-2018 22:19:32 2018-11-06 22:19:32.897  INFO 8261 --- [           main] o.s.c.d.a.test.NamedChannelTests         : App 'transform' has instances: {DIRECTED-GRAPH-DESTINATION2.transform-v1-0=http://10.194.6.14:15324}
06-Nov-2018 22:19:32 2018-11-06 22:19:32.897  INFO 8261 --- [           main] o.s.c.d.a.test.NamedChannelTests         : App 'log' has instances: {DIRECTED-GRAPH-DESTINATION2.log-v1-0=http://10.194.6.14:31920}
06-Nov-2018 22:19:32 2018-11-06 22:19:32.897  INFO 8261 --- [           main] o.s.c.d.a.test.NamedChannelTests         : Looking for 'Started LogSink' in logfile for log
06-Nov-2018 22:19:42 2018-11-06 22:19:42.897  INFO 8261 --- [           main] o.s.c.d.a.test.NamedChannelTests         : Requesting log for app DIRECTED-GRAPH-DESTINATION2.log-v1-0
06-Nov-2018 22:19:43 2018-11-06 22:19:43.162  INFO 8261 --- [           main] o.s.c.d.a.test.NamedChannelTests         : Retrieved logfile from 'http://10.194.6.14:31920/logfile
06-Nov-2018 22:19:43 2018-11-06 22:19:43.162  INFO 8261 --- [           main] o.s.c.d.a.test.NamedChannelTests         : Matched all 'Started LogSink' in logfile for instance DIRECTED-GRAPH-DESTINATION2.log-v1-0 of app log
06-Nov-2018 22:19:43 2018-11-06 22:19:43.163  INFO 8261 --- [           main] o.s.c.d.a.test.NamedChannelTests         : Creating stream 'DIRECTED-GRAPH-HTTP-SOURCE'
06-Nov-2018 22:19:43 2018-11-06 22:19:43.195  INFO 8261 --- [           main] o.s.c.d.a.test.NamedChannelTests         : Deploying stream 'DIRECTED-GRAPH-HTTP-SOURCE' with properties: {app.*.logging.file=${PID}-test.log, app.*.endpoints.logfile.sensitive=false, app.*.management.endpoints.web.exposure.include=*}
06-Nov-2018 22:19:48 2018-11-06 22:19:48.853  INFO 8261 --- [           main] o.s.c.d.a.test.NamedChannelTests         : Checking: Stream=DIRECTED-GRAPH-HTTP-SOURCE, status = deploying, status description = The stream is being deployed.
06-Nov-2018 22:19:48 2018-11-06 22:19:48.853  INFO 8261 --- [           main] o.s.c.d.a.test.NamedChannelTests         : Sleeping to check status of Stream=DIRECTED-GRAPH-HTTP-SOURCE
06-Nov-2018 22:19:59 2018-11-06 22:19:59.238  INFO 8261 --- [           main] o.s.c.d.a.test.NamedChannelTests         : Checking: Stream=DIRECTED-GRAPH-HTTP-SOURCE, status = deploying, status description = The stream is being deployed.
06-Nov-2018 22:19:59 2018-11-06 22:19:59.240  INFO 8261 --- [           main] o.s.c.d.a.test.NamedChannelTests         : Sleeping to check status of Stream=DIRECTED-GRAPH-HTTP-SOURCE
06-Nov-2018 22:20:10 2018-11-06 22:20:10.060  INFO 8261 --- [           main] o.s.c.d.a.test.NamedChannelTests         : Checking: Stream=DIRECTED-GRAPH-HTTP-SOURCE, status = deploying, status description = The stream is being deployed.
06-Nov-2018 22:20:10 2018-11-06 22:20:10.063  INFO 8261 --- [           main] o.s.c.d.a.test.NamedChannelTests         : Sleeping to check status of Stream=DIRECTED-GRAPH-HTTP-SOURCE
06-Nov-2018 22:20:20 2018-11-06 22:20:20.969  INFO 8261 --- [           main] o.s.c.d.a.test.NamedChannelTests         : Checking: Stream=DIRECTED-GRAPH-HTTP-SOURCE, status = deploying, status description = The stream is being deployed.
06-Nov-2018 22:20:20 2018-11-06 22:20:20.970  INFO 8261 --- [           main] o.s.c.d.a.test.NamedChannelTests         : Sleeping to check status of Stream=DIRECTED-GRAPH-HTTP-SOURCE
06-Nov-2018 22:20:32 2018-11-06 22:20:32.026  INFO 8261 --- [           main] o.s.c.d.a.test.NamedChannelTests         : Checking: Stream=DIRECTED-GRAPH-HTTP-SOURCE, status = deployed, status description = The stream has been successfully deployed
06-Nov-2018 22:20:32 2018-11-06 22:20:32.345  INFO 8261 --- [           main] o.s.c.d.a.test.NamedChannelTests         : Sleeping to check status of Stream=DIRECTED-GRAPH-HTTP-SOURCE
06-Nov-2018 22:20:42 2018-11-06 22:20:42.345  INFO 8261 --- [           main] o.s.c.d.a.test.NamedChannelTests         : Stream 'DIRECTED-GRAPH-HTTP-SOURCE' started with status: deployed
06-Nov-2018 22:20:42 2018-11-06 22:20:42.346  INFO 8261 --- [           main] o.s.c.d.a.test.NamedChannelTests         : App 'router' has instances: {DIRECTED-GRAPH-HTTP-SOURCE.router-v1-0=http://10.194.6.14:10485}
06-Nov-2018 22:20:42 2018-11-06 22:20:42.346  INFO 8261 --- [           main] o.s.c.d.a.test.NamedChannelTests         : App 'http' has instances: {DIRECTED-GRAPH-HTTP-SOURCE.http-v1-0=http://10.194.6.14:46787}
06-Nov-2018 22:20:42 2018-11-06 22:20:42.346  INFO 8261 --- [           main] o.s.c.d.a.test.NamedChannelTests         : Looking for 'Started HttpSource' in logfile for http
06-Nov-2018 22:20:52 2018-11-06 22:20:52.346  INFO 8261 --- [           main] o.s.c.d.a.test.NamedChannelTests         : Requesting log for app DIRECTED-GRAPH-HTTP-SOURCE.http-v1-0
06-Nov-2018 22:20:52 2018-11-06 22:20:52.958  INFO 8261 --- [           main] o.s.c.d.a.test.NamedChannelTests         : Retrieved logfile from 'http://10.194.6.14:46787/logfile
06-Nov-2018 22:20:52 2018-11-06 22:20:52.958  INFO 8261 --- [           main] o.s.c.d.a.test.NamedChannelTests         : Matched all 'Started HttpSource' in logfile for instance DIRECTED-GRAPH-HTTP-SOURCE.http-v1-0 of app http
06-Nov-2018 22:20:53 2018-11-06 22:20:53.144  INFO 8261 --- [           main] o.s.c.d.a.test.NamedChannelTests         : Looking for 'abcd-foo' in logfile for log
06-Nov-2018 22:21:03 2018-11-06 22:21:03.144  INFO 8261 --- [           main] o.s.c.d.a.test.NamedChannelTests         : Requesting log for app DIRECTED-GRAPH-DESTINATION1.log-v1-0
06-Nov-2018 22:21:03 2018-11-06 22:21:03.199  INFO 8261 --- [           main] o.s.c.d.a.test.NamedChannelTests         : Retrieved logfile from 'http://10.194.6.14:52144/logfile
06-Nov-2018 22:21:03 2018-11-06 22:21:03.199  INFO 8261 --- [           main] o.s.c.d.a.test.NamedChannelTests         : Matched all 'abcd-foo' in logfile for instance DIRECTED-GRAPH-DESTINATION1.log-v1-0 of app log
06-Nov-2018 22:21:03 2018-11-06 22:21:03.199  INFO 8261 --- [           main] o.s.c.d.a.test.NamedChannelTests         : Looking for 'defg-bar' in logfile for log
06-Nov-2018 22:21:13 2018-11-06 22:21:13.199  INFO 8261 --- [           main] o.s.c.d.a.test.NamedChannelTests         : Requesting log for app DIRECTED-GRAPH-DESTINATION2.log-v1-0
06-Nov-2018 22:21:13 2018-11-06 22:21:13.231  INFO 8261 --- [           main] o.s.c.d.a.test.NamedChannelTests         : Retrieved logfile from 'http://10.194.6.14:31920/logfile
06-Nov-2018 22:21:13 2018-11-06 22:21:13.231  INFO 8261 --- [           main] o.s.c.d.a.test.NamedChannelTests         : Matched all 'defg-bar' in logfile for instance DIRECTED-GRAPH-DESTINATION2.log-v1-0 of app log
06-Nov-2018 22:21:13 2018-11-06 22:21:13.260  INFO 8261 --- [           main] junit.logTestName                        : Test directedGraphTest(org.springframework.cloud.dataflow.acceptance.test.NamedChannelTests) Succeeded
06-Nov-2018 22:21:13 2018-11-06 22:21:13.261  INFO 8261 --- [           main] junit.logTestName                        : Finished Test directedGraphTest(org.springframework.cloud.dataflow.acceptance.test.NamedChannelTests)
06-Nov-2018 22:21:13 2018-11-06 22:21:13.261  INFO 8261 --- [           main] o.s.c.d.a.test.NamedChannelTests         : Destroy all streams
06-Nov-2018 22:21:22 Tests run: 4, Failures: 0, Errors: 0, Skipped: 0, Time elapsed: 565.126 sec - in org.springframework.cloud.dataflow.acceptance.test.NamedChannelTests
06-Nov-2018 22:21:22 Running org.springframework.cloud.dataflow.acceptance.test.util.PlatformHelperTests
06-Nov-2018 22:21:22 Tests run: 3, Failures: 0, Errors: 0, Skipped: 0, Time elapsed: 0.244 sec - in org.springframework.cloud.dataflow.acceptance.test.util.PlatformHelperTests
06-Nov-2018 22:21:22 Running org.springframework.cloud.dataflow.acceptance.test.util.ApplicationTests
06-Nov-2018 22:21:22 Tests run: 2, Failures: 0, Errors: 0, Skipped: 0, Time elapsed: 0 sec - in org.springframework.cloud.dataflow.acceptance.test.util.ApplicationTests
06-Nov-2018 22:21:22 2018-11-06 22:21:22.376  INFO 8261 --- [       Thread-6] o.s.c.support.GenericApplicationContext  : Closing org.springframework.context.support.GenericApplicationContext@e4e1ef5: startup date [Tue Nov 06 22:08:45 UTC 2018]; root of context hierarchy
06-Nov-2018 22:21:22
06-Nov-2018 22:21:22 Results :
06-Nov-2018 22:21:22
06-Nov-2018 22:21:22 Tests run: 18, Failures: 0, Errors: 0, Skipped: 2
06-Nov-2018 22:21:22
06-Nov-2018 22:21:22 [INFO]
06-Nov-2018 22:21:22 [INFO] >>> maven-surefire-report-plugin:2.22.0:report (default-cli) > [surefire]test @ spring-cloud-dataflow-acceptance-tests >>>
06-Nov-2018 22:21:23 [INFO]
06-Nov-2018 22:21:23 [INFO] --- maven-checkstyle-plugin:2.17:check (checkstyle-validation) @ spring-cloud-dataflow-acceptance-tests ---
06-Nov-2018 22:21:24 [INFO]
06-Nov-2018 22:21:24 [INFO] --- maven-resources-plugin:2.6:resources (default-resources) @ spring-cloud-dataflow-acceptance-tests ---
06-Nov-2018 22:21:24 [INFO] Using 'UTF-8' encoding to copy filtered resources.
06-Nov-2018 22:21:24 [INFO] skip non existing resourceDirectory /opt/bamboo-home/xml-data/build-dir/SCDT-LOCAL20XSKIPPER20X-KAFKA/src/main/resources
06-Nov-2018 22:21:24 [INFO] skip non existing resourceDirectory /opt/bamboo-home/xml-data/build-dir/SCDT-LOCAL20XSKIPPER20X-KAFKA/src/main/resources
06-Nov-2018 22:21:24 [INFO]
06-Nov-2018 22:21:24 [INFO] --- maven-compiler-plugin:3.1:compile (default-compile) @ spring-cloud-dataflow-acceptance-tests ---
06-Nov-2018 22:21:24 [INFO] Nothing to compile - all classes are up to date
06-Nov-2018 22:21:24 [INFO]
06-Nov-2018 22:21:24 [INFO] --- maven-resources-plugin:2.6:testResources (default-testResources) @ spring-cloud-dataflow-acceptance-tests ---
06-Nov-2018 22:21:24 [INFO] Using 'UTF-8' encoding to copy filtered resources.
06-Nov-2018 22:21:24 [INFO] Copying 1 resource
06-Nov-2018 22:21:24 [INFO]
06-Nov-2018 22:21:24 [INFO] --- maven-compiler-plugin:3.1:testCompile (default-testCompile) @ spring-cloud-dataflow-acceptance-tests ---
06-Nov-2018 22:21:24 [INFO] Nothing to compile - all classes are up to date
06-Nov-2018 22:21:24 [INFO]
06-Nov-2018 22:21:24 [INFO] --- maven-surefire-plugin:2.18.1:test (default-test) @ spring-cloud-dataflow-acceptance-tests ---
06-Nov-2018 22:21:24 [INFO] Skipping execution of surefire because it has already been run for this configuration
06-Nov-2018 22:21:24 [INFO]
06-Nov-2018 22:21:24 [INFO] <<< maven-surefire-report-plugin:2.22.0:report (default-cli) < [surefire]test @ spring-cloud-dataflow-acceptance-tests <<<
06-Nov-2018 22:21:24 [INFO]
06-Nov-2018 22:21:24 [INFO] --- maven-surefire-report-plugin:2.22.0:report (default-cli) @ spring-cloud-dataflow-acceptance-tests ---
06-Nov-2018 22:21:25 [WARNING] Unable to locate Test Source XRef to link to - DISABLED
06-Nov-2018 22:21:26 [INFO] ------------------------------------------------------------------------
06-Nov-2018 22:21:26 [INFO] BUILD SUCCESS
06-Nov-2018 22:21:26 [INFO] ------------------------------------------------------------------------
06-Nov-2018 22:21:26 [INFO] Total time: 17:28 min
06-Nov-2018 22:21:26 [INFO] Finished at: 2018-11-06T22:21:26+00:00
06-Nov-2018 22:21:26 [INFO] Final Memory: 58M/411M
06-Nov-2018 22:21:26 [INFO] ------------------------------------------------------------------------
06-Nov-2018 22:21:27 Clean up, clean up, everybody everywhere; clean up clean up, everybody do your share!
06-Nov-2018 22:21:27 Killing process PID [8131]
06-Nov-2018 22:21:27 Killing process PID [7907]
06-Nov-2018 22:21:31 No stopped containers
06-Nov-2018 22:21:31 Stopping mysql_mysql_1 ...
06-Nov-2018 22:21:37
06-Nov-2018 22:21:37 Stopping mysql_mysql_1 ... done
06-Nov-2018 22:21:37 Removing mysql_mysql_1 ...
06-Nov-2018 22:21:38
06-Nov-2018 22:21:38 Removing mysql_mysql_1 ... done
06-Nov-2018 22:21:38 Going to remove mysql_mysql_1
06-Nov-2018 22:21:38 Stopping kafka_zookeeper_1 ...
06-Nov-2018 22:21:38 Stopping kafka_kafka_1 ...
06-Nov-2018 22:21:43
06-Nov-2018 22:21:43 Stopping kafka_kafka_1 ... done
06-Nov-2018 22:21:48
06-Nov-2018 22:21:48 Stopping kafka_zookeeper_1 ... done
06-Nov-2018 22:21:49 Removing kafka_zookeeper_1 ...
06-Nov-2018 22:21:49 Removing kafka_kafka_1 ...
06-Nov-2018 22:21:49
06-Nov-2018 22:21:49 Removing kafka_zookeeper_1 ... done
06-Nov-2018 22:21:49
06-Nov-2018 22:21:49 Removing kafka_kafka_1 ... done
06-Nov-2018 22:21:49 Going to remove kafka_zookeeper_1, kafka_kafka_1
06-Nov-2018 22:21:49
06-Nov-2018 22:21:50 Finished task 'Execute Acceptance Tests' with result: Success
06-Nov-2018 22:21:53 Starting task 'JUnit Parser' of type 'com.atlassian.bamboo.plugins.testresultparser:task.testresultparser.junit'
06-Nov-2018 22:21:55 Parsing test results under /opt/bamboo-home/xml-data/build-dir/SCDT-LOCAL20XSKIPPER20X-KAFKA...
06-Nov-2018 22:21:59 Finished task 'JUnit Parser' with result: Success
06-Nov-2018 22:21:59 Starting task 'clean up' of type 'com.atlassian.bamboo.plugins.scripttask:task.builder.script'
06-Nov-2018 22:22:00
Beginning to execute external process for build 'Spring Cloud Data Flow Acceptance Tests - Local + SCDF-2.0.0.BS + Skipper 2.0.0.BS - Run Data Flow Acceptance Tests for Kafka #2 (SCDT-LOCAL20XSKIPPER20X-KAFKA-2)'
... running command line:
/opt/bamboo-home/temp/SCDT-LOCAL20XSKIPPER20X-KAFKA-2-ScriptBuildTask-3951709609755964833.sh
... in: /opt/bamboo-home/xml-data/build-dir/SCDT-LOCAL20XSKIPPER20X-KAFKA
... using extra environment variables:
bamboo_planRepository_1_branch=master
bamboo_signing_store_password=********
bamboo_capability_system_builder_ant_Ant_1_9=/opt/ant-1.9
bamboo_capability_system_builder_ant_Ant_1_8=/opt/ant-1.8
bamboo_planRepository_1_branchDisplayName=master
bamboo_repository_274694331_git_username=spring-buildmaster
bamboo_capability_system_jdk_OpenJDK_7u181=/opt/openjdk-7
bamboo_repository_revision_number=08e5bc520aba466c60a3788b41b49655670899b6
bamboo_capability_system_builder_node_Node_js_6=/usr/bin/node
bamboo_RIAK_BIN=/usr/sbin/riak
bamboo_buildKey=SCDT-LOCAL20XSKIPPER20X-KAFKA
bamboo_repository_274694331_branch_name=master
bamboo_sonar_token_password=********
bamboo_shortJobName=Run Data Flow Acceptance Tests for Kafka
bamboo_capability_system_builder_gradle___gradlew=./gradlew
bamboo_buildResultsUrl=https://build.spring.io/browse/SCDT-LOCAL20XSKIPPER20X-KAFKA-2
bamboo_capability_system_builder_mvn3_Maven_3_3=/opt/maven-3.3
bamboo_capability_system_builder_mvn3_Maven_3_2=/opt/maven-3.2
bamboo_capability_system_builder_mvn3_Maven_3_1=/opt/maven-3.1
bamboo_planRepository_repositoryUrl=https://github.com/spring-cloud/spring-cloud-dataflow-acceptance-tests.git
bamboo_agentId=208568323
bamboo_capability_system_builder_mvn3_Maven_3_5=/opt/maven-3.5
bamboo_capability_system_builder_mvn3_Maven_3_0=/opt/maven-3.0
bamboo_planRepository_revision=08e5bc520aba466c60a3788b41b49655670899b6
bamboo_planRepository_previousRevision=0c83aa4efad4b0e7540794d10f3ecde4f6a5a6d6
bamboo_capability_remote_build=true
bamboo_repository_branch_name=master
bamboo_repository_274694331_name=Git
bamboo_scdf_acceptance_tests_password=********
bamboo_dependenciesDisabled=false
bamboo_repository_274694331_git_branch=master
bamboo_capability_Agent=bamboo-04.af.pivotal.io
bamboo_planRepository_branch=master
bamboo_planRepository_1_type=gitv2
bamboo_planRepository_branchName=master
bamboo_sonar_password=********
bamboo_hg_cache_directory=/opt/bamboo-home/xml-data/build-dir/_hg-repositories-cache
bamboo_planRepository_1_username=spring-buildmaster
bamboo_repository_274694331_git_repositoryUrl=https://github.com/spring-cloud/spring-cloud-dataflow-acceptance-tests.git
bamboo_planRepository_type=gitv2
bamboo_ManualBuildTriggerReason_userName=mpollack
bamboo_git_cache_directory=/opt/bamboo-home/xml-data/build-dir/_git-repositories-cache
bamboo_artifactory_username=buildmaster
bamboo_tmp_directory=/opt/bamboo-home/temp
bamboo_planKey=SCDT-LOCAL20XSKIPPER20X
bamboo_planRepository_username=spring-buildmaster
bamboo_JDK8_HOME=/opt/jdk-8
bamboo_repository_274694331_previous_revision_number=0c83aa4efad4b0e7540794d10f3ecde4f6a5a6d6
bamboo_planRepository_1_branchName=master
bamboo_sonar_version=5.6.3
bamboo_capability_system_jdk_JDK_1_11=/opt/jdk-11
bamboo_resultsUrl=https://build.spring.io/browse/SCDT-LOCAL20XSKIPPER20X-KAFKA-2
bamboo_capability_system_jdk_JDK_1_10=/opt/jdk-10
bamboo_build_working_directory=/opt/bamboo-home/xml-data/build-dir/SCDT-LOCAL20XSKIPPER20X-KAFKA
bamboo_planRepository_1_name=Git
bamboo_capability_system_os=ubuntu1604
bamboo_nexusPush_stagingProfile=buildmaster
bamboo_shortPlanName=Local + SCDF-2.0.0.BS + Skipper 2.0.0.BS
bamboo_planRepository_name=Git
bamboo_buildNumber=2
bamboo_planName=Spring Cloud Data Flow Acceptance Tests - Local + SCDF-2.0.0.BS + Skipper 2.0.0.BS
bamboo_JDK7_HOME=/opt/jdk-7
bamboo_build_commandline_com_atlassian_bamboo_plugins_scripttask_task_builder_script_7=/opt/bamboo-home/temp/SCDT-LOCAL20XSKIPPER20X-KAFKA-2-ScriptBuildTask-1221401684338795842.sh
bamboo_shortPlanKey=LOCAL20XSKIPPER20X
bamboo_shortJobKey=KAFKA
bamboo_artifactory_password=********
bamboo_buildTimeStamp=2018-11-06T21:59:35.143Z
bamboo_repository_previous_revision_number=0c83aa4efad4b0e7540794d10f3ecde4f6a5a6d6
bamboo_sonar_username=buildmaster
bamboo_repository_git_branch=master
bamboo_buildResultKey=SCDT-LOCAL20XSKIPPER20X-KAFKA-2
bamboo_nexusPush_close=true
bamboo_buildPlanName=Spring Cloud Data Flow Acceptance Tests - Local + SCDF-2.0.0.BS + Skipper 2.0.0.BS - Run Data Flow Acceptance Tests for Kafka
bamboo_repository_274694331_revision_number=08e5bc520aba466c60a3788b41b49655670899b6
bamboo_planRepository_1_revision=08e5bc520aba466c60a3788b41b49655670899b6
bamboo_repository_name=Git
bamboo_signing_key_password=********
bamboo_buildFailed=false
bamboo_capability_system_docker_executable=/usr/bin/docker
bamboo_capability_system_builder_groovy_Groovy_2_4=/opt/groovy-2.4
bamboo_capability_system_builder_command_Bash=/bin/bash
bamboo_jobFailed=false
bamboo_agentWorkingDirectory=/opt/bamboo-home/xml-data/build-dir
bamboo_capability_system_git_executable=/usr/bin/git
bamboo_repository_git_username=spring-buildmaster
bamboo_planRepository_1_previousRevision=0c83aa4efad4b0e7540794d10f3ecde4f6a5a6d6
bamboo_capability_os_family=unix
bamboo_planRepository_branchDisplayName=master
bamboo_capability_system_builder_maven_Artifactory_Maven_3_5=/opt/maven-3.5
bamboo_capability_system_builder_maven_Artifactory_Maven_3_3=/opt/maven-3.3
bamboo_capability_system_builder_maven_Artifactory_Maven_3_2=/opt/maven-3.2
bamboo_s3_properties=/home/bamboo/tools/s3.properties
bamboo_capability_system_builder_maven_Artifactory_Maven_3_1=/opt/maven-3.1
bamboo_capability_system_builder_maven_Artifactory_Maven_3_0=/opt/maven-3.0
bamboo_plan_storageTag=plan-274497908
bamboo_repository_git_repositoryUrl=https://github.com/spring-cloud/spring-cloud-dataflow-acceptance-tests.git
bamboo_working_directory=/opt/bamboo-home/xml-data/build-dir/SCDT-LOCAL20XSKIPPER20X-KAFKA
bamboo_planRepository_1_repositoryUrl=https://github.com/spring-cloud/spring-cloud-dataflow-acceptance-tests.git
bamboo_capability_system_jdk_JDK_1_8=/opt/jdk-8
bamboo_capability_system_jdk_JDK_1_9=/opt/jdk-9
bamboo_capability_system_jdk_JDK_1_6=/opt/jdk-6
bamboo_capability_system_jdk_JDK_1_7=/opt/jdk-7
bamboo_sonar_ip=10.194.6.9
06-Nov-2018 22:22:00 CLEANING UP RESOURCES AFTER RUNNING TESTS
06-Nov-2018 22:22:00 Environment variable JAVA_HOME must be set
06-Nov-2018 22:22:00 FINISHED CLEANING UP RESOURCES
06-Nov-2018 22:22:00 Finished task 'clean up' with result: Success
06-Nov-2018 22:22:01 Running post build plugin 'Docker Container Cleanup'
06-Nov-2018 22:22:01 Running post build plugin 'NCover Results Collector'
06-Nov-2018 22:22:01 Running post build plugin 'Artifactory Release Management Staging'
06-Nov-2018 22:22:02 Running post build plugin 'Artifactory Build Info Copier'
06-Nov-2018 22:22:02 Running post build plugin 'Artifactory Gradle Properties Info Copier'
06-Nov-2018 22:22:02 Running post build plugin 'Clover Results Collector'
06-Nov-2018 22:22:02 Running post build plugin 'npm Cache Cleanup'
06-Nov-2018 22:22:02 Running post build plugin 'Artifact Copier'
06-Nov-2018 22:22:02 Publishing an artifact: Test Results
06-Nov-2018 22:22:03 Finished publishing of artifact Job artifact: [Test Results], pattern: [**/target/surefire-reports/**/*.*] in 1.025 s
06-Nov-2018 22:22:03 Publishing an artifact: App and Server Logs
06-Nov-2018 22:22:04 Finished publishing of artifact Job artifact: [App and Server Logs], pattern: [**/*.log] anchored at: [local] in 489.5 ms
06-Nov-2018 22:22:04 Successfully removed working directory at '/opt/bamboo-home/xml-data/build-dir/SCDT-LOCAL20XSKIPPER20X-KAFKA'
06-Nov-2018 22:22:04 Finalising the build...
06-Nov-2018 22:22:04 Stopping timer.
06-Nov-2018 22:22:04 Build SCDT-LOCAL20XSKIPPER20X-KAFKA-2 completed.
06-Nov-2018 22:22:04 Running on server: post build plugin 'NCover Results Collector'
06-Nov-2018 22:22:04 Running on server: post build plugin 'Build Hanging Detection Configuration'
06-Nov-2018 22:22:04 Running on server: post build plugin 'Clover Delta Calculator'
06-Nov-2018 22:22:04 Running on server: post build plugin 'Maven Dependencies Postprocessor'
06-Nov-2018 22:22:04 All post build plugins have finished
06-Nov-2018 22:22:04 Generating build results summary...
06-Nov-2018 22:22:05 Saving build results to disk...
06-Nov-2018 22:22:05 Logging substituted variables...
06-Nov-2018 22:22:05 Indexing build results...
06-Nov-2018 22:22:05 Finished building SCDT-LOCAL20XSKIPPER20X-KAFKA-2.