Build: #23 failed

Job: Run Data Flow Acceptance Tests for Kafka failed

Stages & jobs

  1. Test Stage - Kafka

  2. Test Stage - Rabbit

Build log

The build generated 3,284 lines of output.The output is too long and has been truncated to the last 1,000 lines. Download or view full build log

07-Dec-2018 06:03:53
07-Dec-2018 06:03:53 Exclusions:
07-Dec-2018 06:03:53 -----------
07-Dec-2018 06:03:53
07-Dec-2018 06:03:53     None
07-Dec-2018 06:03:53
07-Dec-2018 06:03:53
07-Dec-2018 06:03:53 Unconditional classes:
07-Dec-2018 06:03:53 ----------------------
07-Dec-2018 06:03:53
07-Dec-2018 06:03:53     None
07-Dec-2018 06:03:53
07-Dec-2018 06:03:53
07-Dec-2018 06:03:53
07-Dec-2018 06:03:53 2018-12-07 06:03:53.081 ERROR 19937 --- [           main] o.s.test.context.TestContextManager      : Caught exception while allowing TestExecutionListener [org.springframework.boot.test.autoconfigure.SpringBootDependencyInjectionTestExecutionListener@3a6045c6] to prepare test instance [org.springframework.cloud.dataflow.acceptance.test.NamedChannelTests@66cd621b]
07-Dec-2018 06:03:53
07-Dec-2018 06:03:53 org.springframework.beans.factory.BeanCreationException: Error creating bean with name 'org.springframework.cloud.dataflow.acceptance.test.NamedChannelTests': Invocation of init method failed; nested exception is org.springframework.web.client.ResourceAccessException: I/O error on GET request for "http://localhost:9393": Connection refused (Connection refused); nested exception is java.net.ConnectException: Connection refused (Connection refused)
07-Dec-2018 06:03:53         at org.springframework.beans.factory.support.AbstractAutowireCapableBeanFactory.initializeBean(AbstractAutowireCapableBeanFactory.java:1583)
07-Dec-2018 06:03:53         at org.springframework.beans.factory.support.AbstractAutowireCapableBeanFactory.initializeBean(AbstractAutowireCapableBeanFactory.java:399)
07-Dec-2018 06:03:53         at org.springframework.test.context.support.DependencyInjectionTestExecutionListener.injectDependencies(DependencyInjectionTestExecutionListener.java:119)
07-Dec-2018 06:03:53         at org.springframework.test.context.support.DependencyInjectionTestExecutionListener.prepareTestInstance(DependencyInjectionTestExecutionListener.java:83)
07-Dec-2018 06:03:53         at org.springframework.boot.test.autoconfigure.SpringBootDependencyInjectionTestExecutionListener.prepareTestInstance(SpringBootDependencyInjectionTestExecutionListener.java:44)
07-Dec-2018 06:03:53         at org.springframework.test.context.TestContextManager.prepareTestInstance(TestContextManager.java:230)
07-Dec-2018 06:03:53         at org.springframework.test.context.junit4.SpringJUnit4ClassRunner.createTest(SpringJUnit4ClassRunner.java:228)
07-Dec-2018 06:03:53         at org.springframework.test.context.junit4.SpringJUnit4ClassRunner$1.runReflectiveCall(SpringJUnit4ClassRunner.java:287)
07-Dec-2018 06:03:53         at org.junit.internal.runners.model.ReflectiveCallable.run(ReflectiveCallable.java:12)
07-Dec-2018 06:03:53         at org.springframework.test.context.junit4.SpringJUnit4ClassRunner.methodBlock(SpringJUnit4ClassRunner.java:289)
07-Dec-2018 06:03:53         at org.springframework.test.context.junit4.SpringJUnit4ClassRunner.runChild(SpringJUnit4ClassRunner.java:247)
07-Dec-2018 06:03:53         at org.springframework.test.context.junit4.SpringJUnit4ClassRunner.runChild(SpringJUnit4ClassRunner.java:94)
07-Dec-2018 06:03:53         at org.junit.runners.ParentRunner$3.run(ParentRunner.java:290)
07-Dec-2018 06:03:53         at org.junit.runners.ParentRunner$1.schedule(ParentRunner.java:71)
07-Dec-2018 06:03:53         at org.junit.runners.ParentRunner.runChildren(ParentRunner.java:288)
07-Dec-2018 06:03:53         at org.junit.runners.ParentRunner.access$000(ParentRunner.java:58)
07-Dec-2018 06:03:53         at org.junit.runners.ParentRunner$2.evaluate(ParentRunner.java:268)
07-Dec-2018 06:03:53         at org.springframework.test.context.junit4.statements.RunBeforeTestClassCallbacks.evaluate(RunBeforeTestClassCallbacks.java:61)
07-Dec-2018 06:03:53         at org.springframework.test.context.junit4.statements.RunAfterTestClassCallbacks.evaluate(RunAfterTestClassCallbacks.java:70)
07-Dec-2018 06:03:53         at org.junit.runners.ParentRunner.run(ParentRunner.java:363)
07-Dec-2018 06:03:53         at org.springframework.test.context.junit4.SpringJUnit4ClassRunner.run(SpringJUnit4ClassRunner.java:191)
07-Dec-2018 06:03:53         at org.apache.maven.surefire.junit4.JUnit4Provider.execute(JUnit4Provider.java:283)
07-Dec-2018 06:03:53         at org.apache.maven.surefire.junit4.JUnit4Provider.executeWithRerun(JUnit4Provider.java:173)
07-Dec-2018 06:03:53         at org.apache.maven.surefire.junit4.JUnit4Provider.executeTestSet(JUnit4Provider.java:153)
07-Dec-2018 06:03:53         at org.apache.maven.surefire.junit4.JUnit4Provider.invoke(JUnit4Provider.java:128)
07-Dec-2018 06:03:53         at org.apache.maven.surefire.booter.ForkedBooter.invokeProviderInSameClassLoader(ForkedBooter.java:203)
07-Dec-2018 06:03:53         at org.apache.maven.surefire.booter.ForkedBooter.runSuitesInProcess(ForkedBooter.java:155)
07-Dec-2018 06:03:53         at org.apache.maven.surefire.booter.ForkedBooter.main(ForkedBooter.java:103)
07-Dec-2018 06:03:53 Caused by: org.springframework.web.client.ResourceAccessException: I/O error on GET request for "http://localhost:9393": Connection refused (Connection refused); nested exception is java.net.ConnectException: Connection refused (Connection refused)
07-Dec-2018 06:03:53         at org.springframework.web.client.RestTemplate.doExecute(RestTemplate.java:633)
07-Dec-2018 06:03:53         at org.springframework.web.client.RestTemplate.execute(RestTemplate.java:595)
07-Dec-2018 06:03:53         at org.springframework.web.client.RestTemplate.getForObject(RestTemplate.java:303)
07-Dec-2018 06:03:53         at org.springframework.cloud.dataflow.rest.client.DataFlowTemplate.<init>(DataFlowTemplate.java:168)
07-Dec-2018 06:03:53         at org.springframework.cloud.dataflow.rest.client.DataFlowTemplate.<init>(DataFlowTemplate.java:150)
07-Dec-2018 06:03:53         at org.springframework.cloud.dataflow.acceptance.test.AbstractStreamTests.afterPropertiesSet(AbstractStreamTests.java:126)
07-Dec-2018 06:03:53         at org.springframework.beans.factory.support.AbstractAutowireCapableBeanFactory.invokeInitMethods(AbstractAutowireCapableBeanFactory.java:1642)
07-Dec-2018 06:03:53         at org.springframework.beans.factory.support.AbstractAutowireCapableBeanFactory.initializeBean(AbstractAutowireCapableBeanFactory.java:1579)
07-Dec-2018 06:03:53         ... 27 common frames omitted
07-Dec-2018 06:03:53 Caused by: java.net.ConnectException: Connection refused (Connection refused)
07-Dec-2018 06:03:53         at java.net.PlainSocketImpl.socketConnect(Native Method)
07-Dec-2018 06:03:53         at java.net.AbstractPlainSocketImpl.doConnect(AbstractPlainSocketImpl.java:350)
07-Dec-2018 06:03:53         at java.net.AbstractPlainSocketImpl.connectToAddress(AbstractPlainSocketImpl.java:206)
07-Dec-2018 06:03:53         at java.net.AbstractPlainSocketImpl.connect(AbstractPlainSocketImpl.java:188)
07-Dec-2018 06:03:53         at java.net.SocksSocketImpl.connect(SocksSocketImpl.java:392)
07-Dec-2018 06:03:53         at java.net.Socket.connect(Socket.java:589)
07-Dec-2018 06:03:53         at java.net.Socket.connect(Socket.java:538)
07-Dec-2018 06:03:53         at sun.net.NetworkClient.doConnect(NetworkClient.java:180)
07-Dec-2018 06:03:53         at sun.net.www.http.HttpClient.openServer(HttpClient.java:463)
07-Dec-2018 06:03:53         at sun.net.www.http.HttpClient.openServer(HttpClient.java:558)
07-Dec-2018 06:03:53         at sun.net.www.http.HttpClient.<init>(HttpClient.java:242)
07-Dec-2018 06:03:53         at sun.net.www.http.HttpClient.New(HttpClient.java:339)
07-Dec-2018 06:03:53         at sun.net.www.http.HttpClient.New(HttpClient.java:357)
07-Dec-2018 06:03:53         at sun.net.www.protocol.http.HttpURLConnection.getNewHttpClient(HttpURLConnection.java:1202)
07-Dec-2018 06:03:53         at sun.net.www.protocol.http.HttpURLConnection.plainConnect0(HttpURLConnection.java:1138)
07-Dec-2018 06:03:53         at sun.net.www.protocol.http.HttpURLConnection.plainConnect(HttpURLConnection.java:1032)
07-Dec-2018 06:03:53         at sun.net.www.protocol.http.HttpURLConnection.connect(HttpURLConnection.java:966)
07-Dec-2018 06:03:53         at org.springframework.http.client.SimpleBufferingClientHttpRequest.executeInternal(SimpleBufferingClientHttpRequest.java:78)
07-Dec-2018 06:03:53         at org.springframework.http.client.AbstractBufferingClientHttpRequest.executeInternal(AbstractBufferingClientHttpRequest.java:48)
07-Dec-2018 06:03:53         at org.springframework.http.client.AbstractClientHttpRequest.execute(AbstractClientHttpRequest.java:53)
07-Dec-2018 06:03:53         at org.springframework.web.client.RestTemplate.doExecute(RestTemplate.java:619)
07-Dec-2018 06:03:53         ... 34 common frames omitted
07-Dec-2018 06:03:53
07-Dec-2018 06:03:53
07-Dec-2018 06:03:53
07-Dec-2018 06:03:53
07-Dec-2018 06:03:53 =========================
07-Dec-2018 06:03:53 AUTO-CONFIGURATION REPORT
07-Dec-2018 06:03:53 =========================
07-Dec-2018 06:03:53
07-Dec-2018 06:03:53
07-Dec-2018 06:03:53 Positive matches:
07-Dec-2018 06:03:53 -----------------
07-Dec-2018 06:03:53
07-Dec-2018 06:03:53    RedisAutoConfiguration matched
07-Dec-2018 06:03:53       - @ConditionalOnClass found required classes 'org.springframework.data.redis.connection.jedis.JedisConnection', 'org.springframework.data.redis.core.RedisOperations', 'redis.clients.jedis.Jedis' (OnClassCondition)
07-Dec-2018 06:03:53
07-Dec-2018 06:03:53    RedisAutoConfiguration.RedisConfiguration#redisTemplate matched
07-Dec-2018 06:03:53       - @ConditionalOnMissingBean (names: redisTemplate; SearchStrategy: all) did not find any beans (OnBeanCondition)
07-Dec-2018 06:03:53
07-Dec-2018 06:03:53    RedisAutoConfiguration.RedisConfiguration#stringRedisTemplate matched
07-Dec-2018 06:03:53       - @ConditionalOnMissingBean (types: org.springframework.data.redis.core.StringRedisTemplate; SearchStrategy: all) did not find any beans (OnBeanCondition)
07-Dec-2018 06:03:53
07-Dec-2018 06:03:53    RedisAutoConfiguration.RedisConnectionConfiguration matched
07-Dec-2018 06:03:53       - @ConditionalOnClass found required class 'org.apache.commons.pool2.impl.GenericObjectPool' (OnClassCondition)
07-Dec-2018 06:03:53
07-Dec-2018 06:03:53    RedisAutoConfiguration.RedisConnectionConfiguration#redisConnectionFactory matched
07-Dec-2018 06:03:53       - @ConditionalOnMissingBean (types: org.springframework.data.redis.connection.RedisConnectionFactory; SearchStrategy: all) did not find any beans (OnBeanCondition)
07-Dec-2018 06:03:53
07-Dec-2018 06:03:53
07-Dec-2018 06:03:53 Negative matches:
07-Dec-2018 06:03:53 -----------------
07-Dec-2018 06:03:53
07-Dec-2018 06:03:53
07-Dec-2018 06:03:53 Exclusions:
07-Dec-2018 06:03:53 -----------
07-Dec-2018 06:03:53
07-Dec-2018 06:03:53     None
07-Dec-2018 06:03:53
07-Dec-2018 06:03:53
07-Dec-2018 06:03:53 Unconditional classes:
07-Dec-2018 06:03:53 ----------------------
07-Dec-2018 06:03:53
07-Dec-2018 06:03:53     None
07-Dec-2018 06:03:53
07-Dec-2018 06:03:53
07-Dec-2018 06:03:53
07-Dec-2018 06:03:53 2018-12-07 06:03:53.087 ERROR 19937 --- [           main] o.s.test.context.TestContextManager      : Caught exception while allowing TestExecutionListener [org.springframework.boot.test.autoconfigure.SpringBootDependencyInjectionTestExecutionListener@3a6045c6] to prepare test instance [org.springframework.cloud.dataflow.acceptance.test.NamedChannelTests@d3f4505]
07-Dec-2018 06:03:53
07-Dec-2018 06:03:53 org.springframework.beans.factory.BeanCreationException: Error creating bean with name 'org.springframework.cloud.dataflow.acceptance.test.NamedChannelTests': Invocation of init method failed; nested exception is org.springframework.web.client.ResourceAccessException: I/O error on GET request for "http://localhost:9393": Connection refused (Connection refused); nested exception is java.net.ConnectException: Connection refused (Connection refused)
07-Dec-2018 06:03:53         at org.springframework.beans.factory.support.AbstractAutowireCapableBeanFactory.initializeBean(AbstractAutowireCapableBeanFactory.java:1583)
07-Dec-2018 06:03:53         at org.springframework.beans.factory.support.AbstractAutowireCapableBeanFactory.initializeBean(AbstractAutowireCapableBeanFactory.java:399)
07-Dec-2018 06:03:53         at org.springframework.test.context.support.DependencyInjectionTestExecutionListener.injectDependencies(DependencyInjectionTestExecutionListener.java:119)
07-Dec-2018 06:03:53         at org.springframework.test.context.support.DependencyInjectionTestExecutionListener.prepareTestInstance(DependencyInjectionTestExecutionListener.java:83)
07-Dec-2018 06:03:53         at org.springframework.boot.test.autoconfigure.SpringBootDependencyInjectionTestExecutionListener.prepareTestInstance(SpringBootDependencyInjectionTestExecutionListener.java:44)
07-Dec-2018 06:03:53         at org.springframework.test.context.TestContextManager.prepareTestInstance(TestContextManager.java:230)
07-Dec-2018 06:03:53         at org.springframework.test.context.junit4.SpringJUnit4ClassRunner.createTest(SpringJUnit4ClassRunner.java:228)
07-Dec-2018 06:03:53         at org.springframework.test.context.junit4.SpringJUnit4ClassRunner$1.runReflectiveCall(SpringJUnit4ClassRunner.java:287)
07-Dec-2018 06:03:53         at org.junit.internal.runners.model.ReflectiveCallable.run(ReflectiveCallable.java:12)
07-Dec-2018 06:03:53         at org.springframework.test.context.junit4.SpringJUnit4ClassRunner.methodBlock(SpringJUnit4ClassRunner.java:289)
07-Dec-2018 06:03:53         at org.springframework.test.context.junit4.SpringJUnit4ClassRunner.runChild(SpringJUnit4ClassRunner.java:247)
07-Dec-2018 06:03:53         at org.springframework.test.context.junit4.SpringJUnit4ClassRunner.runChild(SpringJUnit4ClassRunner.java:94)
07-Dec-2018 06:03:53         at org.junit.runners.ParentRunner$3.run(ParentRunner.java:290)
07-Dec-2018 06:03:53         at org.junit.runners.ParentRunner$1.schedule(ParentRunner.java:71)
07-Dec-2018 06:03:53         at org.junit.runners.ParentRunner.runChildren(ParentRunner.java:288)
07-Dec-2018 06:03:53         at org.junit.runners.ParentRunner.access$000(ParentRunner.java:58)
07-Dec-2018 06:03:53         at org.junit.runners.ParentRunner$2.evaluate(ParentRunner.java:268)
07-Dec-2018 06:03:53         at org.springframework.test.context.junit4.statements.RunBeforeTestClassCallbacks.evaluate(RunBeforeTestClassCallbacks.java:61)
07-Dec-2018 06:03:53         at org.springframework.test.context.junit4.statements.RunAfterTestClassCallbacks.evaluate(RunAfterTestClassCallbacks.java:70)
07-Dec-2018 06:03:53         at org.junit.runners.ParentRunner.run(ParentRunner.java:363)
07-Dec-2018 06:03:53         at org.springframework.test.context.junit4.SpringJUnit4ClassRunner.run(SpringJUnit4ClassRunner.java:191)
07-Dec-2018 06:03:53         at org.apache.maven.surefire.junit4.JUnit4Provider.execute(JUnit4Provider.java:283)
07-Dec-2018 06:03:53         at org.apache.maven.surefire.junit4.JUnit4Provider.executeWithRerun(JUnit4Provider.java:173)
07-Dec-2018 06:03:53         at org.apache.maven.surefire.junit4.JUnit4Provider.executeTestSet(JUnit4Provider.java:153)
07-Dec-2018 06:03:53         at org.apache.maven.surefire.junit4.JUnit4Provider.invoke(JUnit4Provider.java:128)
07-Dec-2018 06:03:53         at org.apache.maven.surefire.booter.ForkedBooter.invokeProviderInSameClassLoader(ForkedBooter.java:203)
07-Dec-2018 06:03:53         at org.apache.maven.surefire.booter.ForkedBooter.runSuitesInProcess(ForkedBooter.java:155)
07-Dec-2018 06:03:53         at org.apache.maven.surefire.booter.ForkedBooter.main(ForkedBooter.java:103)
07-Dec-2018 06:03:53 Caused by: org.springframework.web.client.ResourceAccessException: I/O error on GET request for "http://localhost:9393": Connection refused (Connection refused); nested exception is java.net.ConnectException: Connection refused (Connection refused)
07-Dec-2018 06:03:53         at org.springframework.web.client.RestTemplate.doExecute(RestTemplate.java:633)
07-Dec-2018 06:03:53         at org.springframework.web.client.RestTemplate.execute(RestTemplate.java:595)
07-Dec-2018 06:03:53         at org.springframework.web.client.RestTemplate.getForObject(RestTemplate.java:303)
07-Dec-2018 06:03:53         at org.springframework.cloud.dataflow.rest.client.DataFlowTemplate.<init>(DataFlowTemplate.java:168)
07-Dec-2018 06:03:53         at org.springframework.cloud.dataflow.rest.client.DataFlowTemplate.<init>(DataFlowTemplate.java:150)
07-Dec-2018 06:03:53         at org.springframework.cloud.dataflow.acceptance.test.AbstractStreamTests.afterPropertiesSet(AbstractStreamTests.java:126)
07-Dec-2018 06:03:53         at org.springframework.beans.factory.support.AbstractAutowireCapableBeanFactory.invokeInitMethods(AbstractAutowireCapableBeanFactory.java:1642)
07-Dec-2018 06:03:53         at org.springframework.beans.factory.support.AbstractAutowireCapableBeanFactory.initializeBean(AbstractAutowireCapableBeanFactory.java:1579)
07-Dec-2018 06:03:53         ... 27 common frames omitted
07-Dec-2018 06:03:53 Caused by: java.net.ConnectException: Connection refused (Connection refused)
07-Dec-2018 06:03:53         at java.net.PlainSocketImpl.socketConnect(Native Method)
07-Dec-2018 06:03:53         at java.net.AbstractPlainSocketImpl.doConnect(AbstractPlainSocketImpl.java:350)
07-Dec-2018 06:03:53         at java.net.AbstractPlainSocketImpl.connectToAddress(AbstractPlainSocketImpl.java:206)
07-Dec-2018 06:03:53         at java.net.AbstractPlainSocketImpl.connect(AbstractPlainSocketImpl.java:188)
07-Dec-2018 06:03:53         at java.net.SocksSocketImpl.connect(SocksSocketImpl.java:392)
07-Dec-2018 06:03:53         at java.net.Socket.connect(Socket.java:589)
07-Dec-2018 06:03:53         at java.net.Socket.connect(Socket.java:538)
07-Dec-2018 06:03:53         at sun.net.NetworkClient.doConnect(NetworkClient.java:180)
07-Dec-2018 06:03:53         at sun.net.www.http.HttpClient.openServer(HttpClient.java:463)
07-Dec-2018 06:03:53         at sun.net.www.http.HttpClient.openServer(HttpClient.java:558)
07-Dec-2018 06:03:53         at sun.net.www.http.HttpClient.<init>(HttpClient.java:242)
07-Dec-2018 06:03:53         at sun.net.www.http.HttpClient.New(HttpClient.java:339)
07-Dec-2018 06:03:53         at sun.net.www.http.HttpClient.New(HttpClient.java:357)
07-Dec-2018 06:03:53         at sun.net.www.protocol.http.HttpURLConnection.getNewHttpClient(HttpURLConnection.java:1202)
07-Dec-2018 06:03:53         at sun.net.www.protocol.http.HttpURLConnection.plainConnect0(HttpURLConnection.java:1138)
07-Dec-2018 06:03:53         at sun.net.www.protocol.http.HttpURLConnection.plainConnect(HttpURLConnection.java:1032)
07-Dec-2018 06:03:53         at sun.net.www.protocol.http.HttpURLConnection.connect(HttpURLConnection.java:966)
07-Dec-2018 06:03:53         at org.springframework.http.client.SimpleBufferingClientHttpRequest.executeInternal(SimpleBufferingClientHttpRequest.java:78)
07-Dec-2018 06:03:53         at org.springframework.http.client.AbstractBufferingClientHttpRequest.executeInternal(AbstractBufferingClientHttpRequest.java:48)
07-Dec-2018 06:03:53         at org.springframework.http.client.AbstractClientHttpRequest.execute(AbstractClientHttpRequest.java:53)
07-Dec-2018 06:03:53         at org.springframework.web.client.RestTemplate.doExecute(RestTemplate.java:619)
07-Dec-2018 06:03:53         ... 34 common frames omitted
07-Dec-2018 06:03:53
07-Dec-2018 06:03:53
07-Dec-2018 06:03:53
07-Dec-2018 06:03:53
07-Dec-2018 06:03:53 =========================
07-Dec-2018 06:03:53 AUTO-CONFIGURATION REPORT
07-Dec-2018 06:03:53 =========================
07-Dec-2018 06:03:53
07-Dec-2018 06:03:53
07-Dec-2018 06:03:53 Positive matches:
07-Dec-2018 06:03:53 -----------------
07-Dec-2018 06:03:53
07-Dec-2018 06:03:53    RedisAutoConfiguration matched
07-Dec-2018 06:03:53       - @ConditionalOnClass found required classes 'org.springframework.data.redis.connection.jedis.JedisConnection', 'org.springframework.data.redis.core.RedisOperations', 'redis.clients.jedis.Jedis' (OnClassCondition)
07-Dec-2018 06:03:53
07-Dec-2018 06:03:53    RedisAutoConfiguration.RedisConfiguration#redisTemplate matched
07-Dec-2018 06:03:53       - @ConditionalOnMissingBean (names: redisTemplate; SearchStrategy: all) did not find any beans (OnBeanCondition)
07-Dec-2018 06:03:53
07-Dec-2018 06:03:53    RedisAutoConfiguration.RedisConfiguration#stringRedisTemplate matched
07-Dec-2018 06:03:53       - @ConditionalOnMissingBean (types: org.springframework.data.redis.core.StringRedisTemplate; SearchStrategy: all) did not find any beans (OnBeanCondition)
07-Dec-2018 06:03:53
07-Dec-2018 06:03:53    RedisAutoConfiguration.RedisConnectionConfiguration matched
07-Dec-2018 06:03:53       - @ConditionalOnClass found required class 'org.apache.commons.pool2.impl.GenericObjectPool' (OnClassCondition)
07-Dec-2018 06:03:53
07-Dec-2018 06:03:53    RedisAutoConfiguration.RedisConnectionConfiguration#redisConnectionFactory matched
07-Dec-2018 06:03:53       - @ConditionalOnMissingBean (types: org.springframework.data.redis.connection.RedisConnectionFactory; SearchStrategy: all) did not find any beans (OnBeanCondition)
07-Dec-2018 06:03:53
07-Dec-2018 06:03:53
07-Dec-2018 06:03:53 Negative matches:
07-Dec-2018 06:03:53 -----------------
07-Dec-2018 06:03:53
07-Dec-2018 06:03:53
07-Dec-2018 06:03:53 Exclusions:
07-Dec-2018 06:03:53 -----------
07-Dec-2018 06:03:53
07-Dec-2018 06:03:53     None
07-Dec-2018 06:03:53
07-Dec-2018 06:03:53
07-Dec-2018 06:03:53 Unconditional classes:
07-Dec-2018 06:03:53 ----------------------
07-Dec-2018 06:03:53
07-Dec-2018 06:03:53     None
07-Dec-2018 06:03:53
07-Dec-2018 06:03:53
07-Dec-2018 06:03:53
07-Dec-2018 06:03:53 2018-12-07 06:03:53.094 ERROR 19937 --- [           main] o.s.test.context.TestContextManager      : Caught exception while allowing TestExecutionListener [org.springframework.boot.test.autoconfigure.SpringBootDependencyInjectionTestExecutionListener@3a6045c6] to prepare test instance [org.springframework.cloud.dataflow.acceptance.test.NamedChannelTests@3eb292cd]
07-Dec-2018 06:03:53
07-Dec-2018 06:03:53 org.springframework.beans.factory.BeanCreationException: Error creating bean with name 'org.springframework.cloud.dataflow.acceptance.test.NamedChannelTests': Invocation of init method failed; nested exception is org.springframework.web.client.ResourceAccessException: I/O error on GET request for "http://localhost:9393": Connection refused (Connection refused); nested exception is java.net.ConnectException: Connection refused (Connection refused)
07-Dec-2018 06:03:53         at org.springframework.beans.factory.support.AbstractAutowireCapableBeanFactory.initializeBean(AbstractAutowireCapableBeanFactory.java:1583)
07-Dec-2018 06:03:53         at org.springframework.beans.factory.support.AbstractAutowireCapableBeanFactory.initializeBean(AbstractAutowireCapableBeanFactory.java:399)
07-Dec-2018 06:03:53         at org.springframework.test.context.support.DependencyInjectionTestExecutionListener.injectDependencies(DependencyInjectionTestExecutionListener.java:119)
07-Dec-2018 06:03:53         at org.springframework.test.context.support.DependencyInjectionTestExecutionListener.prepareTestInstance(DependencyInjectionTestExecutionListener.java:83)
07-Dec-2018 06:03:53         at org.springframework.boot.test.autoconfigure.SpringBootDependencyInjectionTestExecutionListener.prepareTestInstance(SpringBootDependencyInjectionTestExecutionListener.java:44)
07-Dec-2018 06:03:53         at org.springframework.test.context.TestContextManager.prepareTestInstance(TestContextManager.java:230)
07-Dec-2018 06:03:53         at org.springframework.test.context.junit4.SpringJUnit4ClassRunner.createTest(SpringJUnit4ClassRunner.java:228)
07-Dec-2018 06:03:53         at org.springframework.test.context.junit4.SpringJUnit4ClassRunner$1.runReflectiveCall(SpringJUnit4ClassRunner.java:287)
07-Dec-2018 06:03:53         at org.junit.internal.runners.model.ReflectiveCallable.run(ReflectiveCallable.java:12)
07-Dec-2018 06:03:53         at org.springframework.test.context.junit4.SpringJUnit4ClassRunner.methodBlock(SpringJUnit4ClassRunner.java:289)
07-Dec-2018 06:03:53         at org.springframework.test.context.junit4.SpringJUnit4ClassRunner.runChild(SpringJUnit4ClassRunner.java:247)
07-Dec-2018 06:03:53         at org.springframework.test.context.junit4.SpringJUnit4ClassRunner.runChild(SpringJUnit4ClassRunner.java:94)
07-Dec-2018 06:03:53         at org.junit.runners.ParentRunner$3.run(ParentRunner.java:290)
07-Dec-2018 06:03:53         at org.junit.runners.ParentRunner$1.schedule(ParentRunner.java:71)
07-Dec-2018 06:03:53         at org.junit.runners.ParentRunner.runChildren(ParentRunner.java:288)
07-Dec-2018 06:03:53         at org.junit.runners.ParentRunner.access$000(ParentRunner.java:58)
07-Dec-2018 06:03:53         at org.junit.runners.ParentRunner$2.evaluate(ParentRunner.java:268)
07-Dec-2018 06:03:53         at org.springframework.test.context.junit4.statements.RunBeforeTestClassCallbacks.evaluate(RunBeforeTestClassCallbacks.java:61)
07-Dec-2018 06:03:53         at org.springframework.test.context.junit4.statements.RunAfterTestClassCallbacks.evaluate(RunAfterTestClassCallbacks.java:70)
07-Dec-2018 06:03:53         at org.junit.runners.ParentRunner.run(ParentRunner.java:363)
07-Dec-2018 06:03:53         at org.springframework.test.context.junit4.SpringJUnit4ClassRunner.run(SpringJUnit4ClassRunner.java:191)
07-Dec-2018 06:03:53         at org.apache.maven.surefire.junit4.JUnit4Provider.execute(JUnit4Provider.java:283)
07-Dec-2018 06:03:53         at org.apache.maven.surefire.junit4.JUnit4Provider.executeWithRerun(JUnit4Provider.java:173)
07-Dec-2018 06:03:53         at org.apache.maven.surefire.junit4.JUnit4Provider.executeTestSet(JUnit4Provider.java:153)
07-Dec-2018 06:03:53         at org.apache.maven.surefire.junit4.JUnit4Provider.invoke(JUnit4Provider.java:128)
07-Dec-2018 06:03:53         at org.apache.maven.surefire.booter.ForkedBooter.invokeProviderInSameClassLoader(ForkedBooter.java:203)
07-Dec-2018 06:03:53         at org.apache.maven.surefire.booter.ForkedBooter.runSuitesInProcess(ForkedBooter.java:155)
07-Dec-2018 06:03:53         at org.apache.maven.surefire.booter.ForkedBooter.main(ForkedBooter.java:103)
07-Dec-2018 06:03:53 Caused by: org.springframework.web.client.ResourceAccessException: I/O error on GET request for "http://localhost:9393": Connection refused (Connection refused); nested exception is java.net.ConnectException: Connection refused (Connection refused)
07-Dec-2018 06:03:53         at org.springframework.web.client.RestTemplate.doExecute(RestTemplate.java:633)
07-Dec-2018 06:03:53         at org.springframework.web.client.RestTemplate.execute(RestTemplate.java:595)
07-Dec-2018 06:03:53         at org.springframework.web.client.RestTemplate.getForObject(RestTemplate.java:303)
07-Dec-2018 06:03:53         at org.springframework.cloud.dataflow.rest.client.DataFlowTemplate.<init>(DataFlowTemplate.java:168)
07-Dec-2018 06:03:53         at org.springframework.cloud.dataflow.rest.client.DataFlowTemplate.<init>(DataFlowTemplate.java:150)
07-Dec-2018 06:03:53         at org.springframework.cloud.dataflow.acceptance.test.AbstractStreamTests.afterPropertiesSet(AbstractStreamTests.java:126)
07-Dec-2018 06:03:53         at org.springframework.beans.factory.support.AbstractAutowireCapableBeanFactory.invokeInitMethods(AbstractAutowireCapableBeanFactory.java:1642)
07-Dec-2018 06:03:53         at org.springframework.beans.factory.support.AbstractAutowireCapableBeanFactory.initializeBean(AbstractAutowireCapableBeanFactory.java:1579)
07-Dec-2018 06:03:53         ... 27 common frames omitted
07-Dec-2018 06:03:53 Caused by: java.net.ConnectException: Connection refused (Connection refused)
07-Dec-2018 06:03:53         at java.net.PlainSocketImpl.socketConnect(Native Method)
07-Dec-2018 06:03:53         at java.net.AbstractPlainSocketImpl.doConnect(AbstractPlainSocketImpl.java:350)
07-Dec-2018 06:03:53         at java.net.AbstractPlainSocketImpl.connectToAddress(AbstractPlainSocketImpl.java:206)
07-Dec-2018 06:03:53         at java.net.AbstractPlainSocketImpl.connect(AbstractPlainSocketImpl.java:188)
07-Dec-2018 06:03:53         at java.net.SocksSocketImpl.connect(SocksSocketImpl.java:392)
07-Dec-2018 06:03:53         at java.net.Socket.connect(Socket.java:589)
07-Dec-2018 06:03:53         at java.net.Socket.connect(Socket.java:538)
07-Dec-2018 06:03:53         at sun.net.NetworkClient.doConnect(NetworkClient.java:180)
07-Dec-2018 06:03:53         at sun.net.www.http.HttpClient.openServer(HttpClient.java:463)
07-Dec-2018 06:03:53         at sun.net.www.http.HttpClient.openServer(HttpClient.java:558)
07-Dec-2018 06:03:53         at sun.net.www.http.HttpClient.<init>(HttpClient.java:242)
07-Dec-2018 06:03:53         at sun.net.www.http.HttpClient.New(HttpClient.java:339)
07-Dec-2018 06:03:53         at sun.net.www.http.HttpClient.New(HttpClient.java:357)
07-Dec-2018 06:03:53         at sun.net.www.protocol.http.HttpURLConnection.getNewHttpClient(HttpURLConnection.java:1202)
07-Dec-2018 06:03:53         at sun.net.www.protocol.http.HttpURLConnection.plainConnect0(HttpURLConnection.java:1138)
07-Dec-2018 06:03:53         at sun.net.www.protocol.http.HttpURLConnection.plainConnect(HttpURLConnection.java:1032)
07-Dec-2018 06:03:53         at sun.net.www.protocol.http.HttpURLConnection.connect(HttpURLConnection.java:966)
07-Dec-2018 06:03:53         at org.springframework.http.client.SimpleBufferingClientHttpRequest.executeInternal(SimpleBufferingClientHttpRequest.java:78)
07-Dec-2018 06:03:53         at org.springframework.http.client.AbstractBufferingClientHttpRequest.executeInternal(AbstractBufferingClientHttpRequest.java:48)
07-Dec-2018 06:03:53         at org.springframework.http.client.AbstractClientHttpRequest.execute(AbstractClientHttpRequest.java:53)
07-Dec-2018 06:03:53         at org.springframework.web.client.RestTemplate.doExecute(RestTemplate.java:619)
07-Dec-2018 06:03:53         ... 34 common frames omitted
07-Dec-2018 06:03:53
07-Dec-2018 06:03:53
07-Dec-2018 06:03:53
07-Dec-2018 06:03:53
07-Dec-2018 06:03:53 =========================
07-Dec-2018 06:03:53 AUTO-CONFIGURATION REPORT
07-Dec-2018 06:03:53 =========================
07-Dec-2018 06:03:53
07-Dec-2018 06:03:53
07-Dec-2018 06:03:53 Positive matches:
07-Dec-2018 06:03:53 -----------------
07-Dec-2018 06:03:53
07-Dec-2018 06:03:53    RedisAutoConfiguration matched
07-Dec-2018 06:03:53       - @ConditionalOnClass found required classes 'org.springframework.data.redis.connection.jedis.JedisConnection', 'org.springframework.data.redis.core.RedisOperations', 'redis.clients.jedis.Jedis' (OnClassCondition)
07-Dec-2018 06:03:53
07-Dec-2018 06:03:53    RedisAutoConfiguration.RedisConfiguration#redisTemplate matched
07-Dec-2018 06:03:53       - @ConditionalOnMissingBean (names: redisTemplate; SearchStrategy: all) did not find any beans (OnBeanCondition)
07-Dec-2018 06:03:53
07-Dec-2018 06:03:53    RedisAutoConfiguration.RedisConfiguration#stringRedisTemplate matched
07-Dec-2018 06:03:53       - @ConditionalOnMissingBean (types: org.springframework.data.redis.core.StringRedisTemplate; SearchStrategy: all) did not find any beans (OnBeanCondition)
07-Dec-2018 06:03:53
07-Dec-2018 06:03:53    RedisAutoConfiguration.RedisConnectionConfiguration matched
07-Dec-2018 06:03:53       - @ConditionalOnClass found required class 'org.apache.commons.pool2.impl.GenericObjectPool' (OnClassCondition)
07-Dec-2018 06:03:53
07-Dec-2018 06:03:53    RedisAutoConfiguration.RedisConnectionConfiguration#redisConnectionFactory matched
07-Dec-2018 06:03:53       - @ConditionalOnMissingBean (types: org.springframework.data.redis.connection.RedisConnectionFactory; SearchStrategy: all) did not find any beans (OnBeanCondition)
07-Dec-2018 06:03:53
07-Dec-2018 06:03:53
07-Dec-2018 06:03:53 Negative matches:
07-Dec-2018 06:03:53 -----------------
07-Dec-2018 06:03:53
07-Dec-2018 06:03:53
07-Dec-2018 06:03:53 Exclusions:
07-Dec-2018 06:03:53 -----------
07-Dec-2018 06:03:53
07-Dec-2018 06:03:53     None
07-Dec-2018 06:03:53
07-Dec-2018 06:03:53
07-Dec-2018 06:03:53 Unconditional classes:
07-Dec-2018 06:03:53 ----------------------
07-Dec-2018 06:03:53
07-Dec-2018 06:03:53     None
07-Dec-2018 06:03:53
07-Dec-2018 06:03:53
07-Dec-2018 06:03:53
07-Dec-2018 06:03:53 2018-12-07 06:03:53.101 ERROR 19937 --- [           main] o.s.test.context.TestContextManager      : Caught exception while allowing TestExecutionListener [org.springframework.boot.test.autoconfigure.SpringBootDependencyInjectionTestExecutionListener@3a6045c6] to prepare test instance [org.springframework.cloud.dataflow.acceptance.test.NamedChannelTests@7fd987ef]
07-Dec-2018 06:03:53
07-Dec-2018 06:03:53 org.springframework.beans.factory.BeanCreationException: Error creating bean with name 'org.springframework.cloud.dataflow.acceptance.test.NamedChannelTests': Invocation of init method failed; nested exception is org.springframework.web.client.ResourceAccessException: I/O error on GET request for "http://localhost:9393": Connection refused (Connection refused); nested exception is java.net.ConnectException: Connection refused (Connection refused)
07-Dec-2018 06:03:53         at org.springframework.beans.factory.support.AbstractAutowireCapableBeanFactory.initializeBean(AbstractAutowireCapableBeanFactory.java:1583)
07-Dec-2018 06:03:53         at org.springframework.beans.factory.support.AbstractAutowireCapableBeanFactory.initializeBean(AbstractAutowireCapableBeanFactory.java:399)
07-Dec-2018 06:03:53         at org.springframework.test.context.support.DependencyInjectionTestExecutionListener.injectDependencies(DependencyInjectionTestExecutionListener.java:119)
07-Dec-2018 06:03:53         at org.springframework.test.context.support.DependencyInjectionTestExecutionListener.prepareTestInstance(DependencyInjectionTestExecutionListener.java:83)
07-Dec-2018 06:03:53         at org.springframework.boot.test.autoconfigure.SpringBootDependencyInjectionTestExecutionListener.prepareTestInstance(SpringBootDependencyInjectionTestExecutionListener.java:44)
07-Dec-2018 06:03:53         at org.springframework.test.context.TestContextManager.prepareTestInstance(TestContextManager.java:230)
07-Dec-2018 06:03:53         at org.springframework.test.context.junit4.SpringJUnit4ClassRunner.createTest(SpringJUnit4ClassRunner.java:228)
07-Dec-2018 06:03:53         at org.springframework.test.context.junit4.SpringJUnit4ClassRunner$1.runReflectiveCall(SpringJUnit4ClassRunner.java:287)
07-Dec-2018 06:03:53         at org.junit.internal.runners.model.ReflectiveCallable.run(ReflectiveCallable.java:12)
07-Dec-2018 06:03:53         at org.springframework.test.context.junit4.SpringJUnit4ClassRunner.methodBlock(SpringJUnit4ClassRunner.java:289)
07-Dec-2018 06:03:53         at org.springframework.test.context.junit4.SpringJUnit4ClassRunner.runChild(SpringJUnit4ClassRunner.java:247)
07-Dec-2018 06:03:53         at org.springframework.test.context.junit4.SpringJUnit4ClassRunner.runChild(SpringJUnit4ClassRunner.java:94)
07-Dec-2018 06:03:53         at org.junit.runners.ParentRunner$3.run(ParentRunner.java:290)
07-Dec-2018 06:03:53         at org.junit.runners.ParentRunner$1.schedule(ParentRunner.java:71)
07-Dec-2018 06:03:53         at org.junit.runners.ParentRunner.runChildren(ParentRunner.java:288)
07-Dec-2018 06:03:53         at org.junit.runners.ParentRunner.access$000(ParentRunner.java:58)
07-Dec-2018 06:03:53         at org.junit.runners.ParentRunner$2.evaluate(ParentRunner.java:268)
07-Dec-2018 06:03:53         at org.springframework.test.context.junit4.statements.RunBeforeTestClassCallbacks.evaluate(RunBeforeTestClassCallbacks.java:61)
07-Dec-2018 06:03:53         at org.springframework.test.context.junit4.statements.RunAfterTestClassCallbacks.evaluate(RunAfterTestClassCallbacks.java:70)
07-Dec-2018 06:03:53         at org.junit.runners.ParentRunner.run(ParentRunner.java:363)
07-Dec-2018 06:03:53         at org.springframework.test.context.junit4.SpringJUnit4ClassRunner.run(SpringJUnit4ClassRunner.java:191)
07-Dec-2018 06:03:53         at org.apache.maven.surefire.junit4.JUnit4Provider.execute(JUnit4Provider.java:283)
07-Dec-2018 06:03:53         at org.apache.maven.surefire.junit4.JUnit4Provider.executeWithRerun(JUnit4Provider.java:173)
07-Dec-2018 06:03:53         at org.apache.maven.surefire.junit4.JUnit4Provider.executeTestSet(JUnit4Provider.java:153)
07-Dec-2018 06:03:53         at org.apache.maven.surefire.junit4.JUnit4Provider.invoke(JUnit4Provider.java:128)
07-Dec-2018 06:03:53         at org.apache.maven.surefire.booter.ForkedBooter.invokeProviderInSameClassLoader(ForkedBooter.java:203)
07-Dec-2018 06:03:53         at org.apache.maven.surefire.booter.ForkedBooter.runSuitesInProcess(ForkedBooter.java:155)
07-Dec-2018 06:03:53         at org.apache.maven.surefire.booter.ForkedBooter.main(ForkedBooter.java:103)
07-Dec-2018 06:03:53 Caused by: org.springframework.web.client.ResourceAccessException: I/O error on GET request for "http://localhost:9393": Connection refused (Connection refused); nested exception is java.net.ConnectException: Connection refused (Connection refused)
07-Dec-2018 06:03:53         at org.springframework.web.client.RestTemplate.doExecute(RestTemplate.java:633)
07-Dec-2018 06:03:53         at org.springframework.web.client.RestTemplate.execute(RestTemplate.java:595)
07-Dec-2018 06:03:53         at org.springframework.web.client.RestTemplate.getForObject(RestTemplate.java:303)
07-Dec-2018 06:03:53         at org.springframework.cloud.dataflow.rest.client.DataFlowTemplate.<init>(DataFlowTemplate.java:168)
07-Dec-2018 06:03:53         at org.springframework.cloud.dataflow.rest.client.DataFlowTemplate.<init>(DataFlowTemplate.java:150)
07-Dec-2018 06:03:53         at org.springframework.cloud.dataflow.acceptance.test.AbstractStreamTests.afterPropertiesSet(AbstractStreamTests.java:126)
07-Dec-2018 06:03:53         at org.springframework.beans.factory.support.AbstractAutowireCapableBeanFactory.invokeInitMethods(AbstractAutowireCapableBeanFactory.java:1642)
07-Dec-2018 06:03:53         at org.springframework.beans.factory.support.AbstractAutowireCapableBeanFactory.initializeBean(AbstractAutowireCapableBeanFactory.java:1579)
07-Dec-2018 06:03:53         ... 27 common frames omitted
07-Dec-2018 06:03:53 Caused by: java.net.ConnectException: Connection refused (Connection refused)
07-Dec-2018 06:03:53         at java.net.PlainSocketImpl.socketConnect(Native Method)
07-Dec-2018 06:03:53         at java.net.AbstractPlainSocketImpl.doConnect(AbstractPlainSocketImpl.java:350)
07-Dec-2018 06:03:53         at java.net.AbstractPlainSocketImpl.connectToAddress(AbstractPlainSocketImpl.java:206)
07-Dec-2018 06:03:53         at java.net.AbstractPlainSocketImpl.connect(AbstractPlainSocketImpl.java:188)
07-Dec-2018 06:03:53         at java.net.SocksSocketImpl.connect(SocksSocketImpl.java:392)
07-Dec-2018 06:03:53         at java.net.Socket.connect(Socket.java:589)
07-Dec-2018 06:03:53         at java.net.Socket.connect(Socket.java:538)
07-Dec-2018 06:03:53         at sun.net.NetworkClient.doConnect(NetworkClient.java:180)
07-Dec-2018 06:03:53         at sun.net.www.http.HttpClient.openServer(HttpClient.java:463)
07-Dec-2018 06:03:53         at sun.net.www.http.HttpClient.openServer(HttpClient.java:558)
07-Dec-2018 06:03:53         at sun.net.www.http.HttpClient.<init>(HttpClient.java:242)
07-Dec-2018 06:03:53         at sun.net.www.http.HttpClient.New(HttpClient.java:339)
07-Dec-2018 06:03:53         at sun.net.www.http.HttpClient.New(HttpClient.java:357)
07-Dec-2018 06:03:53         at sun.net.www.protocol.http.HttpURLConnection.getNewHttpClient(HttpURLConnection.java:1202)
07-Dec-2018 06:03:53         at sun.net.www.protocol.http.HttpURLConnection.plainConnect0(HttpURLConnection.java:1138)
07-Dec-2018 06:03:53         at sun.net.www.protocol.http.HttpURLConnection.plainConnect(HttpURLConnection.java:1032)
07-Dec-2018 06:03:53         at sun.net.www.protocol.http.HttpURLConnection.connect(HttpURLConnection.java:966)
07-Dec-2018 06:03:53         at org.springframework.http.client.SimpleBufferingClientHttpRequest.executeInternal(SimpleBufferingClientHttpRequest.java:78)
07-Dec-2018 06:03:53         at org.springframework.http.client.AbstractBufferingClientHttpRequest.executeInternal(AbstractBufferingClientHttpRequest.java:48)
07-Dec-2018 06:03:53         at org.springframework.http.client.AbstractClientHttpRequest.execute(AbstractClientHttpRequest.java:53)
07-Dec-2018 06:03:53         at org.springframework.web.client.RestTemplate.doExecute(RestTemplate.java:619)
07-Dec-2018 06:03:53         ... 34 common frames omitted
07-Dec-2018 06:03:53
07-Dec-2018 06:03:53 Tests run: 4, Failures: 0, Errors: 4, Skipped: 0, Time elapsed: 0.024 sec <<< FAILURE! - in org.springframework.cloud.dataflow.acceptance.test.NamedChannelTests
07-Dec-2018 06:03:53 testDestination(org.springframework.cloud.dataflow.acceptance.test.NamedChannelTests)  Time elapsed: 0 sec  <<< ERROR!
07-Dec-2018 06:03:53 org.springframework.beans.factory.BeanCreationException: Error creating bean with name 'org.springframework.cloud.dataflow.acceptance.test.NamedChannelTests': Invocation of init method failed; nested exception is org.springframework.web.client.ResourceAccessException: I/O error on GET request for "http://localhost:9393": Connection refused (Connection refused); nested exception is java.net.ConnectException: Connection refused (Connection refused)
07-Dec-2018 06:03:53         at org.springframework.beans.factory.support.AbstractAutowireCapableBeanFactory.initializeBean(AbstractAutowireCapableBeanFactory.java:1583)
07-Dec-2018 06:03:53         at org.springframework.beans.factory.support.AbstractAutowireCapableBeanFactory.initializeBean(AbstractAutowireCapableBeanFactory.java:399)
07-Dec-2018 06:03:53         at org.springframework.test.context.support.DependencyInjectionTestExecutionListener.injectDependencies(DependencyInjectionTestExecutionListener.java:119)
07-Dec-2018 06:03:53         at org.springframework.test.context.support.DependencyInjectionTestExecutionListener.prepareTestInstance(DependencyInjectionTestExecutionListener.java:83)
07-Dec-2018 06:03:53         at org.springframework.boot.test.autoconfigure.SpringBootDependencyInjectionTestExecutionListener.prepareTestInstance(SpringBootDependencyInjectionTestExecutionListener.java:44)
07-Dec-2018 06:03:53         at org.springframework.test.context.TestContextManager.prepareTestInstance(TestContextManager.java:230)
07-Dec-2018 06:03:53         at org.springframework.test.context.junit4.SpringJUnit4ClassRunner.createTest(SpringJUnit4ClassRunner.java:228)
07-Dec-2018 06:03:53         at org.springframework.test.context.junit4.SpringJUnit4ClassRunner$1.runReflectiveCall(SpringJUnit4ClassRunner.java:287)
07-Dec-2018 06:03:53         at org.junit.internal.runners.model.ReflectiveCallable.run(ReflectiveCallable.java:12)
07-Dec-2018 06:03:53         at org.springframework.test.context.junit4.SpringJUnit4ClassRunner.methodBlock(SpringJUnit4ClassRunner.java:289)
07-Dec-2018 06:03:53         at org.springframework.test.context.junit4.SpringJUnit4ClassRunner.runChild(SpringJUnit4ClassRunner.java:247)
07-Dec-2018 06:03:53         at org.springframework.test.context.junit4.SpringJUnit4ClassRunner.runChild(SpringJUnit4ClassRunner.java:94)
07-Dec-2018 06:03:53         at org.junit.runners.ParentRunner$3.run(ParentRunner.java:290)
07-Dec-2018 06:03:53         at org.junit.runners.ParentRunner$1.schedule(ParentRunner.java:71)
07-Dec-2018 06:03:53         at org.junit.runners.ParentRunner.runChildren(ParentRunner.java:288)
07-Dec-2018 06:03:53         at org.junit.runners.ParentRunner.access$000(ParentRunner.java:58)
07-Dec-2018 06:03:53         at org.junit.runners.ParentRunner$2.evaluate(ParentRunner.java:268)
07-Dec-2018 06:03:53         at org.springframework.test.context.junit4.statements.RunBeforeTestClassCallbacks.evaluate(RunBeforeTestClassCallbacks.java:61)
07-Dec-2018 06:03:53         at org.springframework.test.context.junit4.statements.RunAfterTestClassCallbacks.evaluate(RunAfterTestClassCallbacks.java:70)
07-Dec-2018 06:03:53         at org.junit.runners.ParentRunner.run(ParentRunner.java:363)
07-Dec-2018 06:03:53         at org.springframework.test.context.junit4.SpringJUnit4ClassRunner.run(SpringJUnit4ClassRunner.java:191)
07-Dec-2018 06:03:53         at org.apache.maven.surefire.junit4.JUnit4Provider.execute(JUnit4Provider.java:283)
07-Dec-2018 06:03:53         at org.apache.maven.surefire.junit4.JUnit4Provider.executeWithRerun(JUnit4Provider.java:173)
07-Dec-2018 06:03:53         at org.apache.maven.surefire.junit4.JUnit4Provider.executeTestSet(JUnit4Provider.java:153)
07-Dec-2018 06:03:53         at org.apache.maven.surefire.junit4.JUnit4Provider.invoke(JUnit4Provider.java:128)
07-Dec-2018 06:03:53         at org.apache.maven.surefire.booter.ForkedBooter.invokeProviderInSameClassLoader(ForkedBooter.java:203)
07-Dec-2018 06:03:53         at org.apache.maven.surefire.booter.ForkedBooter.runSuitesInProcess(ForkedBooter.java:155)
07-Dec-2018 06:03:53         at org.apache.maven.surefire.booter.ForkedBooter.main(ForkedBooter.java:103)
07-Dec-2018 06:03:53 Caused by: org.springframework.web.client.ResourceAccessException: I/O error on GET request for "http://localhost:9393": Connection refused (Connection refused); nested exception is java.net.ConnectException: Connection refused (Connection refused)
07-Dec-2018 06:03:53         at org.springframework.web.client.RestTemplate.doExecute(RestTemplate.java:633)
07-Dec-2018 06:03:53         at org.springframework.web.client.RestTemplate.execute(RestTemplate.java:595)
07-Dec-2018 06:03:53         at org.springframework.web.client.RestTemplate.getForObject(RestTemplate.java:303)
07-Dec-2018 06:03:53         at org.springframework.cloud.dataflow.rest.client.DataFlowTemplate.<init>(DataFlowTemplate.java:168)
07-Dec-2018 06:03:53         at org.springframework.cloud.dataflow.rest.client.DataFlowTemplate.<init>(DataFlowTemplate.java:150)
07-Dec-2018 06:03:53         at org.springframework.cloud.dataflow.acceptance.test.AbstractStreamTests.afterPropertiesSet(AbstractStreamTests.java:126)
07-Dec-2018 06:03:53         at org.springframework.beans.factory.support.AbstractAutowireCapableBeanFactory.invokeInitMethods(AbstractAutowireCapableBeanFactory.java:1642)
07-Dec-2018 06:03:53         at org.springframework.beans.factory.support.AbstractAutowireCapableBeanFactory.initializeBean(AbstractAutowireCapableBeanFactory.java:1579)
07-Dec-2018 06:03:53         at org.springframework.beans.factory.support.AbstractAutowireCapableBeanFactory.initializeBean(AbstractAutowireCapableBeanFactory.java:399)
07-Dec-2018 06:03:53         at org.springframework.test.context.support.DependencyInjectionTestExecutionListener.injectDependencies(DependencyInjectionTestExecutionListener.java:119)
07-Dec-2018 06:03:53         at org.springframework.test.context.support.DependencyInjectionTestExecutionListener.prepareTestInstance(DependencyInjectionTestExecutionListener.java:83)
07-Dec-2018 06:03:53         at org.springframework.boot.test.autoconfigure.SpringBootDependencyInjectionTestExecutionListener.prepareTestInstance(SpringBootDependencyInjectionTestExecutionListener.java:44)
07-Dec-2018 06:03:53         at org.springframework.test.context.TestContextManager.prepareTestInstance(TestContextManager.java:230)
07-Dec-2018 06:03:53         at org.springframework.test.context.junit4.SpringJUnit4ClassRunner.createTest(SpringJUnit4ClassRunner.java:228)
07-Dec-2018 06:03:53         at org.springframework.test.context.junit4.SpringJUnit4ClassRunner$1.runReflectiveCall(SpringJUnit4ClassRunner.java:287)
07-Dec-2018 06:03:53         at org.junit.internal.runners.model.ReflectiveCallable.run(ReflectiveCallable.java:12)
07-Dec-2018 06:03:53         at org.springframework.test.context.junit4.SpringJUnit4ClassRunner.methodBlock(SpringJUnit4ClassRunner.java:289)
07-Dec-2018 06:03:53         at org.springframework.test.context.junit4.SpringJUnit4ClassRunner.runChild(SpringJUnit4ClassRunner.java:247)
07-Dec-2018 06:03:53         at org.springframework.test.context.junit4.SpringJUnit4ClassRunner.runChild(SpringJUnit4ClassRunner.java:94)
07-Dec-2018 06:03:53         at org.junit.runners.ParentRunner$3.run(ParentRunner.java:290)
07-Dec-2018 06:03:53         at org.junit.runners.ParentRunner$1.schedule(ParentRunner.java:71)
07-Dec-2018 06:03:53         at org.junit.runners.ParentRunner.runChildren(ParentRunner.java:288)
07-Dec-2018 06:03:53         at org.junit.runners.ParentRunner.access$000(ParentRunner.java:58)
07-Dec-2018 06:03:53         at org.junit.runners.ParentRunner$2.evaluate(ParentRunner.java:268)
07-Dec-2018 06:03:53         at org.springframework.test.context.junit4.statements.RunBeforeTestClassCallbacks.evaluate(RunBeforeTestClassCallbacks.java:61)
07-Dec-2018 06:03:53         at org.springframework.test.context.junit4.statements.RunAfterTestClassCallbacks.evaluate(RunAfterTestClassCallbacks.java:70)
07-Dec-2018 06:03:53         at org.junit.runners.ParentRunner.run(ParentRunner.java:363)
07-Dec-2018 06:03:53         at org.springframework.test.context.junit4.SpringJUnit4ClassRunner.run(SpringJUnit4ClassRunner.java:191)
07-Dec-2018 06:03:53         at org.apache.maven.surefire.junit4.JUnit4Provider.execute(JUnit4Provider.java:283)
07-Dec-2018 06:03:53         at org.apache.maven.surefire.junit4.JUnit4Provider.executeWithRerun(JUnit4Provider.java:173)
07-Dec-2018 06:03:53         at org.apache.maven.surefire.junit4.JUnit4Provider.executeTestSet(JUnit4Provider.java:153)
07-Dec-2018 06:03:53         at org.apache.maven.surefire.junit4.JUnit4Provider.invoke(JUnit4Provider.java:128)
07-Dec-2018 06:03:53         at org.apache.maven.surefire.booter.ForkedBooter.invokeProviderInSameClassLoader(ForkedBooter.java:203)
07-Dec-2018 06:03:53         at org.apache.maven.surefire.booter.ForkedBooter.runSuitesInProcess(ForkedBooter.java:155)
07-Dec-2018 06:03:53         at org.apache.maven.surefire.booter.ForkedBooter.main(ForkedBooter.java:103)
07-Dec-2018 06:03:53 Caused by: java.net.ConnectException: Connection refused (Connection refused)
07-Dec-2018 06:03:53         at java.net.PlainSocketImpl.socketConnect(Native Method)
07-Dec-2018 06:03:53         at java.net.AbstractPlainSocketImpl.doConnect(AbstractPlainSocketImpl.java:350)
07-Dec-2018 06:03:53         at java.net.AbstractPlainSocketImpl.connectToAddress(AbstractPlainSocketImpl.java:206)
07-Dec-2018 06:03:53         at java.net.AbstractPlainSocketImpl.connect(AbstractPlainSocketImpl.java:188)
07-Dec-2018 06:03:53         at java.net.SocksSocketImpl.connect(SocksSocketImpl.java:392)
07-Dec-2018 06:03:53         at java.net.Socket.connect(Socket.java:589)
07-Dec-2018 06:03:53         at java.net.Socket.connect(Socket.java:538)
07-Dec-2018 06:03:53         at sun.net.NetworkClient.doConnect(NetworkClient.java:180)
07-Dec-2018 06:03:53         at sun.net.www.http.HttpClient.openServer(HttpClient.java:463)
07-Dec-2018 06:03:53         at sun.net.www.http.HttpClient.openServer(HttpClient.java:558)
07-Dec-2018 06:03:53         at sun.net.www.http.HttpClient.<init>(HttpClient.java:242)
07-Dec-2018 06:03:53         at sun.net.www.http.HttpClient.New(HttpClient.java:339)
07-Dec-2018 06:03:53         at sun.net.www.http.HttpClient.New(HttpClient.java:357)
07-Dec-2018 06:03:53         at sun.net.www.protocol.http.HttpURLConnection.getNewHttpClient(HttpURLConnection.java:1202)
07-Dec-2018 06:03:53         at sun.net.www.protocol.http.HttpURLConnection.plainConnect0(HttpURLConnection.java:1138)
07-Dec-2018 06:03:53         at sun.net.www.protocol.http.HttpURLConnection.plainConnect(HttpURLConnection.java:1032)
07-Dec-2018 06:03:53         at sun.net.www.protocol.http.HttpURLConnection.connect(HttpURLConnection.java:966)
07-Dec-2018 06:03:53         at org.springframework.http.client.SimpleBufferingClientHttpRequest.executeInternal(SimpleBufferingClientHttpRequest.java:78)
07-Dec-2018 06:03:53         at org.springframework.http.client.AbstractBufferingClientHttpRequest.executeInternal(AbstractBufferingClientHttpRequest.java:48)
07-Dec-2018 06:03:53         at org.springframework.http.client.AbstractClientHttpRequest.execute(AbstractClientHttpRequest.java:53)
07-Dec-2018 06:03:53         at org.springframework.web.client.RestTemplate.doExecute(RestTemplate.java:619)
07-Dec-2018 06:03:53         at org.springframework.web.client.RestTemplate.execute(RestTemplate.java:595)
07-Dec-2018 06:03:53         at org.springframework.web.client.RestTemplate.getForObject(RestTemplate.java:303)
07-Dec-2018 06:03:53         at org.springframework.cloud.dataflow.rest.client.DataFlowTemplate.<init>(DataFlowTemplate.java:168)
07-Dec-2018 06:03:53         at org.springframework.cloud.dataflow.rest.client.DataFlowTemplate.<init>(DataFlowTemplate.java:150)
07-Dec-2018 06:03:53         at org.springframework.cloud.dataflow.acceptance.test.AbstractStreamTests.afterPropertiesSet(AbstractStreamTests.java:126)
07-Dec-2018 06:03:53         at org.springframework.beans.factory.support.AbstractAutowireCapableBeanFactory.invokeInitMethods(AbstractAutowireCapableBeanFactory.java:1642)
07-Dec-2018 06:03:53         at org.springframework.beans.factory.support.AbstractAutowireCapableBeanFactory.initializeBean(AbstractAutowireCapableBeanFactory.java:1579)
07-Dec-2018 06:03:53         at org.springframework.beans.factory.support.AbstractAutowireCapableBeanFactory.initializeBean(AbstractAutowireCapableBeanFactory.java:399)
07-Dec-2018 06:03:53         at org.springframework.test.context.support.DependencyInjectionTestExecutionListener.injectDependencies(DependencyInjectionTestExecutionListener.java:119)
07-Dec-2018 06:03:53         at org.springframework.test.context.support.DependencyInjectionTestExecutionListener.prepareTestInstance(DependencyInjectionTestExecutionListener.java:83)
07-Dec-2018 06:03:53         at org.springframework.boot.test.autoconfigure.SpringBootDependencyInjectionTestExecutionListener.prepareTestInstance(SpringBootDependencyInjectionTestExecutionListener.java:44)
07-Dec-2018 06:03:53         at org.springframework.test.context.TestContextManager.prepareTestInstance(TestContextManager.java:230)
07-Dec-2018 06:03:53         at org.springframework.test.context.junit4.SpringJUnit4ClassRunner.createTest(SpringJUnit4ClassRunner.java:228)
07-Dec-2018 06:03:53         at org.springframework.test.context.junit4.SpringJUnit4ClassRunner$1.runReflectiveCall(SpringJUnit4ClassRunner.java:287)
07-Dec-2018 06:03:53         at org.junit.internal.runners.model.ReflectiveCallable.run(ReflectiveCallable.java:12)
07-Dec-2018 06:03:53         at org.springframework.test.context.junit4.SpringJUnit4ClassRunner.methodBlock(SpringJUnit4ClassRunner.java:289)
07-Dec-2018 06:03:53         at org.springframework.test.context.junit4.SpringJUnit4ClassRunner.runChild(SpringJUnit4ClassRunner.java:247)
07-Dec-2018 06:03:53         at org.springframework.test.context.junit4.SpringJUnit4ClassRunner.runChild(SpringJUnit4ClassRunner.java:94)
07-Dec-2018 06:03:53         at org.junit.runners.ParentRunner$3.run(ParentRunner.java:290)
07-Dec-2018 06:03:53         at org.junit.runners.ParentRunner$1.schedule(ParentRunner.java:71)
07-Dec-2018 06:03:53         at org.junit.runners.ParentRunner.runChildren(ParentRunner.java:288)
07-Dec-2018 06:03:53         at org.junit.runners.ParentRunner.access$000(ParentRunner.java:58)
07-Dec-2018 06:03:53         at org.junit.runners.ParentRunner$2.evaluate(ParentRunner.java:268)
07-Dec-2018 06:03:53         at org.springframework.test.context.junit4.statements.RunBeforeTestClassCallbacks.evaluate(RunBeforeTestClassCallbacks.java:61)
07-Dec-2018 06:03:53         at org.springframework.test.context.junit4.statements.RunAfterTestClassCallbacks.evaluate(RunAfterTestClassCallbacks.java:70)
07-Dec-2018 06:03:53         at org.junit.runners.ParentRunner.run(ParentRunner.java:363)
07-Dec-2018 06:03:53         at org.springframework.test.context.junit4.SpringJUnit4ClassRunner.run(SpringJUnit4ClassRunner.java:191)
07-Dec-2018 06:03:53         at org.apache.maven.surefire.junit4.JUnit4Provider.execute(JUnit4Provider.java:283)
07-Dec-2018 06:03:53         at org.apache.maven.surefire.junit4.JUnit4Provider.executeWithRerun(JUnit4Provider.java:173)
07-Dec-2018 06:03:53         at org.apache.maven.surefire.junit4.JUnit4Provider.executeTestSet(JUnit4Provider.java:153)
07-Dec-2018 06:03:53         at org.apache.maven.surefire.junit4.JUnit4Provider.invoke(JUnit4Provider.java:128)
07-Dec-2018 06:03:53         at org.apache.maven.surefire.booter.ForkedBooter.invokeProviderInSameClassLoader(ForkedBooter.java:203)
07-Dec-2018 06:03:53         at org.apache.maven.surefire.booter.ForkedBooter.runSuitesInProcess(ForkedBooter.java:155)
07-Dec-2018 06:03:53         at org.apache.maven.surefire.booter.ForkedBooter.main(ForkedBooter.java:103)
07-Dec-2018 06:03:53
07-Dec-2018 06:03:53 testTap(org.springframework.cloud.dataflow.acceptance.test.NamedChannelTests)  Time elapsed: 0.001 sec  <<< ERROR!
07-Dec-2018 06:03:53 org.springframework.beans.factory.BeanCreationException: Error creating bean with name 'org.springframework.cloud.dataflow.acceptance.test.NamedChannelTests': Invocation of init method failed; nested exception is org.springframework.web.client.ResourceAccessException: I/O error on GET request for "http://localhost:9393": Connection refused (Connection refused); nested exception is java.net.ConnectException: Connection refused (Connection refused)
07-Dec-2018 06:03:53         at org.springframework.beans.factory.support.AbstractAutowireCapableBeanFactory.initializeBean(AbstractAutowireCapableBeanFactory.java:1583)
07-Dec-2018 06:03:53         at org.springframework.beans.factory.support.AbstractAutowireCapableBeanFactory.initializeBean(AbstractAutowireCapableBeanFactory.java:399)
07-Dec-2018 06:03:53         at org.springframework.test.context.support.DependencyInjectionTestExecutionListener.injectDependencies(DependencyInjectionTestExecutionListener.java:119)
07-Dec-2018 06:03:53         at org.springframework.test.context.support.DependencyInjectionTestExecutionListener.prepareTestInstance(DependencyInjectionTestExecutionListener.java:83)
07-Dec-2018 06:03:53         at org.springframework.boot.test.autoconfigure.SpringBootDependencyInjectionTestExecutionListener.prepareTestInstance(SpringBootDependencyInjectionTestExecutionListener.java:44)
07-Dec-2018 06:03:53         at org.springframework.test.context.TestContextManager.prepareTestInstance(TestContextManager.java:230)
07-Dec-2018 06:03:53         at org.springframework.test.context.junit4.SpringJUnit4ClassRunner.createTest(SpringJUnit4ClassRunner.java:228)
07-Dec-2018 06:03:53         at org.springframework.test.context.junit4.SpringJUnit4ClassRunner$1.runReflectiveCall(SpringJUnit4ClassRunner.java:287)
07-Dec-2018 06:03:53         at org.junit.internal.runners.model.ReflectiveCallable.run(ReflectiveCallable.java:12)
07-Dec-2018 06:03:53         at org.springframework.test.context.junit4.SpringJUnit4ClassRunner.methodBlock(SpringJUnit4ClassRunner.java:289)
07-Dec-2018 06:03:53         at org.springframework.test.context.junit4.SpringJUnit4ClassRunner.runChild(SpringJUnit4ClassRunner.java:247)
07-Dec-2018 06:03:53         at org.springframework.test.context.junit4.SpringJUnit4ClassRunner.runChild(SpringJUnit4ClassRunner.java:94)
07-Dec-2018 06:03:53         at org.junit.runners.ParentRunner$3.run(ParentRunner.java:290)
07-Dec-2018 06:03:53         at org.junit.runners.ParentRunner$1.schedule(ParentRunner.java:71)
07-Dec-2018 06:03:53         at org.junit.runners.ParentRunner.runChildren(ParentRunner.java:288)
07-Dec-2018 06:03:53         at org.junit.runners.ParentRunner.access$000(ParentRunner.java:58)
07-Dec-2018 06:03:53         at org.junit.runners.ParentRunner$2.evaluate(ParentRunner.java:268)
07-Dec-2018 06:03:53         at org.springframework.test.context.junit4.statements.RunBeforeTestClassCallbacks.evaluate(RunBeforeTestClassCallbacks.java:61)
07-Dec-2018 06:03:53         at org.springframework.test.context.junit4.statements.RunAfterTestClassCallbacks.evaluate(RunAfterTestClassCallbacks.java:70)
07-Dec-2018 06:03:53         at org.junit.runners.ParentRunner.run(ParentRunner.java:363)
07-Dec-2018 06:03:53         at org.springframework.test.context.junit4.SpringJUnit4ClassRunner.run(SpringJUnit4ClassRunner.java:191)
07-Dec-2018 06:03:53         at org.apache.maven.surefire.junit4.JUnit4Provider.execute(JUnit4Provider.java:283)
07-Dec-2018 06:03:53         at org.apache.maven.surefire.junit4.JUnit4Provider.executeWithRerun(JUnit4Provider.java:173)
07-Dec-2018 06:03:53         at org.apache.maven.surefire.junit4.JUnit4Provider.executeTestSet(JUnit4Provider.java:153)
07-Dec-2018 06:03:53         at org.apache.maven.surefire.junit4.JUnit4Provider.invoke(JUnit4Provider.java:128)
07-Dec-2018 06:03:53         at org.apache.maven.surefire.booter.ForkedBooter.invokeProviderInSameClassLoader(ForkedBooter.java:203)
07-Dec-2018 06:03:53         at org.apache.maven.surefire.booter.ForkedBooter.runSuitesInProcess(ForkedBooter.java:155)
07-Dec-2018 06:03:53         at org.apache.maven.surefire.booter.ForkedBooter.main(ForkedBooter.java:103)
07-Dec-2018 06:03:53 Caused by: org.springframework.web.client.ResourceAccessException: I/O error on GET request for "http://localhost:9393": Connection refused (Connection refused); nested exception is java.net.ConnectException: Connection refused (Connection refused)
07-Dec-2018 06:03:53         at org.springframework.web.client.RestTemplate.doExecute(RestTemplate.java:633)
07-Dec-2018 06:03:53         at org.springframework.web.client.RestTemplate.execute(RestTemplate.java:595)
07-Dec-2018 06:03:53         at org.springframework.web.client.RestTemplate.getForObject(RestTemplate.java:303)
07-Dec-2018 06:03:53         at org.springframework.cloud.dataflow.rest.client.DataFlowTemplate.<init>(DataFlowTemplate.java:168)
07-Dec-2018 06:03:53         at org.springframework.cloud.dataflow.rest.client.DataFlowTemplate.<init>(DataFlowTemplate.java:150)
07-Dec-2018 06:03:53         at org.springframework.cloud.dataflow.acceptance.test.AbstractStreamTests.afterPropertiesSet(AbstractStreamTests.java:126)
07-Dec-2018 06:03:53         at org.springframework.beans.factory.support.AbstractAutowireCapableBeanFactory.invokeInitMethods(AbstractAutowireCapableBeanFactory.java:1642)
07-Dec-2018 06:03:53         at org.springframework.beans.factory.support.AbstractAutowireCapableBeanFactory.initializeBean(AbstractAutowireCapableBeanFactory.java:1579)
07-Dec-2018 06:03:53         at org.springframework.beans.factory.support.AbstractAutowireCapableBeanFactory.initializeBean(AbstractAutowireCapableBeanFactory.java:399)
07-Dec-2018 06:03:53         at org.springframework.test.context.support.DependencyInjectionTestExecutionListener.injectDependencies(DependencyInjectionTestExecutionListener.java:119)
07-Dec-2018 06:03:53         at org.springframework.test.context.support.DependencyInjectionTestExecutionListener.prepareTestInstance(DependencyInjectionTestExecutionListener.java:83)
07-Dec-2018 06:03:53         at org.springframework.boot.test.autoconfigure.SpringBootDependencyInjectionTestExecutionListener.prepareTestInstance(SpringBootDependencyInjectionTestExecutionListener.java:44)
07-Dec-2018 06:03:53         at org.springframework.test.context.TestContextManager.prepareTestInstance(TestContextManager.java:230)
07-Dec-2018 06:03:53         at org.springframework.test.context.junit4.SpringJUnit4ClassRunner.createTest(SpringJUnit4ClassRunner.java:228)
07-Dec-2018 06:03:53         at org.springframework.test.context.junit4.SpringJUnit4ClassRunner$1.runReflectiveCall(SpringJUnit4ClassRunner.java:287)
07-Dec-2018 06:03:53         at org.junit.internal.runners.model.ReflectiveCallable.run(ReflectiveCallable.java:12)
07-Dec-2018 06:03:53         at org.springframework.test.context.junit4.SpringJUnit4ClassRunner.methodBlock(SpringJUnit4ClassRunner.java:289)
07-Dec-2018 06:03:53         at org.springframework.test.context.junit4.SpringJUnit4ClassRunner.runChild(SpringJUnit4ClassRunner.java:247)
07-Dec-2018 06:03:53         at org.springframework.test.context.junit4.SpringJUnit4ClassRunner.runChild(SpringJUnit4ClassRunner.java:94)
07-Dec-2018 06:03:53         at org.junit.runners.ParentRunner$3.run(ParentRunner.java:290)
07-Dec-2018 06:03:53         at org.junit.runners.ParentRunner$1.schedule(ParentRunner.java:71)
07-Dec-2018 06:03:53         at org.junit.runners.ParentRunner.runChildren(ParentRunner.java:288)
07-Dec-2018 06:03:53         at org.junit.runners.ParentRunner.access$000(ParentRunner.java:58)
07-Dec-2018 06:03:53         at org.junit.runners.ParentRunner$2.evaluate(ParentRunner.java:268)
07-Dec-2018 06:03:53         at org.springframework.test.context.junit4.statements.RunBeforeTestClassCallbacks.evaluate(RunBeforeTestClassCallbacks.java:61)
07-Dec-2018 06:03:53         at org.springframework.test.context.junit4.statements.RunAfterTestClassCallbacks.evaluate(RunAfterTestClassCallbacks.java:70)
07-Dec-2018 06:03:53         at org.junit.runners.ParentRunner.run(ParentRunner.java:363)
07-Dec-2018 06:03:53         at org.springframework.test.context.junit4.SpringJUnit4ClassRunner.run(SpringJUnit4ClassRunner.java:191)
07-Dec-2018 06:03:53         at org.apache.maven.surefire.junit4.JUnit4Provider.execute(JUnit4Provider.java:283)
07-Dec-2018 06:03:53         at org.apache.maven.surefire.junit4.JUnit4Provider.executeWithRerun(JUnit4Provider.java:173)
07-Dec-2018 06:03:53         at org.apache.maven.surefire.junit4.JUnit4Provider.executeTestSet(JUnit4Provider.java:153)
07-Dec-2018 06:03:53         at org.apache.maven.surefire.junit4.JUnit4Provider.invoke(JUnit4Provider.java:128)
07-Dec-2018 06:03:53         at org.apache.maven.surefire.booter.ForkedBooter.invokeProviderInSameClassLoader(ForkedBooter.java:203)
07-Dec-2018 06:03:53         at org.apache.maven.surefire.booter.ForkedBooter.runSuitesInProcess(ForkedBooter.java:155)
07-Dec-2018 06:03:53         at org.apache.maven.surefire.booter.ForkedBooter.main(ForkedBooter.java:103)
07-Dec-2018 06:03:53 Caused by: java.net.ConnectException: Connection refused (Connection refused)
07-Dec-2018 06:03:53         at java.net.PlainSocketImpl.socketConnect(Native Method)
07-Dec-2018 06:03:53         at java.net.AbstractPlainSocketImpl.doConnect(AbstractPlainSocketImpl.java:350)
07-Dec-2018 06:03:53         at java.net.AbstractPlainSocketImpl.connectToAddress(AbstractPlainSocketImpl.java:206)
07-Dec-2018 06:03:53         at java.net.AbstractPlainSocketImpl.connect(AbstractPlainSocketImpl.java:188)
07-Dec-2018 06:03:53         at java.net.SocksSocketImpl.connect(SocksSocketImpl.java:392)
07-Dec-2018 06:03:53         at java.net.Socket.connect(Socket.java:589)
07-Dec-2018 06:03:53         at java.net.Socket.connect(Socket.java:538)
07-Dec-2018 06:03:53         at sun.net.NetworkClient.doConnect(NetworkClient.java:180)
07-Dec-2018 06:03:53         at sun.net.www.http.HttpClient.openServer(HttpClient.java:463)
07-Dec-2018 06:03:53         at sun.net.www.http.HttpClient.openServer(HttpClient.java:558)
07-Dec-2018 06:03:53         at sun.net.www.http.HttpClient.<init>(HttpClient.java:242)
07-Dec-2018 06:03:53         at sun.net.www.http.HttpClient.New(HttpClient.java:339)
07-Dec-2018 06:03:53         at sun.net.www.http.HttpClient.New(HttpClient.java:357)
07-Dec-2018 06:03:53         at sun.net.www.protocol.http.HttpURLConnection.getNewHttpClient(HttpURLConnection.java:1202)
07-Dec-2018 06:03:53         at sun.net.www.protocol.http.HttpURLConnection.plainConnect0(HttpURLConnection.java:1138)
07-Dec-2018 06:03:53         at sun.net.www.protocol.http.HttpURLConnection.plainConnect(HttpURLConnection.java:1032)
07-Dec-2018 06:03:53         at sun.net.www.protocol.http.HttpURLConnection.connect(HttpURLConnection.java:966)
07-Dec-2018 06:03:53         at org.springframework.http.client.SimpleBufferingClientHttpRequest.executeInternal(SimpleBufferingClientHttpRequest.java:78)
07-Dec-2018 06:03:53         at org.springframework.http.client.AbstractBufferingClientHttpRequest.executeInternal(AbstractBufferingClientHttpRequest.java:48)
07-Dec-2018 06:03:53         at org.springframework.http.client.AbstractClientHttpRequest.execute(AbstractClientHttpRequest.java:53)
07-Dec-2018 06:03:53         at org.springframework.web.client.RestTemplate.doExecute(RestTemplate.java:619)
07-Dec-2018 06:03:53         at org.springframework.web.client.RestTemplate.execute(RestTemplate.java:595)
07-Dec-2018 06:03:53         at org.springframework.web.client.RestTemplate.getForObject(RestTemplate.java:303)
07-Dec-2018 06:03:53         at org.springframework.cloud.dataflow.rest.client.DataFlowTemplate.<init>(DataFlowTemplate.java:168)
07-Dec-2018 06:03:53         at org.springframework.cloud.dataflow.rest.client.DataFlowTemplate.<init>(DataFlowTemplate.java:150)
07-Dec-2018 06:03:53         at org.springframework.cloud.dataflow.acceptance.test.AbstractStreamTests.afterPropertiesSet(AbstractStreamTests.java:126)
07-Dec-2018 06:03:53         at org.springframework.beans.factory.support.AbstractAutowireCapableBeanFactory.invokeInitMethods(AbstractAutowireCapableBeanFactory.java:1642)
07-Dec-2018 06:03:53         at org.springframework.beans.factory.support.AbstractAutowireCapableBeanFactory.initializeBean(AbstractAutowireCapableBeanFactory.java:1579)
07-Dec-2018 06:03:53         at org.springframework.beans.factory.support.AbstractAutowireCapableBeanFactory.initializeBean(AbstractAutowireCapableBeanFactory.java:399)
07-Dec-2018 06:03:53         at org.springframework.test.context.support.DependencyInjectionTestExecutionListener.injectDependencies(DependencyInjectionTestExecutionListener.java:119)
07-Dec-2018 06:03:53         at org.springframework.test.context.support.DependencyInjectionTestExecutionListener.prepareTestInstance(DependencyInjectionTestExecutionListener.java:83)
07-Dec-2018 06:03:53         at org.springframework.boot.test.autoconfigure.SpringBootDependencyInjectionTestExecutionListener.prepareTestInstance(SpringBootDependencyInjectionTestExecutionListener.java:44)
07-Dec-2018 06:03:53         at org.springframework.test.context.TestContextManager.prepareTestInstance(TestContextManager.java:230)
07-Dec-2018 06:03:53         at org.springframework.test.context.junit4.SpringJUnit4ClassRunner.createTest(SpringJUnit4ClassRunner.java:228)
07-Dec-2018 06:03:53         at org.springframework.test.context.junit4.SpringJUnit4ClassRunner$1.runReflectiveCall(SpringJUnit4ClassRunner.java:287)
07-Dec-2018 06:03:53         at org.junit.internal.runners.model.ReflectiveCallable.run(ReflectiveCallable.java:12)
07-Dec-2018 06:03:53         at org.springframework.test.context.junit4.SpringJUnit4ClassRunner.methodBlock(SpringJUnit4ClassRunner.java:289)
07-Dec-2018 06:03:53         at org.springframework.test.context.junit4.SpringJUnit4ClassRunner.runChild(SpringJUnit4ClassRunner.java:247)
07-Dec-2018 06:03:53         at org.springframework.test.context.junit4.SpringJUnit4ClassRunner.runChild(SpringJUnit4ClassRunner.java:94)
07-Dec-2018 06:03:53         at org.junit.runners.ParentRunner$3.run(ParentRunner.java:290)
07-Dec-2018 06:03:53         at org.junit.runners.ParentRunner$1.schedule(ParentRunner.java:71)
07-Dec-2018 06:03:53         at org.junit.runners.ParentRunner.runChildren(ParentRunner.java:288)
07-Dec-2018 06:03:53         at org.junit.runners.ParentRunner.access$000(ParentRunner.java:58)
07-Dec-2018 06:03:53         at org.junit.runners.ParentRunner$2.evaluate(ParentRunner.java:268)
07-Dec-2018 06:03:53         at org.springframework.test.context.junit4.statements.RunBeforeTestClassCallbacks.evaluate(RunBeforeTestClassCallbacks.java:61)
07-Dec-2018 06:03:53         at org.springframework.test.context.junit4.statements.RunAfterTestClassCallbacks.evaluate(RunAfterTestClassCallbacks.java:70)
07-Dec-2018 06:03:53         at org.junit.runners.ParentRunner.run(ParentRunner.java:363)
07-Dec-2018 06:03:53         at org.springframework.test.context.junit4.SpringJUnit4ClassRunner.run(SpringJUnit4ClassRunner.java:191)
07-Dec-2018 06:03:53         at org.apache.maven.surefire.junit4.JUnit4Provider.execute(JUnit4Provider.java:283)
07-Dec-2018 06:03:53         at org.apache.maven.surefire.junit4.JUnit4Provider.executeWithRerun(JUnit4Provider.java:173)
07-Dec-2018 06:03:53         at org.apache.maven.surefire.junit4.JUnit4Provider.executeTestSet(JUnit4Provider.java:153)
07-Dec-2018 06:03:53         at org.apache.maven.surefire.junit4.JUnit4Provider.invoke(JUnit4Provider.java:128)
07-Dec-2018 06:03:53         at org.apache.maven.surefire.booter.ForkedBooter.invokeProviderInSameClassLoader(ForkedBooter.java:203)
07-Dec-2018 06:03:53         at org.apache.maven.surefire.booter.ForkedBooter.runSuitesInProcess(ForkedBooter.java:155)
07-Dec-2018 06:03:53         at org.apache.maven.surefire.booter.ForkedBooter.main(ForkedBooter.java:103)
07-Dec-2018 06:03:53
07-Dec-2018 06:03:53 manyToOneTest(org.springframework.cloud.dataflow.acceptance.test.NamedChannelTests)  Time elapsed: 0.001 sec  <<< ERROR!
07-Dec-2018 06:03:53 org.springframework.beans.factory.BeanCreationException: Error creating bean with name 'org.springframework.cloud.dataflow.acceptance.test.NamedChannelTests': Invocation of init method failed; nested exception is org.springframework.web.client.ResourceAccessException: I/O error on GET request for "http://localhost:9393": Connection refused (Connection refused); nested exception is java.net.ConnectException: Connection refused (Connection refused)
07-Dec-2018 06:03:53         at org.springframework.beans.factory.support.AbstractAutowireCapableBeanFactory.initializeBean(AbstractAutowireCapableBeanFactory.java:1583)
07-Dec-2018 06:03:53         at org.springframework.beans.factory.support.AbstractAutowireCapableBeanFactory.initializeBean(AbstractAutowireCapableBeanFactory.java:399)
07-Dec-2018 06:03:53         at org.springframework.test.context.support.DependencyInjectionTestExecutionListener.injectDependencies(DependencyInjectionTestExecutionListener.java:119)
07-Dec-2018 06:03:53         at org.springframework.test.context.support.DependencyInjectionTestExecutionListener.prepareTestInstance(DependencyInjectionTestExecutionListener.java:83)
07-Dec-2018 06:03:53         at org.springframework.boot.test.autoconfigure.SpringBootDependencyInjectionTestExecutionListener.prepareTestInstance(SpringBootDependencyInjectionTestExecutionListener.java:44)
07-Dec-2018 06:03:53         at org.springframework.test.context.TestContextManager.prepareTestInstance(TestContextManager.java:230)
07-Dec-2018 06:03:53         at org.springframework.test.context.junit4.SpringJUnit4ClassRunner.createTest(SpringJUnit4ClassRunner.java:228)
07-Dec-2018 06:03:53         at org.springframework.test.context.junit4.SpringJUnit4ClassRunner$1.runReflectiveCall(SpringJUnit4ClassRunner.java:287)
07-Dec-2018 06:03:53         at org.junit.internal.runners.model.ReflectiveCallable.run(ReflectiveCallable.java:12)
07-Dec-2018 06:03:53         at org.springframework.test.context.junit4.SpringJUnit4ClassRunner.methodBlock(SpringJUnit4ClassRunner.java:289)
07-Dec-2018 06:03:53         at org.springframework.test.context.junit4.SpringJUnit4ClassRunner.runChild(SpringJUnit4ClassRunner.java:247)
07-Dec-2018 06:03:53         at org.springframework.test.context.junit4.SpringJUnit4ClassRunner.runChild(SpringJUnit4ClassRunner.java:94)
07-Dec-2018 06:03:53         at org.junit.runners.ParentRunner$3.run(ParentRunner.java:290)
07-Dec-2018 06:03:53         at org.junit.runners.ParentRunner$1.schedule(ParentRunner.java:71)
07-Dec-2018 06:03:53         at org.junit.runners.ParentRunner.runChildren(ParentRunner.java:288)
07-Dec-2018 06:03:53         at org.junit.runners.ParentRunner.access$000(ParentRunner.java:58)
07-Dec-2018 06:03:53         at org.junit.runners.ParentRunner$2.evaluate(ParentRunner.java:268)
07-Dec-2018 06:03:53         at org.springframework.test.context.junit4.statements.RunBeforeTestClassCallbacks.evaluate(RunBeforeTestClassCallbacks.java:61)
07-Dec-2018 06:03:53         at org.springframework.test.context.junit4.statements.RunAfterTestClassCallbacks.evaluate(RunAfterTestClassCallbacks.java:70)
07-Dec-2018 06:03:53         at org.junit.runners.ParentRunner.run(ParentRunner.java:363)
07-Dec-2018 06:03:53         at org.springframework.test.context.junit4.SpringJUnit4ClassRunner.run(SpringJUnit4ClassRunner.java:191)
07-Dec-2018 06:03:53         at org.apache.maven.surefire.junit4.JUnit4Provider.execute(JUnit4Provider.java:283)
07-Dec-2018 06:03:53         at org.apache.maven.surefire.junit4.JUnit4Provider.executeWithRerun(JUnit4Provider.java:173)
07-Dec-2018 06:03:53         at org.apache.maven.surefire.junit4.JUnit4Provider.executeTestSet(JUnit4Provider.java:153)
07-Dec-2018 06:03:53         at org.apache.maven.surefire.junit4.JUnit4Provider.invoke(JUnit4Provider.java:128)
07-Dec-2018 06:03:53         at org.apache.maven.surefire.booter.ForkedBooter.invokeProviderInSameClassLoader(ForkedBooter.java:203)
07-Dec-2018 06:03:53         at org.apache.maven.surefire.booter.ForkedBooter.runSuitesInProcess(ForkedBooter.java:155)
07-Dec-2018 06:03:53         at org.apache.maven.surefire.booter.ForkedBooter.main(ForkedBooter.java:103)
07-Dec-2018 06:03:53 Caused by: org.springframework.web.client.ResourceAccessException: I/O error on GET request for "http://localhost:9393": Connection refused (Connection refused); nested exception is java.net.ConnectException: Connection refused (Connection refused)
07-Dec-2018 06:03:53         at org.springframework.web.client.RestTemplate.doExecute(RestTemplate.java:633)
07-Dec-2018 06:03:53         at org.springframework.web.client.RestTemplate.execute(RestTemplate.java:595)
07-Dec-2018 06:03:53         at org.springframework.web.client.RestTemplate.getForObject(RestTemplate.java:303)
07-Dec-2018 06:03:53         at org.springframework.cloud.dataflow.rest.client.DataFlowTemplate.<init>(DataFlowTemplate.java:168)
07-Dec-2018 06:03:53         at org.springframework.cloud.dataflow.rest.client.DataFlowTemplate.<init>(DataFlowTemplate.java:150)
07-Dec-2018 06:03:53         at org.springframework.cloud.dataflow.acceptance.test.AbstractStreamTests.afterPropertiesSet(AbstractStreamTests.java:126)
07-Dec-2018 06:03:53         at org.springframework.beans.factory.support.AbstractAutowireCapableBeanFactory.invokeInitMethods(AbstractAutowireCapableBeanFactory.java:1642)
07-Dec-2018 06:03:53         at org.springframework.beans.factory.support.AbstractAutowireCapableBeanFactory.initializeBean(AbstractAutowireCapableBeanFactory.java:1579)
07-Dec-2018 06:03:53         at org.springframework.beans.factory.support.AbstractAutowireCapableBeanFactory.initializeBean(AbstractAutowireCapableBeanFactory.java:399)
07-Dec-2018 06:03:53         at org.springframework.test.context.support.DependencyInjectionTestExecutionListener.injectDependencies(DependencyInjectionTestExecutionListener.java:119)
07-Dec-2018 06:03:53         at org.springframework.test.context.support.DependencyInjectionTestExecutionListener.prepareTestInstance(DependencyInjectionTestExecutionListener.java:83)
07-Dec-2018 06:03:53         at org.springframework.boot.test.autoconfigure.SpringBootDependencyInjectionTestExecutionListener.prepareTestInstance(SpringBootDependencyInjectionTestExecutionListener.java:44)
07-Dec-2018 06:03:53         at org.springframework.test.context.TestContextManager.prepareTestInstance(TestContextManager.java:230)
07-Dec-2018 06:03:53         at org.springframework.test.context.junit4.SpringJUnit4ClassRunner.createTest(SpringJUnit4ClassRunner.java:228)
07-Dec-2018 06:03:53         at org.springframework.test.context.junit4.SpringJUnit4ClassRunner$1.runReflectiveCall(SpringJUnit4ClassRunner.java:287)
07-Dec-2018 06:03:53         at org.junit.internal.runners.model.ReflectiveCallable.run(ReflectiveCallable.java:12)
07-Dec-2018 06:03:53         at org.springframework.test.context.junit4.SpringJUnit4ClassRunner.methodBlock(SpringJUnit4ClassRunner.java:289)
07-Dec-2018 06:03:53         at org.springframework.test.context.junit4.SpringJUnit4ClassRunner.runChild(SpringJUnit4ClassRunner.java:247)
07-Dec-2018 06:03:53         at org.springframework.test.context.junit4.SpringJUnit4ClassRunner.runChild(SpringJUnit4ClassRunner.java:94)
07-Dec-2018 06:03:53         at org.junit.runners.ParentRunner$3.run(ParentRunner.java:290)
07-Dec-2018 06:03:53         at org.junit.runners.ParentRunner$1.schedule(ParentRunner.java:71)
07-Dec-2018 06:03:53         at org.junit.runners.ParentRunner.runChildren(ParentRunner.java:288)
07-Dec-2018 06:03:53         at org.junit.runners.ParentRunner.access$000(ParentRunner.java:58)
07-Dec-2018 06:03:53         at org.junit.runners.ParentRunner$2.evaluate(ParentRunner.java:268)
07-Dec-2018 06:03:53         at org.springframework.test.context.junit4.statements.RunBeforeTestClassCallbacks.evaluate(RunBeforeTestClassCallbacks.java:61)
07-Dec-2018 06:03:53         at org.springframework.test.context.junit4.statements.RunAfterTestClassCallbacks.evaluate(RunAfterTestClassCallbacks.java:70)
07-Dec-2018 06:03:53         at org.junit.runners.ParentRunner.run(ParentRunner.java:363)
07-Dec-2018 06:03:53         at org.springframework.test.context.junit4.SpringJUnit4ClassRunner.run(SpringJUnit4ClassRunner.java:191)
07-Dec-2018 06:03:53         at org.apache.maven.surefire.junit4.JUnit4Provider.execute(JUnit4Provider.java:283)
07-Dec-2018 06:03:53         at org.apache.maven.surefire.junit4.JUnit4Provider.executeWithRerun(JUnit4Provider.java:173)
07-Dec-2018 06:03:53         at org.apache.maven.surefire.junit4.JUnit4Provider.executeTestSet(JUnit4Provider.java:153)
07-Dec-2018 06:03:53         at org.apache.maven.surefire.junit4.JUnit4Provider.invoke(JUnit4Provider.java:128)
07-Dec-2018 06:03:53         at org.apache.maven.surefire.booter.ForkedBooter.invokeProviderInSameClassLoader(ForkedBooter.java:203)
07-Dec-2018 06:03:53         at org.apache.maven.surefire.booter.ForkedBooter.runSuitesInProcess(ForkedBooter.java:155)
07-Dec-2018 06:03:53         at org.apache.maven.surefire.booter.ForkedBooter.main(ForkedBooter.java:103)
07-Dec-2018 06:03:53 Caused by: java.net.ConnectException: Connection refused (Connection refused)
07-Dec-2018 06:03:53         at java.net.PlainSocketImpl.socketConnect(Native Method)
07-Dec-2018 06:03:53         at java.net.AbstractPlainSocketImpl.doConnect(AbstractPlainSocketImpl.java:350)
07-Dec-2018 06:03:53         at java.net.AbstractPlainSocketImpl.connectToAddress(AbstractPlainSocketImpl.java:206)
07-Dec-2018 06:03:53         at java.net.AbstractPlainSocketImpl.connect(AbstractPlainSocketImpl.java:188)
07-Dec-2018 06:03:53         at java.net.SocksSocketImpl.connect(SocksSocketImpl.java:392)
07-Dec-2018 06:03:53         at java.net.Socket.connect(Socket.java:589)
07-Dec-2018 06:03:53         at java.net.Socket.connect(Socket.java:538)
07-Dec-2018 06:03:53         at sun.net.NetworkClient.doConnect(NetworkClient.java:180)
07-Dec-2018 06:03:53         at sun.net.www.http.HttpClient.openServer(HttpClient.java:463)
07-Dec-2018 06:03:53         at sun.net.www.http.HttpClient.openServer(HttpClient.java:558)
07-Dec-2018 06:03:53         at sun.net.www.http.HttpClient.<init>(HttpClient.java:242)
07-Dec-2018 06:03:53         at sun.net.www.http.HttpClient.New(HttpClient.java:339)
07-Dec-2018 06:03:53         at sun.net.www.http.HttpClient.New(HttpClient.java:357)
07-Dec-2018 06:03:53         at sun.net.www.protocol.http.HttpURLConnection.getNewHttpClient(HttpURLConnection.java:1202)
07-Dec-2018 06:03:53         at sun.net.www.protocol.http.HttpURLConnection.plainConnect0(HttpURLConnection.java:1138)
07-Dec-2018 06:03:53         at sun.net.www.protocol.http.HttpURLConnection.plainConnect(HttpURLConnection.java:1032)
07-Dec-2018 06:03:53         at sun.net.www.protocol.http.HttpURLConnection.connect(HttpURLConnection.java:966)
07-Dec-2018 06:03:53         at org.springframework.http.client.SimpleBufferingClientHttpRequest.executeInternal(SimpleBufferingClientHttpRequest.java:78)
07-Dec-2018 06:03:53         at org.springframework.http.client.AbstractBufferingClientHttpRequest.executeInternal(AbstractBufferingClientHttpRequest.java:48)
07-Dec-2018 06:03:53         at org.springframework.http.client.AbstractClientHttpRequest.execute(AbstractClientHttpRequest.java:53)
07-Dec-2018 06:03:53         at org.springframework.web.client.RestTemplate.doExecute(RestTemplate.java:619)
07-Dec-2018 06:03:53         at org.springframework.web.client.RestTemplate.execute(RestTemplate.java:595)
07-Dec-2018 06:03:53         at org.springframework.web.client.RestTemplate.getForObject(RestTemplate.java:303)
07-Dec-2018 06:03:53         at org.springframework.cloud.dataflow.rest.client.DataFlowTemplate.<init>(DataFlowTemplate.java:168)
07-Dec-2018 06:03:53         at org.springframework.cloud.dataflow.rest.client.DataFlowTemplate.<init>(DataFlowTemplate.java:150)
07-Dec-2018 06:03:53         at org.springframework.cloud.dataflow.acceptance.test.AbstractStreamTests.afterPropertiesSet(AbstractStreamTests.java:126)
07-Dec-2018 06:03:53         at org.springframework.beans.factory.support.AbstractAutowireCapableBeanFactory.invokeInitMethods(AbstractAutowireCapableBeanFactory.java:1642)
07-Dec-2018 06:03:53         at org.springframework.beans.factory.support.AbstractAutowireCapableBeanFactory.initializeBean(AbstractAutowireCapableBeanFactory.java:1579)
07-Dec-2018 06:03:53         at org.springframework.beans.factory.support.AbstractAutowireCapableBeanFactory.initializeBean(AbstractAutowireCapableBeanFactory.java:399)
07-Dec-2018 06:03:53         at org.springframework.test.context.support.DependencyInjectionTestExecutionListener.injectDependencies(DependencyInjectionTestExecutionListener.java:119)
07-Dec-2018 06:03:53         at org.springframework.test.context.support.DependencyInjectionTestExecutionListener.prepareTestInstance(DependencyInjectionTestExecutionListener.java:83)
07-Dec-2018 06:03:53         at org.springframework.boot.test.autoconfigure.SpringBootDependencyInjectionTestExecutionListener.prepareTestInstance(SpringBootDependencyInjectionTestExecutionListener.java:44)
07-Dec-2018 06:03:53         at org.springframework.test.context.TestContextManager.prepareTestInstance(TestContextManager.java:230)
07-Dec-2018 06:03:53         at org.springframework.test.context.junit4.SpringJUnit4ClassRunner.createTest(SpringJUnit4ClassRunner.java:228)
07-Dec-2018 06:03:53         at org.springframework.test.context.junit4.SpringJUnit4ClassRunner$1.runReflectiveCall(SpringJUnit4ClassRunner.java:287)
07-Dec-2018 06:03:53         at org.junit.internal.runners.model.ReflectiveCallable.run(ReflectiveCallable.java:12)
07-Dec-2018 06:03:53         at org.springframework.test.context.junit4.SpringJUnit4ClassRunner.methodBlock(SpringJUnit4ClassRunner.java:289)
07-Dec-2018 06:03:53         at org.springframework.test.context.junit4.SpringJUnit4ClassRunner.runChild(SpringJUnit4ClassRunner.java:247)
07-Dec-2018 06:03:53         at org.springframework.test.context.junit4.SpringJUnit4ClassRunner.runChild(SpringJUnit4ClassRunner.java:94)
07-Dec-2018 06:03:53         at org.junit.runners.ParentRunner$3.run(ParentRunner.java:290)
07-Dec-2018 06:03:53         at org.junit.runners.ParentRunner$1.schedule(ParentRunner.java:71)
07-Dec-2018 06:03:53         at org.junit.runners.ParentRunner.runChildren(ParentRunner.java:288)
07-Dec-2018 06:03:53         at org.junit.runners.ParentRunner.access$000(ParentRunner.java:58)
07-Dec-2018 06:03:53         at org.junit.runners.ParentRunner$2.evaluate(ParentRunner.java:268)
07-Dec-2018 06:03:53         at org.springframework.test.context.junit4.statements.RunBeforeTestClassCallbacks.evaluate(RunBeforeTestClassCallbacks.java:61)
07-Dec-2018 06:03:53         at org.springframework.test.context.junit4.statements.RunAfterTestClassCallbacks.evaluate(RunAfterTestClassCallbacks.java:70)
07-Dec-2018 06:03:53         at org.junit.runners.ParentRunner.run(ParentRunner.java:363)
07-Dec-2018 06:03:53         at org.springframework.test.context.junit4.SpringJUnit4ClassRunner.run(SpringJUnit4ClassRunner.java:191)
07-Dec-2018 06:03:53         at org.apache.maven.surefire.junit4.JUnit4Provider.execute(JUnit4Provider.java:283)
07-Dec-2018 06:03:53         at org.apache.maven.surefire.junit4.JUnit4Provider.executeWithRerun(JUnit4Provider.java:173)
07-Dec-2018 06:03:53         at org.apache.maven.surefire.junit4.JUnit4Provider.executeTestSet(JUnit4Provider.java:153)
07-Dec-2018 06:03:53         at org.apache.maven.surefire.junit4.JUnit4Provider.invoke(JUnit4Provider.java:128)
07-Dec-2018 06:03:53         at org.apache.maven.surefire.booter.ForkedBooter.invokeProviderInSameClassLoader(ForkedBooter.java:203)
07-Dec-2018 06:03:53         at org.apache.maven.surefire.booter.ForkedBooter.runSuitesInProcess(ForkedBooter.java:155)
07-Dec-2018 06:03:53         at org.apache.maven.surefire.booter.ForkedBooter.main(ForkedBooter.java:103)
07-Dec-2018 06:03:53
07-Dec-2018 06:03:53 directedGraphTest(org.springframework.cloud.dataflow.acceptance.test.NamedChannelTests)  Time elapsed: 0 sec  <<< ERROR!
07-Dec-2018 06:03:53 org.springframework.beans.factory.BeanCreationException: Error creating bean with name 'org.springframework.cloud.dataflow.acceptance.test.NamedChannelTests': Invocation of init method failed; nested exception is org.springframework.web.client.ResourceAccessException: I/O error on GET request for "http://localhost:9393": Connection refused (Connection refused); nested exception is java.net.ConnectException: Connection refused (Connection refused)
07-Dec-2018 06:03:53         at org.springframework.beans.factory.support.AbstractAutowireCapableBeanFactory.initializeBean(AbstractAutowireCapableBeanFactory.java:1583)
07-Dec-2018 06:03:53         at org.springframework.beans.factory.support.AbstractAutowireCapableBeanFactory.initializeBean(AbstractAutowireCapableBeanFactory.java:399)
07-Dec-2018 06:03:53         at org.springframework.test.context.support.DependencyInjectionTestExecutionListener.injectDependencies(DependencyInjectionTestExecutionListener.java:119)
07-Dec-2018 06:03:53         at org.springframework.test.context.support.DependencyInjectionTestExecutionListener.prepareTestInstance(DependencyInjectionTestExecutionListener.java:83)
07-Dec-2018 06:03:53         at org.springframework.boot.test.autoconfigure.SpringBootDependencyInjectionTestExecutionListener.prepareTestInstance(SpringBootDependencyInjectionTestExecutionListener.java:44)
07-Dec-2018 06:03:53         at org.springframework.test.context.TestContextManager.prepareTestInstance(TestContextManager.java:230)
07-Dec-2018 06:03:53         at org.springframework.test.context.junit4.SpringJUnit4ClassRunner.createTest(SpringJUnit4ClassRunner.java:228)
07-Dec-2018 06:03:53         at org.springframework.test.context.junit4.SpringJUnit4ClassRunner$1.runReflectiveCall(SpringJUnit4ClassRunner.java:287)
07-Dec-2018 06:03:53         at org.junit.internal.runners.model.ReflectiveCallable.run(ReflectiveCallable.java:12)
07-Dec-2018 06:03:53         at org.springframework.test.context.junit4.SpringJUnit4ClassRunner.methodBlock(SpringJUnit4ClassRunner.java:289)
07-Dec-2018 06:03:53         at org.springframework.test.context.junit4.SpringJUnit4ClassRunner.runChild(SpringJUnit4ClassRunner.java:247)
07-Dec-2018 06:03:53         at org.springframework.test.context.junit4.SpringJUnit4ClassRunner.runChild(SpringJUnit4ClassRunner.java:94)
07-Dec-2018 06:03:53         at org.junit.runners.ParentRunner$3.run(ParentRunner.java:290)
07-Dec-2018 06:03:53         at org.junit.runners.ParentRunner$1.schedule(ParentRunner.java:71)
07-Dec-2018 06:03:53         at org.junit.runners.ParentRunner.runChildren(ParentRunner.java:288)
07-Dec-2018 06:03:53         at org.junit.runners.ParentRunner.access$000(ParentRunner.java:58)
07-Dec-2018 06:03:53         at org.junit.runners.ParentRunner$2.evaluate(ParentRunner.java:268)
07-Dec-2018 06:03:53         at org.springframework.test.context.junit4.statements.RunBeforeTestClassCallbacks.evaluate(RunBeforeTestClassCallbacks.java:61)
07-Dec-2018 06:03:53         at org.springframework.test.context.junit4.statements.RunAfterTestClassCallbacks.evaluate(RunAfterTestClassCallbacks.java:70)
07-Dec-2018 06:03:53         at org.junit.runners.ParentRunner.run(ParentRunner.java:363)
07-Dec-2018 06:03:53         at org.springframework.test.context.junit4.SpringJUnit4ClassRunner.run(SpringJUnit4ClassRunner.java:191)
07-Dec-2018 06:03:53         at org.apache.maven.surefire.junit4.JUnit4Provider.execute(JUnit4Provider.java:283)
07-Dec-2018 06:03:53         at org.apache.maven.surefire.junit4.JUnit4Provider.executeWithRerun(JUnit4Provider.java:173)
07-Dec-2018 06:03:53         at org.apache.maven.surefire.junit4.JUnit4Provider.executeTestSet(JUnit4Provider.java:153)
07-Dec-2018 06:03:53         at org.apache.maven.surefire.junit4.JUnit4Provider.invoke(JUnit4Provider.java:128)
07-Dec-2018 06:03:53         at org.apache.maven.surefire.booter.ForkedBooter.invokeProviderInSameClassLoader(ForkedBooter.java:203)
07-Dec-2018 06:03:53         at org.apache.maven.surefire.booter.ForkedBooter.runSuitesInProcess(ForkedBooter.java:155)
07-Dec-2018 06:03:53         at org.apache.maven.surefire.booter.ForkedBooter.main(ForkedBooter.java:103)
07-Dec-2018 06:03:53 Caused by: org.springframework.web.client.ResourceAccessException: I/O error on GET request for "http://localhost:9393": Connection refused (Connection refused); nested exception is java.net.ConnectException: Connection refused (Connection refused)
07-Dec-2018 06:03:53         at org.springframework.web.client.RestTemplate.doExecute(RestTemplate.java:633)
07-Dec-2018 06:03:53         at org.springframework.web.client.RestTemplate.execute(RestTemplate.java:595)
07-Dec-2018 06:03:53         at org.springframework.web.client.RestTemplate.getForObject(RestTemplate.java:303)
07-Dec-2018 06:03:53         at org.springframework.cloud.dataflow.rest.client.DataFlowTemplate.<init>(DataFlowTemplate.java:168)
07-Dec-2018 06:03:53         at org.springframework.cloud.dataflow.rest.client.DataFlowTemplate.<init>(DataFlowTemplate.java:150)
07-Dec-2018 06:03:53         at org.springframework.cloud.dataflow.acceptance.test.AbstractStreamTests.afterPropertiesSet(AbstractStreamTests.java:126)
07-Dec-2018 06:03:53         at org.springframework.beans.factory.support.AbstractAutowireCapableBeanFactory.invokeInitMethods(AbstractAutowireCapableBeanFactory.java:1642)
07-Dec-2018 06:03:53         at org.springframework.beans.factory.support.AbstractAutowireCapableBeanFactory.initializeBean(AbstractAutowireCapableBeanFactory.java:1579)
07-Dec-2018 06:03:53         at org.springframework.beans.factory.support.AbstractAutowireCapableBeanFactory.initializeBean(AbstractAutowireCapableBeanFactory.java:399)
07-Dec-2018 06:03:53         at org.springframework.test.context.support.DependencyInjectionTestExecutionListener.injectDependencies(DependencyInjectionTestExecutionListener.java:119)
07-Dec-2018 06:03:53         at org.springframework.test.context.support.DependencyInjectionTestExecutionListener.prepareTestInstance(DependencyInjectionTestExecutionListener.java:83)
07-Dec-2018 06:03:53         at org.springframework.boot.test.autoconfigure.SpringBootDependencyInjectionTestExecutionListener.prepareTestInstance(SpringBootDependencyInjectionTestExecutionListener.java:44)
07-Dec-2018 06:03:53         at org.springframework.test.context.TestContextManager.prepareTestInstance(TestContextManager.java:230)
07-Dec-2018 06:03:53         at org.springframework.test.context.junit4.SpringJUnit4ClassRunner.createTest(SpringJUnit4ClassRunner.java:228)
07-Dec-2018 06:03:53         at org.springframework.test.context.junit4.SpringJUnit4ClassRunner$1.runReflectiveCall(SpringJUnit4ClassRunner.java:287)
07-Dec-2018 06:03:53         at org.junit.internal.runners.model.ReflectiveCallable.run(ReflectiveCallable.java:12)
07-Dec-2018 06:03:53         at org.springframework.test.context.junit4.SpringJUnit4ClassRunner.methodBlock(SpringJUnit4ClassRunner.java:289)
07-Dec-2018 06:03:53         at org.springframework.test.context.junit4.SpringJUnit4ClassRunner.runChild(SpringJUnit4ClassRunner.java:247)
07-Dec-2018 06:03:53         at org.springframework.test.context.junit4.SpringJUnit4ClassRunner.runChild(SpringJUnit4ClassRunner.java:94)
07-Dec-2018 06:03:53         at org.junit.runners.ParentRunner$3.run(ParentRunner.java:290)
07-Dec-2018 06:03:53         at org.junit.runners.ParentRunner$1.schedule(ParentRunner.java:71)
07-Dec-2018 06:03:53         at org.junit.runners.ParentRunner.runChildren(ParentRunner.java:288)
07-Dec-2018 06:03:53         at org.junit.runners.ParentRunner.access$000(ParentRunner.java:58)
07-Dec-2018 06:03:53         at org.junit.runners.ParentRunner$2.evaluate(ParentRunner.java:268)
07-Dec-2018 06:03:53         at org.springframework.test.context.junit4.statements.RunBeforeTestClassCallbacks.evaluate(RunBeforeTestClassCallbacks.java:61)
07-Dec-2018 06:03:53         at org.springframework.test.context.junit4.statements.RunAfterTestClassCallbacks.evaluate(RunAfterTestClassCallbacks.java:70)
07-Dec-2018 06:03:53         at org.junit.runners.ParentRunner.run(ParentRunner.java:363)
07-Dec-2018 06:03:53         at org.springframework.test.context.junit4.SpringJUnit4ClassRunner.run(SpringJUnit4ClassRunner.java:191)
07-Dec-2018 06:03:53         at org.apache.maven.surefire.junit4.JUnit4Provider.execute(JUnit4Provider.java:283)
07-Dec-2018 06:03:53         at org.apache.maven.surefire.junit4.JUnit4Provider.executeWithRerun(JUnit4Provider.java:173)
07-Dec-2018 06:03:53         at org.apache.maven.surefire.junit4.JUnit4Provider.executeTestSet(JUnit4Provider.java:153)
07-Dec-2018 06:03:53         at org.apache.maven.surefire.junit4.JUnit4Provider.invoke(JUnit4Provider.java:128)
07-Dec-2018 06:03:53         at org.apache.maven.surefire.booter.ForkedBooter.invokeProviderInSameClassLoader(ForkedBooter.java:203)
07-Dec-2018 06:03:53         at org.apache.maven.surefire.booter.ForkedBooter.runSuitesInProcess(ForkedBooter.java:155)
07-Dec-2018 06:03:53         at org.apache.maven.surefire.booter.ForkedBooter.main(ForkedBooter.java:103)
07-Dec-2018 06:03:53 Caused by: java.net.ConnectException: Connection refused (Connection refused)
07-Dec-2018 06:03:53         at java.net.PlainSocketImpl.socketConnect(Native Method)
07-Dec-2018 06:03:53         at java.net.AbstractPlainSocketImpl.doConnect(AbstractPlainSocketImpl.java:350)
07-Dec-2018 06:03:53         at java.net.AbstractPlainSocketImpl.connectToAddress(AbstractPlainSocketImpl.java:206)
07-Dec-2018 06:03:53         at java.net.AbstractPlainSocketImpl.connect(AbstractPlainSocketImpl.java:188)
07-Dec-2018 06:03:53         at java.net.SocksSocketImpl.connect(SocksSocketImpl.java:392)
07-Dec-2018 06:03:53         at java.net.Socket.connect(Socket.java:589)
07-Dec-2018 06:03:53         at java.net.Socket.connect(Socket.java:538)
07-Dec-2018 06:03:53         at sun.net.NetworkClient.doConnect(NetworkClient.java:180)
07-Dec-2018 06:03:53         at sun.net.www.http.HttpClient.openServer(HttpClient.java:463)
07-Dec-2018 06:03:53         at sun.net.www.http.HttpClient.openServer(HttpClient.java:558)
07-Dec-2018 06:03:53         at sun.net.www.http.HttpClient.<init>(HttpClient.java:242)
07-Dec-2018 06:03:53         at sun.net.www.http.HttpClient.New(HttpClient.java:339)
07-Dec-2018 06:03:53         at sun.net.www.http.HttpClient.New(HttpClient.java:357)
07-Dec-2018 06:03:53         at sun.net.www.protocol.http.HttpURLConnection.getNewHttpClient(HttpURLConnection.java:1202)
07-Dec-2018 06:03:53         at sun.net.www.protocol.http.HttpURLConnection.plainConnect0(HttpURLConnection.java:1138)
07-Dec-2018 06:03:53         at sun.net.www.protocol.http.HttpURLConnection.plainConnect(HttpURLConnection.java:1032)
07-Dec-2018 06:03:53         at sun.net.www.protocol.http.HttpURLConnection.connect(HttpURLConnection.java:966)
07-Dec-2018 06:03:53         at org.springframework.http.client.SimpleBufferingClientHttpRequest.executeInternal(SimpleBufferingClientHttpRequest.java:78)
07-Dec-2018 06:03:53         at org.springframework.http.client.AbstractBufferingClientHttpRequest.executeInternal(AbstractBufferingClientHttpRequest.java:48)
07-Dec-2018 06:03:53         at org.springframework.http.client.AbstractClientHttpRequest.execute(AbstractClientHttpRequest.java:53)
07-Dec-2018 06:03:53         at org.springframework.web.client.RestTemplate.doExecute(RestTemplate.java:619)
07-Dec-2018 06:03:53         at org.springframework.web.client.RestTemplate.execute(RestTemplate.java:595)
07-Dec-2018 06:03:53         at org.springframework.web.client.RestTemplate.getForObject(RestTemplate.java:303)
07-Dec-2018 06:03:53         at org.springframework.cloud.dataflow.rest.client.DataFlowTemplate.<init>(DataFlowTemplate.java:168)
07-Dec-2018 06:03:53         at org.springframework.cloud.dataflow.rest.client.DataFlowTemplate.<init>(DataFlowTemplate.java:150)
07-Dec-2018 06:03:53         at org.springframework.cloud.dataflow.acceptance.test.AbstractStreamTests.afterPropertiesSet(AbstractStreamTests.java:126)
07-Dec-2018 06:03:53         at org.springframework.beans.factory.support.AbstractAutowireCapableBeanFactory.invokeInitMethods(AbstractAutowireCapableBeanFactory.java:1642)
07-Dec-2018 06:03:53         at org.springframework.beans.factory.support.AbstractAutowireCapableBeanFactory.initializeBean(AbstractAutowireCapableBeanFactory.java:1579)
07-Dec-2018 06:03:53         at org.springframework.beans.factory.support.AbstractAutowireCapableBeanFactory.initializeBean(AbstractAutowireCapableBeanFactory.java:399)
07-Dec-2018 06:03:53         at org.springframework.test.context.support.DependencyInjectionTestExecutionListener.injectDependencies(DependencyInjectionTestExecutionListener.java:119)
07-Dec-2018 06:03:53         at org.springframework.test.context.support.DependencyInjectionTestExecutionListener.prepareTestInstance(DependencyInjectionTestExecutionListener.java:83)
07-Dec-2018 06:03:53         at org.springframework.boot.test.autoconfigure.SpringBootDependencyInjectionTestExecutionListener.prepareTestInstance(SpringBootDependencyInjectionTestExecutionListener.java:44)
07-Dec-2018 06:03:53         at org.springframework.test.context.TestContextManager.prepareTestInstance(TestContextManager.java:230)
07-Dec-2018 06:03:53         at org.springframework.test.context.junit4.SpringJUnit4ClassRunner.createTest(SpringJUnit4ClassRunner.java:228)
07-Dec-2018 06:03:53         at org.springframework.test.context.junit4.SpringJUnit4ClassRunner$1.runReflectiveCall(SpringJUnit4ClassRunner.java:287)
07-Dec-2018 06:03:53         at org.junit.internal.runners.model.ReflectiveCallable.run(ReflectiveCallable.java:12)
07-Dec-2018 06:03:53         at org.springframework.test.context.junit4.SpringJUnit4ClassRunner.methodBlock(SpringJUnit4ClassRunner.java:289)
07-Dec-2018 06:03:53         at org.springframework.test.context.junit4.SpringJUnit4ClassRunner.runChild(SpringJUnit4ClassRunner.java:247)
07-Dec-2018 06:03:53         at org.springframework.test.context.junit4.SpringJUnit4ClassRunner.runChild(SpringJUnit4ClassRunner.java:94)
07-Dec-2018 06:03:53         at org.junit.runners.ParentRunner$3.run(ParentRunner.java:290)
07-Dec-2018 06:03:53         at org.junit.runners.ParentRunner$1.schedule(ParentRunner.java:71)
07-Dec-2018 06:03:53         at org.junit.runners.ParentRunner.runChildren(ParentRunner.java:288)
07-Dec-2018 06:03:53         at org.junit.runners.ParentRunner.access$000(ParentRunner.java:58)
07-Dec-2018 06:03:53         at org.junit.runners.ParentRunner$2.evaluate(ParentRunner.java:268)
07-Dec-2018 06:03:53         at org.springframework.test.context.junit4.statements.RunBeforeTestClassCallbacks.evaluate(RunBeforeTestClassCallbacks.java:61)
07-Dec-2018 06:03:53         at org.springframework.test.context.junit4.statements.RunAfterTestClassCallbacks.evaluate(RunAfterTestClassCallbacks.java:70)
07-Dec-2018 06:03:53         at org.junit.runners.ParentRunner.run(ParentRunner.java:363)
07-Dec-2018 06:03:53         at org.springframework.test.context.junit4.SpringJUnit4ClassRunner.run(SpringJUnit4ClassRunner.java:191)
07-Dec-2018 06:03:53         at org.apache.maven.surefire.junit4.JUnit4Provider.execute(JUnit4Provider.java:283)
07-Dec-2018 06:03:53         at org.apache.maven.surefire.junit4.JUnit4Provider.executeWithRerun(JUnit4Provider.java:173)
07-Dec-2018 06:03:53         at org.apache.maven.surefire.junit4.JUnit4Provider.executeTestSet(JUnit4Provider.java:153)
07-Dec-2018 06:03:53         at org.apache.maven.surefire.junit4.JUnit4Provider.invoke(JUnit4Provider.java:128)
07-Dec-2018 06:03:53         at org.apache.maven.surefire.booter.ForkedBooter.invokeProviderInSameClassLoader(ForkedBooter.java:203)
07-Dec-2018 06:03:53         at org.apache.maven.surefire.booter.ForkedBooter.runSuitesInProcess(ForkedBooter.java:155)
07-Dec-2018 06:03:53         at org.apache.maven.surefire.booter.ForkedBooter.main(ForkedBooter.java:103)
07-Dec-2018 06:03:53
07-Dec-2018 06:03:53 Running org.springframework.cloud.dataflow.acceptance.test.util.PlatformHelperTests
07-Dec-2018 06:03:53 Tests run: 3, Failures: 0, Errors: 0, Skipped: 0, Time elapsed: 0.049 sec - in org.springframework.cloud.dataflow.acceptance.test.util.PlatformHelperTests
07-Dec-2018 06:03:53 Running org.springframework.cloud.dataflow.acceptance.test.util.ApplicationTests
07-Dec-2018 06:03:53 Tests run: 2, Failures: 0, Errors: 0, Skipped: 0, Time elapsed: 0 sec - in org.springframework.cloud.dataflow.acceptance.test.util.ApplicationTests
07-Dec-2018 06:03:53 2018-12-07 06:03:53.200  INFO 19937 --- [       Thread-6] o.s.c.support.GenericApplicationContext  : Closing org.springframework.context.support.GenericApplicationContext@3ed7821: startup date [Fri Dec 07 06:03:52 UTC 2018]; root of context hierarchy
07-Dec-2018 06:03:53
07-Dec-2018 06:03:53 Results :
07-Dec-2018 06:03:53
07-Dec-2018 06:03:53 Tests in error:
07-Dec-2018 06:03:53   AnalyticsTests.analyticsTest » BeanCreation Error creating bean with name 'org...
07-Dec-2018 06:03:53   HttpSourceTests.httpSourceTests » BeanCreation Error creating bean with name '...
07-Dec-2018 06:03:53   NamedChannelTests.directedGraphTest » BeanCreation Error creating bean with na...
07-Dec-2018 06:03:53   NamedChannelTests.manyToOneTest » BeanCreation Error creating bean with name '...
07-Dec-2018 06:03:53   NamedChannelTests.testDestination » BeanCreation Error creating bean with name...
07-Dec-2018 06:03:53   NamedChannelTests.testTap » BeanCreation Error creating bean with name 'org.sp...
07-Dec-2018 06:03:53   TickTockTests.tickTockTests » BeanCreation Error creating bean with name 'org....
07-Dec-2018 06:03:53   TickTockTests.tickTockTestsFromConfigServer » BeanCreation Error creating bean...
07-Dec-2018 06:03:53   TimestampTaskTests.timeStampTests » BeanCreation Error creating bean with name...
07-Dec-2018 06:03:53   TimestampTaskTests.timeStampTestsMultipleLaunch » BeanCreation Error creating ...
07-Dec-2018 06:03:53   TransformTests.transformTests » BeanCreation Error creating bean with name 'or...
07-Dec-2018 06:03:53   WoodChuckTests.testPartitioning » BeanCreation Error creating bean with name '...
07-Dec-2018 06:03:53
07-Dec-2018 06:03:53 Tests run: 18, Failures: 0, Errors: 12, Skipped: 1
07-Dec-2018 06:03:53
07-Dec-2018 06:03:53 [INFO] ------------------------------------------------------------------------
07-Dec-2018 06:03:53 [INFO] BUILD FAILURE
07-Dec-2018 06:03:53 [INFO] ------------------------------------------------------------------------
07-Dec-2018 06:03:53 [INFO] Total time: 5.567 s
07-Dec-2018 06:03:53 [INFO] Finished at: 2018-12-07T06:03:53+00:00
07-Dec-2018 06:03:53 [INFO] Final Memory: 56M/464M
07-Dec-2018 06:03:53 [INFO] ------------------------------------------------------------------------
07-Dec-2018 06:03:53 [ERROR] Failed to execute goal org.apache.maven.plugins:maven-surefire-plugin:2.18.1:test (default-test) on project spring-cloud-dataflow-acceptance-tests: There are test failures.
07-Dec-2018 06:03:53 [ERROR]
07-Dec-2018 06:03:53 [ERROR] Please refer to /opt/bamboo-home/xml-data/build-dir/SCDT-LOCAL20XSKIPPER20X-KAFKA/target/surefire-reports for the individual test results.
07-Dec-2018 06:03:53 [ERROR] -> [Help 1]
07-Dec-2018 06:03:53 [ERROR]
07-Dec-2018 06:03:53 [ERROR] To see the full stack trace of the errors, re-run Maven with the -e switch.
07-Dec-2018 06:03:53 [ERROR] Re-run Maven using the -X switch to enable full debug logging.
07-Dec-2018 06:03:53 [ERROR]
07-Dec-2018 06:03:53 [ERROR] For more information about the errors and possible solutions, please read the following articles:
07-Dec-2018 06:03:53 [ERROR] [Help 1] http://cwiki.apache.org/confluence/display/MAVEN/MojoFailureException
07-Dec-2018 06:03:53 Clean up, clean up, everybody everywhere; clean up clean up, everybody do your share!
07-Dec-2018 06:03:53 No stopped containers
07-Dec-2018 06:03:54 Stopping mysql_mysql_1 ...
07-Dec-2018 06:03:56
07-Dec-2018 06:03:56 Stopping mysql_mysql_1 ... done
07-Dec-2018 06:03:56 Removing mysql_mysql_1 ...
07-Dec-2018 06:03:56
07-Dec-2018 06:03:56 Removing mysql_mysql_1 ... done
07-Dec-2018 06:03:56 Going to remove mysql_mysql_1
07-Dec-2018 06:03:56 Stopping kafka_kafka_1 ...
07-Dec-2018 06:03:56 Stopping kafka_zookeeper_1 ...
07-Dec-2018 06:03:59
07-Dec-2018 06:03:59 Stopping kafka_kafka_1 ... done
07-Dec-2018 06:04:07
07-Dec-2018 06:04:07 Stopping kafka_zookeeper_1 ... done
07-Dec-2018 06:04:07 Removing kafka_kafka_1 ...
07-Dec-2018 06:04:07 Removing kafka_zookeeper_1 ...
07-Dec-2018 06:04:07
07-Dec-2018 06:04:07 Removing kafka_zookeeper_1 ... done
07-Dec-2018 06:04:07
07-Dec-2018 06:04:07 Removing kafka_kafka_1 ... done
07-Dec-2018 06:04:07 Going to remove kafka_kafka_1, kafka_zookeeper_1
07-Dec-2018 06:04:07
07-Dec-2018 06:04:07 Finished task 'Execute Acceptance Tests' with result: Success
07-Dec-2018 06:04:07 Starting task 'JUnit Parser' of type 'com.atlassian.bamboo.plugins.testresultparser:task.testresultparser.junit'
07-Dec-2018 06:04:07 Parsing test results under /opt/bamboo-home/xml-data/build-dir/SCDT-LOCAL20XSKIPPER20X-KAFKA...
07-Dec-2018 06:04:07 Failing task since 12 failing test cases were found.
07-Dec-2018 06:04:07 Finished task 'JUnit Parser' with result: Failed
07-Dec-2018 06:04:07 Starting task 'clean up' of type 'com.atlassian.bamboo.plugins.scripttask:task.builder.script'
07-Dec-2018 06:04:07
Beginning to execute external process for build 'Spring Cloud Data Flow Acceptance Tests - Local + SCDF-2.0.0.BS + Skipper 2.0.0.BS - Run Data Flow Acceptance Tests for Kafka #23 (SCDT-LOCAL20XSKIPPER20X-KAFKA-23)'
... running command line:
/opt/bamboo-home/temp/SCDT-LOCAL20XSKIPPER20X-KAFKA-23-ScriptBuildTask-525922602799575561.sh
... in: /opt/bamboo-home/xml-data/build-dir/SCDT-LOCAL20XSKIPPER20X-KAFKA
... using extra environment variables:
bamboo_planRepository_1_branch=master
bamboo_********_username_password=********
bamboo_signing_store_password=********
bamboo_capability_system_builder_ant_Ant_1_9=/opt/ant-1.9
bamboo_capability_system_builder_ant_Ant_1_8=/opt/ant-1.8
bamboo_planRepository_1_branchDisplayName=master
bamboo_repository_274694331_git_username=spring-buildmaster
bamboo_capability_system_jdk_OpenJDK_7u181=/opt/openjdk-7
bamboo_repository_revision_number=c658ea8969d0c2aba44f1879b7599caa2700e7a0
bamboo_capability_system_builder_node_Node_js_6=/usr/bin/node
bamboo_RIAK_BIN=/usr/sbin/riak
bamboo_buildKey=SCDT-LOCAL20XSKIPPER20X-KAFKA
bamboo_repository_274694331_branch_name=master
bamboo_sonar_token_password=********
bamboo_shortJobName=Run Data Flow Acceptance Tests for Kafka
bamboo_capability_system_builder_gradle___gradlew=./gradlew
bamboo_buildResultsUrl=https://build.spring.io/browse/SCDT-LOCAL20XSKIPPER20X-KAFKA-23
bamboo_capability_system_builder_mvn3_Maven_3_3=/opt/maven-3.3
bamboo_capability_system_builder_mvn3_Maven_3_2=/opt/maven-3.2
bamboo_capability_system_builder_mvn3_Maven_3_1=/opt/maven-3.1
bamboo_planRepository_repositoryUrl=https://github.com/spring-cloud/spring-cloud-dataflow-acceptance-tests.git
bamboo_agentId=208568325
bamboo_capability_system_builder_mvn3_Maven_3_5=/opt/maven-3.5
bamboo_capability_system_builder_mvn3_Maven_3_0=/opt/maven-3.0
bamboo_planRepository_revision=c658ea8969d0c2aba44f1879b7599caa2700e7a0
bamboo_planRepository_previousRevision=c658ea8969d0c2aba44f1879b7599caa2700e7a0
bamboo_capability_remote_build=true
bamboo_repository_branch_name=master
bamboo_repository_274694331_name=Git
bamboo_scdf_acceptance_tests_password=********
bamboo_dependenciesDisabled=false
bamboo_repository_274694331_git_branch=master
bamboo_capability_Agent=bamboo-02.af.pivotal.io
bamboo_planRepository_branch=master
bamboo_planRepository_1_type=gitv2
bamboo_planRepository_branchName=master
bamboo_sonar_password=********
bamboo_hg_cache_directory=/opt/bamboo-home/xml-data/build-dir/_hg-repositories-cache
bamboo_planRepository_1_username=spring-buildmaster
bamboo_repository_274694331_git_repositoryUrl=https://github.com/spring-cloud/spring-cloud-dataflow-acceptance-tests.git
bamboo_planRepository_type=gitv2
bamboo_ManualBuildTriggerReason_userName=igopinathan
bamboo_git_cache_directory=/opt/bamboo-home/xml-data/build-dir/_git-repositories-cache
bamboo_artifactory_username=buildmaster
bamboo_tmp_directory=/opt/bamboo-home/temp
bamboo_planKey=SCDT-LOCAL20XSKIPPER20X
bamboo_planRepository_username=spring-buildmaster
bamboo_JDK8_HOME=/opt/jdk-8
bamboo_repository_274694331_previous_revision_number=c658ea8969d0c2aba44f1879b7599caa2700e7a0
bamboo_planRepository_1_branchName=master
bamboo_sonar_version=5.6.3
bamboo_capability_system_jdk_JDK_1_11=/opt/jdk-11
bamboo_resultsUrl=https://build.spring.io/browse/SCDT-LOCAL20XSKIPPER20X-KAFKA-23
bamboo_capability_system_jdk_JDK_1_10=/opt/jdk-10
bamboo_build_working_directory=/opt/bamboo-home/xml-data/build-dir/SCDT-LOCAL20XSKIPPER20X-KAFKA
bamboo_planRepository_1_name=Git
bamboo_capability_system_os=ubuntu1604
bamboo_nexusPush_stagingProfile=buildmaster
bamboo_shortPlanName=Local + SCDF-2.0.0.BS + Skipper 2.0.0.BS
bamboo_planRepository_name=Git
bamboo_buildNumber=23
bamboo_planName=Spring Cloud Data Flow Acceptance Tests - Local + SCDF-2.0.0.BS + Skipper 2.0.0.BS
bamboo_JDK7_HOME=/opt/jdk-7
bamboo_build_commandline_com_atlassian_bamboo_plugins_scripttask_task_builder_script_7=/opt/bamboo-home/temp/SCDT-LOCAL20XSKIPPER20X-KAFKA-23-ScriptBuildTask-5241645506350282793.sh
bamboo_shortPlanKey=LOCAL20XSKIPPER20X
bamboo_shortJobKey=KAFKA
bamboo_artifactory_password=********
bamboo_buildTimeStamp=2018-12-07T05:51:14.059Z
bamboo_repository_previous_revision_number=c658ea8969d0c2aba44f1879b7599caa2700e7a0
bamboo_sonar_username=buildmaster
bamboo_********_password=********
bamboo_repository_git_branch=master
bamboo_buildResultKey=SCDT-LOCAL20XSKIPPER20X-KAFKA-23
bamboo_nexusPush_close=true
bamboo_buildPlanName=Spring Cloud Data Flow Acceptance Tests - Local + SCDF-2.0.0.BS + Skipper 2.0.0.BS - Run Data Flow Acceptance Tests for Kafka
bamboo_repository_274694331_revision_number=c658ea8969d0c2aba44f1879b7599caa2700e7a0
bamboo_planRepository_1_revision=c658ea8969d0c2aba44f1879b7599caa2700e7a0
bamboo_repository_name=Git
bamboo_signing_key_password=********
bamboo_buildFailed=true
bamboo_capability_system_docker_executable=/usr/bin/docker
bamboo_capability_system_builder_groovy_Groovy_2_4=/opt/groovy-2.4
bamboo_capability_system_builder_command_Bash=/bin/bash
bamboo_jobFailed=true
bamboo_agentWorkingDirectory=/opt/bamboo-home/xml-data/build-dir
bamboo_capability_system_git_executable=/usr/bin/git
bamboo_repository_git_username=spring-buildmaster
bamboo_planRepository_1_previousRevision=c658ea8969d0c2aba44f1879b7599caa2700e7a0
bamboo_capability_os_family=unix
bamboo_planRepository_branchDisplayName=master
bamboo_capability_system_builder_maven_Artifactory_Maven_3_5=/opt/maven-3.5
bamboo_capability_system_builder_maven_Artifactory_Maven_3_3=/opt/maven-3.3
bamboo_capability_system_builder_maven_Artifactory_Maven_3_2=/opt/maven-3.2
bamboo_s3_properties=/home/bamboo/tools/s3.properties
bamboo_capability_system_builder_maven_Artifactory_Maven_3_1=/opt/maven-3.1
bamboo_capability_system_builder_maven_Artifactory_Maven_3_0=/opt/maven-3.0
bamboo_plan_storageTag=plan-274497908
bamboo_repository_git_repositoryUrl=https://github.com/spring-cloud/spring-cloud-dataflow-acceptance-tests.git
bamboo_working_directory=/opt/bamboo-home/xml-data/build-dir/SCDT-LOCAL20XSKIPPER20X-KAFKA
bamboo_planRepository_1_repositoryUrl=https://github.com/spring-cloud/spring-cloud-dataflow-acceptance-tests.git
bamboo_capability_system_jdk_JDK_1_8=/opt/jdk-8
bamboo_capability_system_jdk_JDK_1_9=/opt/jdk-9
bamboo_capability_system_jdk_JDK_1_6=/opt/jdk-6
bamboo_capability_system_jdk_JDK_1_7=/opt/jdk-7
bamboo_sonar_ip=10.194.6.9
07-Dec-2018 06:04:07 CLEANING UP RESOURCES AFTER RUNNING TESTS
07-Dec-2018 06:04:07 Environment variable JAVA_HOME must be set
07-Dec-2018 06:04:07 FINISHED CLEANING UP RESOURCES
07-Dec-2018 06:04:07 Finished task 'clean up' with result: Success
07-Dec-2018 06:04:07 Running post build plugin 'Docker Container Cleanup'
07-Dec-2018 06:04:07 Running post build plugin 'NCover Results Collector'
07-Dec-2018 06:04:07 Running post build plugin 'Artifactory Release Management Staging'
07-Dec-2018 06:04:07 Running post build plugin 'Artifactory Build Info Copier'
07-Dec-2018 06:04:07 Running post build plugin 'Artifactory Gradle Properties Info Copier'
07-Dec-2018 06:04:07 Running post build plugin 'Clover Results Collector'
07-Dec-2018 06:04:07 Running post build plugin 'npm Cache Cleanup'
07-Dec-2018 06:04:07 Running post build plugin 'Artifact Copier'
07-Dec-2018 06:04:07 Publishing an artifact: Test Results
07-Dec-2018 06:04:07 Finished publishing of artifact Job artifact: [Test Results], pattern: [**/target/surefire-reports/**/*.*] in 43.64 ms
07-Dec-2018 06:04:07 Publishing an artifact: App and Server Logs
07-Dec-2018 06:04:07 Finished publishing of artifact Job artifact: [App and Server Logs], pattern: [**/*.log] anchored at: [local] in 9.534 ms
07-Dec-2018 06:04:07 Successfully removed working directory at '/opt/bamboo-home/xml-data/build-dir/SCDT-LOCAL20XSKIPPER20X-KAFKA'
07-Dec-2018 06:04:07 Finalising the build...
07-Dec-2018 06:04:07 Stopping timer.
07-Dec-2018 06:04:07 Build SCDT-LOCAL20XSKIPPER20X-KAFKA-23 completed.
07-Dec-2018 06:04:07 Running on server: post build plugin 'NCover Results Collector'
07-Dec-2018 06:04:07 Running on server: post build plugin 'Build Hanging Detection Configuration'
07-Dec-2018 06:04:07 Running on server: post build plugin 'Clover Delta Calculator'
07-Dec-2018 06:04:07 Running on server: post build plugin 'Maven Dependencies Postprocessor'
07-Dec-2018 06:04:07 All post build plugins have finished
07-Dec-2018 06:04:07 Generating build results summary...
07-Dec-2018 06:04:07 Saving build results to disk...
07-Dec-2018 06:04:07 Logging substituted variables...
07-Dec-2018 06:04:07 Indexing build results...
07-Dec-2018 06:04:07 Finished building SCDT-LOCAL20XSKIPPER20X-KAFKA-23.