Build: #270 failed

Job: Run Data Flow Acceptance Tests for Kafka failed

Stages & jobs

  1. Test Stage - Kafka

  2. Test Stage - Rabbit

Job result summary

Completed
Duration
23 minutes
Agent
bamboo-24.af.pivotal.io
Revision
e1b8cb19ba2dc672f4d989d7a8353f37785ed476 e1b8cb19ba2dc672f4d989d7a8353f37785ed476
Total tests
22
Failing since
#194 (Scheduled – )

Tests

  • 22 tests in total
  • 3 tests failed
  • 4 tests were quarantined / skipped
  • 21 minutes taken in total.
Existing test failures 3
Status Test Failing since Duration
java.lang.AssertionError: null
	at org.junit.Assert.fail(Assert.java:86)
	at org.junit.Assert.assertTrue(Assert.java:41)
	at org.junit.Assert.assertTrue(Assert.java:52)
	at org.springframework.cloud.dataflow.acceptance.test.ComposedTaskTests.assertTaskExecutions(ComposedTaskTests.java:65)
	at org.springframework.cloud.dataflow.acceptance.test.ComposedTaskTests.ctrLaunch(ComposedTaskTests.java:41)
java.lang.AssertionError: null
	at org.junit.Assert.fail(Assert.java:86)
	at org.junit.Assert.assertTrue(Assert.java:41)
	at org.junit.Assert.assertTrue(Assert.java:52)
	at org.springframework.cloud.dataflow.acceptance.test.ComposedTaskTests.assertTaskExecutions(ComposedTaskTests.java:65)
	at org.springframework.cloud.dataflow.acceptance.test.ComposedTaskTests.ctrMultipleLaunch(ComposedTaskTests.java:47)
java.lang.AssertionError: null
	at org.junit.Assert.fail(Assert.java:86)
	at org.junit.Assert.assertTrue(Assert.java:41)
	at org.junit.Assert.assertTrue(Assert.java:52)
	at org.springframework.cloud.dataflow.acceptance.test.ComposedTaskTests.assertTaskExecutions(ComposedTaskTests.java:65)
	at org.springframework.cloud.dataflow.acceptance.test.ComposedTaskTests.ctrMultipleLaunchWithArguments(ComposedTaskTests.java:57)

Error summary

The build generated some errors. See the full build log for more details.

Pulling mysql (mysql:5.7)...
Creating mysql_mysql_1 ...

Creating mysql_mysql_1 ... done
Pulling zookeeper (wurstmeister/zookeeper:)...
Pulling kafka (wurstmeister/kafka:2.11-0.11.0.3)...
Creating kafka_kafka_1 ...
Creating kafka_zookeeper_1 ...

Creating kafka_zookeeper_1 ... done

Creating kafka_kafka_1     ... done
2020-02-26 00:01:30 URL:https://repo.spring.io/libs-snapshot/org/springframework/cloud/spring-cloud-skipper-server/2.0.4.BUILD-SNAPSHOT/spring-cloud-skipper-server-2.0.4.BUILD-SNAPSHOT.jar [84387317/84387317] -> "/opt/bamboo-home/xml-data/build-dir/SCDT-LOCAL20XSKIPPER20X-KAFKA/local/skipper-server/skipper-server.jar" [1]
Failed to connect to localhost:7577. Attempt  #1/60... will try again in [5] seconds
Failed to connect to localhost:7577. Attempt  #2/60... will try again in [5] seconds
Failed to connect to localhost:7577. Attempt  #3/60... will try again in [5] seconds
Failed to connect to localhost:7577. Attempt  #4/60... will try again in [5] seconds
2020-02-26 00:01:58 URL:https://repo.spring.io/libs-snapshot/org/springframework/cloud/spring-cloud-dataflow-server/2.0.4.BUILD-SNAPSHOT/spring-cloud-dataflow-server-2.0.4.BUILD-SNAPSHOT.jar [87897631/87897631] -> "/opt/bamboo-home/xml-data/build-dir/SCDT-LOCAL20XSKIPPER20X-KAFKA/local/server/scdf-server.jar" [1]
Failed to connect to localhost:9393. Attempt  #1/60... will try again in [5] seconds
Failed to connect to localhost:9393. Attempt  #2/60... will try again in [5] seconds
Failed to connect to localhost:9393. Attempt  #3/60... will try again in [5] seconds
--2020-02-26 00:02:14--  http://localhost:9393/about
Resolving localhost (localhost)... ::1, 127.0.0.1
Connecting to localhost (localhost)|::1|:9393... connected.
HTTP request sent, awaiting response... 200
Length: unspecified [application/hal+json]
Saving to: ‘STDOUT’

     0K .                                                       176M=0s

2020-02-26 00:02:15 (176 MB/s) - written to stdout [1681]

--2020-02-26 00:02:15--  http://localhost:7577/api/about
Resolving localhost (localhost)... ::1, 127.0.0.1
Connecting to localhost (localhost)|::1|:7577... connected.
HTTP request sent, awaiting response... 200
Length: unspecified [application/hal+json]
Saving to: ‘STDOUT’

     0K                                                        55.0M=0s

2020-02-26 00:02:15 (55.0 MB/s) - written to stdout [426]

Killing process PID [9103]
Killing process PID [8984]
Stopping mysql_mysql_1 ...

Stopping mysql_mysql_1 ... done
Removing mysql_mysql_1 ...

Removing mysql_mysql_1 ... done
Stopping kafka_zookeeper_1 ...
Stopping kafka_kafka_1     ...

Stopping kafka_kafka_1     ... done

Stopping kafka_zookeeper_1 ... done
Removing kafka_zookeeper_1 ...
Removing kafka_kafka_1     ...

Removing kafka_kafka_1     ... done

Removing kafka_zookeeper_1 ... done