Build: #286 failed

Job: Run Data Flow Acceptance Tests for Kafka failed

Stages & jobs

  1. Test Stage - Kafka

  2. Test Stage - Rabbit

Job result summary

Completed
Duration
55 minutes
Agent
bamboo-13.af.pivotal.io
Revision
dd41fb40bc32a7a65c2616a8ca39a0a5c2402ad1 dd41fb40bc32a7a65c2616a8ca39a0a5c2402ad1
Total tests
22
Failing since
#194 (Scheduled – )

Tests

  • 22 tests in total
  • 11 tests failed
  • 8 failures are new
  • 4 tests were quarantined / skipped
  • 52 minutes taken in total.
New test failures 8
Status Test Duration
Collapse Failed HttpSourceTests httpSourceTests History
2 mins
org.springframework.web.client.HttpServerErrorException: 500 null
	at org.springframework.web.client.DefaultResponseErrorHandler.handleError(DefaultResponseErrorHandler.java:94)
	at org.springframework.web.client.RestTemplate.handleResponse(RestTemplate.java:667)
	at org.springframework.web.client.RestTemplate.doExecute(RestTemplate.java:620)
	at org.springframework.web.client.RestTemplate.execute(RestTemplate.java:580)
	at org.springframework.web.client.RestTemplate.postForObject(RestTemplate.java:380)
	at org.springframework.cloud.dataflow.acceptance.test.AbstractStreamTests.httpPostData(AbstractStreamTests.java:352)
	at org.springframework.cloud.dataflow.acceptance.test.HttpSourceTests.httpSourceTests(HttpSourceTests.java:45)
Collapse Failed NamedChannelTests manyToOneTest History
7 mins
org.springframework.web.client.HttpServerErrorException: 500 null
	at org.springframework.web.client.DefaultResponseErrorHandler.handleError(DefaultResponseErrorHandler.java:94)
	at org.springframework.web.client.RestTemplate.handleResponse(RestTemplate.java:667)
	at org.springframework.web.client.RestTemplate.doExecute(RestTemplate.java:620)
	at org.springframework.web.client.RestTemplate.execute(RestTemplate.java:580)
	at org.springframework.web.client.RestTemplate.postForObject(RestTemplate.java:380)
	at org.springframework.cloud.dataflow.acceptance.test.AbstractStreamTests.httpPostData(AbstractStreamTests.java:352)
	at org.springframework.cloud.dataflow.acceptance.test.NamedChannelTests.manyToOneTest(NamedChannelTests.java:62)
Collapse Failed NamedChannelTests testDestination History
5 mins
org.springframework.web.client.HttpServerErrorException: 500 null
	at org.springframework.web.client.DefaultResponseErrorHandler.handleError(DefaultResponseErrorHandler.java:94)
	at org.springframework.web.client.RestTemplate.handleResponse(RestTemplate.java:667)
	at org.springframework.web.client.RestTemplate.doExecute(RestTemplate.java:620)
	at org.springframework.web.client.RestTemplate.execute(RestTemplate.java:580)
	at org.springframework.web.client.RestTemplate.postForObject(RestTemplate.java:380)
	at org.springframework.cloud.dataflow.acceptance.test.AbstractStreamTests.httpPostData(AbstractStreamTests.java:352)
	at org.springframework.cloud.dataflow.acceptance.test.NamedChannelTests.testDestination(NamedChannelTests.java:38)
Collapse Failed NamedChannelTests testTap History
5 mins
org.springframework.web.client.HttpServerErrorException: 500 null
	at org.springframework.web.client.DefaultResponseErrorHandler.handleError(DefaultResponseErrorHandler.java:94)
	at org.springframework.web.client.RestTemplate.handleResponse(RestTemplate.java:667)
	at org.springframework.web.client.RestTemplate.doExecute(RestTemplate.java:620)
	at org.springframework.web.client.RestTemplate.execute(RestTemplate.java:580)
	at org.springframework.web.client.RestTemplate.postForObject(RestTemplate.java:380)
	at org.springframework.cloud.dataflow.acceptance.test.AbstractStreamTests.httpPostData(AbstractStreamTests.java:352)
	at org.springframework.cloud.dataflow.acceptance.test.NamedChannelTests.testTap(NamedChannelTests.java:51)
Collapse Failed TickTockTests tickTockTests History
5 mins
java.lang.AssertionError: No output found
	at org.junit.Assert.fail(Assert.java:88)
	at org.junit.Assert.assertTrue(Assert.java:41)
	at org.springframework.cloud.dataflow.acceptance.test.TickTockTests.tickTockTests(TickTockTests.java:50)
Collapse Failed TickTockTests tickTockUpdateRollbackTests History
5 mins
java.lang.AssertionError: No output found
	at org.junit.Assert.fail(Assert.java:88)
	at org.junit.Assert.assertTrue(Assert.java:41)
	at org.springframework.cloud.dataflow.acceptance.test.TickTockTests.tickTockUpdateRollbackTests(TickTockTests.java:70)
Collapse Failed TransformTests transformTests History
4 mins
org.springframework.web.client.HttpServerErrorException: 500 null
	at org.springframework.web.client.DefaultResponseErrorHandler.handleError(DefaultResponseErrorHandler.java:94)
	at org.springframework.web.client.RestTemplate.handleResponse(RestTemplate.java:667)
	at org.springframework.web.client.RestTemplate.doExecute(RestTemplate.java:620)
	at org.springframework.web.client.RestTemplate.execute(RestTemplate.java:580)
	at org.springframework.web.client.RestTemplate.postForObject(RestTemplate.java:380)
	at org.springframework.cloud.dataflow.acceptance.test.AbstractStreamTests.httpPostData(AbstractStreamTests.java:352)
	at org.springframework.cloud.dataflow.acceptance.test.TransformTests.transformTests(TransformTests.java:42)
Collapse Failed WoodChuckTests testPartitioning History
5 mins
org.springframework.web.client.HttpServerErrorException: 500 null
	at org.springframework.web.client.DefaultResponseErrorHandler.handleError(DefaultResponseErrorHandler.java:94)
	at org.springframework.web.client.RestTemplate.handleResponse(RestTemplate.java:667)
	at org.springframework.web.client.RestTemplate.doExecute(RestTemplate.java:620)
	at org.springframework.web.client.RestTemplate.execute(RestTemplate.java:580)
	at org.springframework.web.client.RestTemplate.postForObject(RestTemplate.java:380)
	at org.springframework.cloud.dataflow.acceptance.test.AbstractStreamTests.httpPostData(AbstractStreamTests.java:352)
	at org.springframework.cloud.dataflow.acceptance.test.WoodChuckTests.testPartitioning(WoodChuckTests.java:49)
Existing test failures 3
Status Test Failing since Duration
java.lang.AssertionError: null
	at org.junit.Assert.fail(Assert.java:86)
	at org.junit.Assert.assertTrue(Assert.java:41)
	at org.junit.Assert.assertTrue(Assert.java:52)
	at org.springframework.cloud.dataflow.acceptance.test.ComposedTaskTests.assertTaskExecutions(ComposedTaskTests.java:65)
	at org.springframework.cloud.dataflow.acceptance.test.ComposedTaskTests.ctrLaunch(ComposedTaskTests.java:41)
java.lang.AssertionError: null
	at org.junit.Assert.fail(Assert.java:86)
	at org.junit.Assert.assertTrue(Assert.java:41)
	at org.junit.Assert.assertTrue(Assert.java:52)
	at org.springframework.cloud.dataflow.acceptance.test.ComposedTaskTests.assertTaskExecutions(ComposedTaskTests.java:65)
	at org.springframework.cloud.dataflow.acceptance.test.ComposedTaskTests.ctrMultipleLaunch(ComposedTaskTests.java:47)
java.lang.AssertionError: null
	at org.junit.Assert.fail(Assert.java:86)
	at org.junit.Assert.assertTrue(Assert.java:41)
	at org.junit.Assert.assertTrue(Assert.java:52)
	at org.springframework.cloud.dataflow.acceptance.test.ComposedTaskTests.assertTaskExecutions(ComposedTaskTests.java:65)
	at org.springframework.cloud.dataflow.acceptance.test.ComposedTaskTests.ctrMultipleLaunchWithArguments(ComposedTaskTests.java:57)

Error summary

The build generated some errors. See the full build log for more details.

Pulling mysql (mysql:5.7)...
Creating mysql_mysql_1 ...

Creating mysql_mysql_1 ... done
Starting kafka_kafka_1 ...
Starting kafka_zookeeper_1 ...

Starting kafka_zookeeper_1 ... done

Starting kafka_kafka_1     ... done
2020-03-13 00:02:09 URL:https://repo.spring.io/libs-snapshot/org/springframework/cloud/spring-cloud-skipper-server/2.0.4.BUILD-SNAPSHOT/spring-cloud-skipper-server-2.0.4.BUILD-SNAPSHOT.jar [84387317/84387317] -> "/opt/bamboo-home/xml-data/build-dir/SCDT-LOCAL20XSKIPPER20X-KAFKA/local/skipper-server/skipper-server.jar" [1]
Failed to connect to localhost:7577. Attempt  #1/60... will try again in [5] seconds
Failed to connect to localhost:7577. Attempt  #2/60... will try again in [5] seconds
Failed to connect to localhost:7577. Attempt  #3/60... will try again in [5] seconds
Failed to connect to localhost:7577. Attempt  #4/60... will try again in [5] seconds
2020-03-13 00:02:35 URL:https://repo.spring.io/libs-snapshot/org/springframework/cloud/spring-cloud-dataflow-server/2.0.4.BUILD-SNAPSHOT/spring-cloud-dataflow-server-2.0.4.BUILD-SNAPSHOT.jar [87897631/87897631] -> "/opt/bamboo-home/xml-data/build-dir/SCDT-LOCAL20XSKIPPER20X-KAFKA/local/server/scdf-server.jar" [1]
Failed to connect to localhost:9393. Attempt  #1/60... will try again in [5] seconds
Failed to connect to localhost:9393. Attempt  #2/60... will try again in [5] seconds
Failed to connect to localhost:9393. Attempt  #3/60... will try again in [5] seconds
--2020-03-13 00:02:51--  http://localhost:9393/about
Resolving localhost (localhost)... ::1, 127.0.0.1
Connecting to localhost (localhost)|::1|:9393... connected.
HTTP request sent, awaiting response... 200
Length: unspecified [application/hal+json]
Saving to: ‘STDOUT’

     0K .                                                       165M=0s

2020-03-13 00:02:52 (165 MB/s) - written to stdout [1681]

--2020-03-13 00:02:52--  http://localhost:7577/api/about
Resolving localhost (localhost)... ::1, 127.0.0.1
Connecting to localhost (localhost)|::1|:7577... connected.
HTTP request sent, awaiting response... 200
Length: unspecified [application/hal+json]
Saving to: ‘STDOUT’

     0K                                                        46.6M=0s

2020-03-13 00:02:52 (46.6 MB/s) - written to stdout [426]

Killing process PID [28466]
Killing process PID [28391]
Stopping mysql_mysql_1 ...

Stopping mysql_mysql_1 ... done
Removing mysql_mysql_1 ...

Removing mysql_mysql_1 ... done
Stopping kafka_zookeeper_1 ...

Stopping kafka_zookeeper_1 ... done
Removing kafka_kafka_1     ...
Removing kafka_zookeeper_1 ...

Removing kafka_zookeeper_1 ... done

Removing kafka_kafka_1     ... done