Build: #288 failed

Job: Run Data Flow Acceptance Tests for Kafka failed

Stages & jobs

  1. Test Stage - Kafka

  2. Test Stage - Rabbit

Build log

The build generated 954 lines of output. Download or view full build log

15-Mar-2020 00:00:04 Build Spring Cloud Data Flow Acceptance Tests - Local + SCDF-2.0.4.BS + Skipper 2.0.4.BS (12 am) - Run Data Flow Acceptance Tests for Kafka #288 (SCDT-LOCAL20XSKIPPER20X-KAFKA-288) started building on agent bamboo-21.af.pivotal.io
15-Mar-2020 00:00:04 Remote agent on host bamboo-21.af.pivotal.io
15-Mar-2020 00:00:04 Build working directory is /opt/bamboo-home/xml-data/build-dir/SCDT-LOCAL20XSKIPPER20X-KAFKA
15-Mar-2020 00:00:04 Executing build Spring Cloud Data Flow Acceptance Tests - Local + SCDF-2.0.4.BS + Skipper 2.0.4.BS (12 am) - Run Data Flow Acceptance Tests for Kafka #288 (SCDT-LOCAL20XSKIPPER20X-KAFKA-288)
15-Mar-2020 00:00:04 Starting task 'Checkout Default Repository' of type 'com.atlassian.bamboo.plugins.vcs:task.vcs.checkout'
15-Mar-2020 00:00:04 Checking out into /opt/bamboo-home/xml-data/build-dir/SCDT-LOCAL20XSKIPPER20X-KAFKA
15-Mar-2020 00:00:04 Updating source code to revision: dd41fb40bc32a7a65c2616a8ca39a0a5c2402ad1
15-Mar-2020 00:00:04 Creating local git repository in '/opt/bamboo-home/xml-data/build-dir/SCDT-LOCAL20XSKIPPER20X-KAFKA/.git'.
15-Mar-2020 00:00:04 Initialized empty Git repository in /opt/bamboo-home/xml-data/build-dir/SCDT-LOCAL20XSKIPPER20X-KAFKA/.git/
15-Mar-2020 00:00:05 Fetching 'refs/heads/master' from 'https://github.com/spring-cloud/spring-cloud-dataflow-acceptance-tests.git'.
15-Mar-2020 00:00:06 From https://github.com/spring-cloud/spring-cloud-dataflow-acceptance-tests
15-Mar-2020 00:00:06 * [new branch]      master     -> master
15-Mar-2020 00:00:06 Checking out revision dd41fb40bc32a7a65c2616a8ca39a0a5c2402ad1.
15-Mar-2020 00:00:06 Already on 'master'
15-Mar-2020 00:00:06 Updated source code to revision: dd41fb40bc32a7a65c2616a8ca39a0a5c2402ad1
15-Mar-2020 00:00:06 Finished task 'Checkout Default Repository' with result: Success
15-Mar-2020 00:00:06 Running pre-build action: Artifactory Release Staging
15-Mar-2020 00:00:06 Running pre-build action: VCS Version Collector
15-Mar-2020 00:00:12 Starting task 'Execute Acceptance Tests' of type 'com.atlassian.bamboo.plugins.scripttask:task.builder.script'
15-Mar-2020 00:00:12
Beginning to execute external process for build 'Spring Cloud Data Flow Acceptance Tests - Local + SCDF-2.0.4.BS + Skipper 2.0.4.BS (12 am) - Run Data Flow Acceptance Tests for Kafka #288 (SCDT-LOCAL20XSKIPPER20X-KAFKA-288)'
... running command line:
/opt/bamboo-home/temp/SCDT-LOCAL20XSKIPPER20X-KAFKA-288-ScriptBuildTask-2801486810736389548.sh
... in: /opt/bamboo-home/xml-data/build-dir/SCDT-LOCAL20XSKIPPER20X-KAFKA
... using extra environment variables:
bamboo_planRepository_1_branch=master
bamboo_********_username_password=********
bamboo_signing_store_password=********
bamboo_capability_system_builder_ant_Ant_1_9=/opt/ant-1.9
bamboo_capability_system_builder_ant_Ant_1_8=/opt/ant-1.8
bamboo_planRepository_1_branchDisplayName=master
bamboo_repository_274694331_git_username=spring-buildmaster
bamboo_artifactory_override_resolve_repo=libs-milestone
bamboo_capability_system_builder_node_Node_js_10_16=/opt/node-10.16/bin/node
bamboo_repository_revision_number=dd41fb40bc32a7a65c2616a8ca39a0a5c2402ad1
bamboo_RIAK_BIN=/usr/sbin/riak
bamboo_buildKey=SCDT-LOCAL20XSKIPPER20X-KAFKA
bamboo_repository_274694331_branch_name=master
bamboo_ge_cache_username=ci
bamboo_bintray_password=********
bamboo_gradle_enterprise_cache_user=ci
bamboo_sonar_token_password=********
bamboo_shortJobName=Run Data Flow Acceptance Tests for Kafka
bamboo_artifactory_override_resolver_password=********
bamboo_sonatype_token=RSJChaox
bamboo_capability_system_builder_gradle___gradlew=./gradlew
bamboo_buildResultsUrl=https://build.spring.io/browse/SCDT-LOCAL20XSKIPPER20X-KAFKA-288
bamboo_capability_system_builder_mvn3_Maven_3_3=/opt/maven-3.3
bamboo_capability_system_builder_mvn3_Maven_3_2=/opt/maven-3.2
bamboo_capability_system_builder_mvn3_Maven_3_1=/opt/maven-3.1
bamboo_planRepository_repositoryUrl=https://github.com/spring-cloud/spring-cloud-dataflow-acceptance-tests.git
bamboo_capability_system_builder_mvn3_Maven_3_6=/opt/maven-3.6
bamboo_agentId=286195722
bamboo_capability_system_builder_mvn3_Maven_3_5=/opt/maven-3.5
bamboo_capability_system_builder_mvn3_Maven_3_0=/opt/maven-3.0
bamboo_planRepository_revision=dd41fb40bc32a7a65c2616a8ca39a0a5c2402ad1
bamboo_planRepository_previousRevision=dd41fb40bc32a7a65c2616a8ca39a0a5c2402ad1
bamboo_capability_remote_build=true
bamboo_repository_branch_name=master
bamboo_sonatype_token_password=********
bamboo_sonatype_user=springsource
bamboo_gradle_enterprise_cache_password=********
bamboo_repository_274694331_name=Git
bamboo_scdf_acceptance_tests_password=********
bamboo_APPLE_AC_PASSWORD=********
JAVA_HOME=/opt/jdk-8
bamboo_repository_274694331_git_branch=master
bamboo_gradle_enterprise_secret_access_key=********
bamboo_planRepository_branch=master
bamboo_capability_system_jdk_JDK_15=/opt/jdk-15
bamboo_capability_system_jdk_JDK_13=/opt/jdk-13
bamboo_capability_system_jdk_JDK_14=/opt/jdk-14
bamboo_planRepository_1_type=gitv2
bamboo_planRepository_branchName=master
bamboo_capability_system_jdk_JDK_12=/opt/jdk-12
bamboo_capability_system_builder_gradlew_gradlew=./
bamboo_capability_system_builder_ant_Ant_1_10=/opt/ant-1.10
bamboo_sonar_password=********
bamboo_hg_cache_directory=/opt/bamboo-home/xml-data/build-dir/_hg-repositories-cache
bamboo_planRepository_1_username=spring-buildmaster
bamboo_repository_274694331_git_repositoryUrl=https://github.com/spring-cloud/spring-cloud-dataflow-acceptance-tests.git
bamboo_planRepository_type=gitv2
bamboo_git_cache_directory=/opt/bamboo-home/xml-data/build-dir/_git-repositories-cache
bamboo_artifactory_username=buildmaster
bamboo_tmp_directory=/opt/bamboo-home/temp
bamboo_planKey=SCDT-LOCAL20XSKIPPER20X
bamboo_planRepository_username=spring-buildmaster
bamboo_JDK8_HOME=/opt/jdk-8
bamboo_repository_274694331_previous_revision_number=dd41fb40bc32a7a65c2616a8ca39a0a5c2402ad1
bamboo_planRepository_1_branchName=master
bamboo_sonar_version=6.7.7
bamboo_sonar_jdbc_password=********
bamboo_bintray_api_key_password=********
bamboo_capability_system_jdk_JDK_1_11=/opt/jdk-11
bamboo_resultsUrl=https://build.spring.io/browse/SCDT-LOCAL20XSKIPPER20X-KAFKA-288
bamboo_APPLE_AC_USERNAME_PASSWORD=********
bamboo_capability_system_jdk_JDK_1_10=/opt/jdk-10
bamboo_build_working_directory=/opt/bamboo-home/xml-data/build-dir/SCDT-LOCAL20XSKIPPER20X-KAFKA
bamboo_planRepository_1_name=Git
bamboo_capability_system_os=ubuntu1804
bamboo_nexusPush_stagingProfile=buildmaster
bamboo_shortPlanName=Local + SCDF-2.0.4.BS + Skipper 2.0.4.BS (12 am)
bamboo_planRepository_name=Git
bamboo_buildNumber=288
bamboo_planName=Spring Cloud Data Flow Acceptance Tests - Local + SCDF-2.0.4.BS + Skipper 2.0.4.BS (12 am)
bamboo_JDK7_HOME=/opt/jdk-7
bamboo_shortPlanKey=LOCAL20XSKIPPER20X
bamboo_shortJobKey=KAFKA
bamboo_artifactory_password=********
bamboo_buildTimeStamp=2020-03-15T00:00:04.311Z
bamboo_repository_previous_revision_number=dd41fb40bc32a7a65c2616a8ca39a0a5c2402ad1
bamboo_sonar_username=buildmaster
bamboo_********_password=********
bamboo_repository_git_branch=master
bamboo_buildResultKey=SCDT-LOCAL20XSKIPPER20X-KAFKA-288
bamboo_nexusPush_close=true
bamboo_artifactory_override_resolver_username=buildmaster
bamboo_buildPlanName=Spring Cloud Data Flow Acceptance Tests - Local + SCDF-2.0.4.BS + Skipper 2.0.4.BS (12 am) - Run Data Flow Acceptance Tests for Kafka
bamboo_repository_274694331_revision_number=dd41fb40bc32a7a65c2616a8ca39a0a5c2402ad1
bamboo_planRepository_1_revision=dd41fb40bc32a7a65c2616a8ca39a0a5c2402ad1
bamboo_repository_name=Git
bamboo_signing_key_password=********
bamboo_capability_system_builder_groovy_Groovy_2_5=/opt/groovy-2.5
bamboo_buildFailed=false
bamboo_capability_system_docker_executable=/usr/bin/docker
bamboo_capability_system_jdk_OpenJDK_7=/opt/jdk-7
bamboo_capability_system_builder_groovy_Groovy_2_4=/opt/groovy-2.4
bamboo_artifactory_override_deployer_username=buildmaster
bamboo_capability_system_builder_command_Bash=/bin/bash
bamboo_agentWorkingDirectory=/opt/bamboo-home/xml-data/build-dir
bamboo_capability_system_git_executable=/usr/bin/git
bamboo_repository_git_username=spring-buildmaster
bamboo_planRepository_1_previousRevision=dd41fb40bc32a7a65c2616a8ca39a0a5c2402ad1
bamboo_capability_os_family=unix
bamboo_planRepository_branchDisplayName=master
bamboo_capability_system_builder_maven_Artifactory_Maven_3_6=/opt/maven-3.6
bamboo_capability_system_builder_maven_Artifactory_Maven_3_5=/opt/maven-3.5
bamboo_capability_system_builder_maven_Artifactory_Maven_3_3=/opt/maven-3.3
bamboo_capability_system_builder_maven_Artifactory_Maven_3_2=/opt/maven-3.2
bamboo_s3_properties=/home/bamboo/tools/s3.properties
bamboo_capability_system_builder_maven_Artifactory_Maven_3_1=/opt/maven-3.1
bamboo_artifactory_override_deploy_repo=libs-snapshot-local
bamboo_capability_system_builder_maven_Artifactory_Maven_3_0=/opt/maven-3.0
bamboo_plan_storageTag=plan-274497908
bamboo_bintray_username_password=********
bamboo_repository_git_repositoryUrl=https://github.com/spring-cloud/spring-cloud-dataflow-acceptance-tests.git
bamboo_working_directory=/opt/bamboo-home/xml-data/build-dir/SCDT-LOCAL20XSKIPPER20X-KAFKA
bamboo_planRepository_1_repositoryUrl=https://github.com/spring-cloud/spring-cloud-dataflow-acceptance-tests.git
bamboo_capability_system_jdk_JDK_1_8=/opt/jdk-8
bamboo_artifactory_override_deployer_password=********
bamboo_capability_system_jdk_JDK_1_9=/opt/jdk-9
bamboo_capability_system_jdk_JDK_1_6=/opt/jdk-6
bamboo_sonatype_password=********
bamboo_capability_system_jdk_JDK_1_7=/opt/jdk-7
bamboo_sonar_ip=10.194.6.9
bamboo_ge_cache_password=********
15-Mar-2020 00:00:12 CLEANING UP RESOURCES BEFORE TESTS
15-Mar-2020 00:00:12 Setting the environment variables
15-Mar-2020 00:00:12 Export the unset env. variables from /opt/bamboo-home/xml-data/build-dir/SCDT-LOCAL20XSKIPPER20X-KAFKA/local/init/env.properties :
15-Mar-2020 00:00:12    SPRING_CLOUD_DATAFLOW_SERVER_DOWNLOAD_URL = https://repo.spring.io/libs-snapshot/org/springframework/cloud/spring-cloud-dataflow-server-local//spring-cloud-dataflow-server-local-.jar
15-Mar-2020 00:00:12    SPRING_CLOUD_SKIPPER_SERVER_DOWNLOAD_URL = https://repo.spring.io/libs-snapshot/org/springframework/cloud/spring-cloud-skipper-server//spring-cloud-skipper-server-.jar
15-Mar-2020 00:00:12    SPRING_DATASOURCE_USERNAME = spring
15-Mar-2020 00:00:12    SPRING_DATASOURCE_PASSWORD = cloud
15-Mar-2020 00:00:12    SPRING_SCHEMA_NAME = dataflow
15-Mar-2020 00:00:12    DOCKER_SERVER = localhost
15-Mar-2020 00:00:12 Setting retries to 60 and WAIT_TIME to 5
15-Mar-2020 00:00:12 Export the unset env. variables from /opt/bamboo-home/xml-data/build-dir/SCDT-LOCAL20XSKIPPER20X-KAFKA/local/binder/rabbit/env.properties :
15-Mar-2020 00:00:12    STREAM_REGISTRATION_RESOURCE = https://dataflow.spring.io/latest-stream-applications-rabbit-maven
15-Mar-2020 00:00:12    TASK_REGISTRATION_RESOURCE = https://dataflow.spring.io/latest-task-applications-maven
15-Mar-2020 00:00:12 SCDF SERVER URI: http://localhost:9393
15-Mar-2020 00:00:12 Clean up, clean up, everybody everywhere; clean up clean up, everybody do your share!
15-Mar-2020 00:00:12 Clean up servers
15-Mar-2020 00:00:13 No stopped containers
15-Mar-2020 00:00:14 No stopped containers
15-Mar-2020 00:00:15 No stopped containers
15-Mar-2020 00:00:15 FINISHED CLEANING UP RESOURCES
15-Mar-2020 00:00:15 Setting the environment variables
15-Mar-2020 00:00:15 Export the unset env. variables from /opt/bamboo-home/xml-data/build-dir/SCDT-LOCAL20XSKIPPER20X-KAFKA/local/init/env.properties :
15-Mar-2020 00:00:15    SPRING_CLOUD_DATAFLOW_SERVER_DOWNLOAD_URL = https://repo.spring.io/libs-snapshot/org/springframework/cloud/spring-cloud-dataflow-server/2.0.4.BUILD-SNAPSHOT/spring-cloud-dataflow-server-2.0.4.BUILD-SNAPSHOT.jar
15-Mar-2020 00:00:15    SPRING_CLOUD_SKIPPER_SERVER_DOWNLOAD_URL = https://repo.spring.io/libs-snapshot/org/springframework/cloud/spring-cloud-skipper-server/2.0.4.BUILD-SNAPSHOT/spring-cloud-skipper-server-2.0.4.BUILD-SNAPSHOT.jar
15-Mar-2020 00:00:15    SPRING_DATASOURCE_USERNAME = spring
15-Mar-2020 00:00:15    SPRING_DATASOURCE_PASSWORD = cloud
15-Mar-2020 00:00:15    SPRING_SCHEMA_NAME = dataflow
15-Mar-2020 00:00:15    DOCKER_SERVER = localhost
15-Mar-2020 00:00:15 Setting retries to 60 and WAIT_TIME to 5
15-Mar-2020 00:00:15 cleaning up any previous mysql docker containers...
15-Mar-2020 00:00:15 done cleaning up.
15-Mar-2020 00:00:15 Could not find a local mysql server, trying docker.
15-Mar-2020 00:00:15 Pulling mysql (mysql:5.7)...
15-Mar-2020 00:00:16 5.7: Pulling from library/mysql
15-Mar-2020 00:00:46 Digest: sha256:f4a5f5be3d94b4f4d3aef00fbc276ce7c08e62f2e1f28867d930deb73a314c58
15-Mar-2020 00:00:46 Status: Downloaded newer image for mysql:5.7
15-Mar-2020 00:00:46 Creating mysql_mysql_1 ...
15-Mar-2020 00:00:47
15-Mar-2020 00:00:47 Creating mysql_mysql_1 ... done
15-Mar-2020 00:00:47 mysql running on localhost:3306
15-Mar-2020 00:00:47 Service host is localhost
15-Mar-2020 00:00:47 Creating kafka compose file on /opt/bamboo-home/xml-data/build-dir/SCDT-LOCAL20XSKIPPER20X-KAFKA/local/binder/kafka/docker-compose.yml
15-Mar-2020 00:00:47 cleaning up any previous kafka docker containers...
15-Mar-2020 00:00:47 done cleaning up
15-Mar-2020 00:00:47 Could not find a local kafka server, trying docker.
15-Mar-2020 00:00:48 Pulling zookeeper (wurstmeister/zookeeper:)...
15-Mar-2020 00:00:50 latest: Pulling from wurstmeister/zookeeper
15-Mar-2020 00:01:51 Digest: sha256:7a7fd44a72104bfbd24a77844bad5fabc86485b036f988ea927d1780782a6680
15-Mar-2020 00:01:51 Status: Downloaded newer image for wurstmeister/zookeeper:latest
15-Mar-2020 00:01:51 Pulling kafka (wurstmeister/kafka:2.11-0.11.0.3)...
15-Mar-2020 00:01:54 2.11-0.11.0.3: Pulling from wurstmeister/kafka
15-Mar-2020 00:02:36 Digest: sha256:03f36fe3a978b3c6858a34bbbf9bc56ff6580ee0e6c7bb8eb000af5ca1fcd816
15-Mar-2020 00:02:36 Status: Downloaded newer image for wurstmeister/kafka:2.11-0.11.0.3
15-Mar-2020 00:02:36 Creating kafka_zookeeper_1 ...
15-Mar-2020 00:02:36 Creating kafka_kafka_1     ...
15-Mar-2020 00:02:37
15-Mar-2020 00:02:37 Creating kafka_kafka_1     ... done
15-Mar-2020 00:02:38
15-Mar-2020 00:02:38 Creating kafka_zookeeper_1 ... done
15-Mar-2020 00:02:38 kafka running on localhost:9092
15-Mar-2020 00:02:38 Export the unset env. variables from /opt/bamboo-home/xml-data/build-dir/SCDT-LOCAL20XSKIPPER20X-KAFKA/local/binder/kafka/env.properties :
15-Mar-2020 00:02:38    STREAM_REGISTRATION_RESOURCE = https://dataflow.spring.io/latest-stream-applications-kafka-maven
15-Mar-2020 00:02:38    TASK_REGISTRATION_RESOURCE = https://dataflow.spring.io/latest-task-applications-maven
15-Mar-2020 00:02:38 cleaning up any previous redis docker containers...
15-Mar-2020 00:02:38 done cleaning up.
15-Mar-2020 00:02:40 redis found on localhost
15-Mar-2020 00:02:40 SKIPPER SERVER URI: http://localhost:7577
15-Mar-2020 00:02:40 Downloading server from https://repo.spring.io/libs-snapshot/org/springframework/cloud/spring-cloud-skipper-server/2.0.4.BUILD-SNAPSHOT/spring-cloud-skipper-server-2.0.4.BUILD-SNAPSHOT.jar
15-Mar-2020 00:02:50 2020-03-15 00:02:50 URL:https://repo.spring.io/libs-snapshot/org/springframework/cloud/spring-cloud-skipper-server/2.0.4.BUILD-SNAPSHOT/spring-cloud-skipper-server-2.0.4.BUILD-SNAPSHOT.jar [84387317/84387317] -> "/opt/bamboo-home/xml-data/build-dir/SCDT-LOCAL20XSKIPPER20X-KAFKA/local/skipper-server/skipper-server.jar" [1]
15-Mar-2020 00:02:50 executing [nohup /opt/jdk-8/bin/java  -Dlogging.level.org.springframework.cloud.deployer.spi.local.LocalAppDeployer=DEBUG -Xmx1024m -Xss1024k -jar /opt/bamboo-home/xml-data/build-dir/SCDT-LOCAL20XSKIPPER20X-KAFKA/local/skipper-server/skipper-server.jar  --spring.datasource.driver-class-name=org.mariadb.jdbc.Driver --spring.datasource.url=jdbc:mysql://localhost/dataflow --spring.datasource.username=spring --spring.datasource.password=cloud  --spring.cloud.dataflow.applicationProperties.stream.spring.cloud.stream.kafka.binder.brokers=localhost --spring.cloud.dataflow.applicationProperties.stream.spring.cloud.stream.kafka.binder.zkNodes=localhost  --spring.redis.host=127.0.0.1 --spring.cloud.skipper.server.platform.local.accounts.default.workingDirectoriesRoot=/opt/bamboo-home/xml-data/build-dir/SCDT-LOCAL20XSKIPPER20X-KAFKA/local/skipper-server/app-logs > /opt/bamboo-home/xml-data/build-dir/SCDT-LOCAL20XSKIPPER20X-KAFKA/local/skipper-server/skipper-server.log &]
15-Mar-2020 00:02:50 [/opt/bamboo-home/xml-data/build-dir/SCDT-LOCAL20XSKIPPER20X-KAFKA/local/skipper-server] process pid is [3724]
15-Mar-2020 00:02:50 System props are []
15-Mar-2020 00:02:50 Logs are under [/opt/bamboo-home/xml-data/build-dir/SCDT-LOCAL20XSKIPPER20X-KAFKA/local/skipper-server/skipper-server.log] or from nohup [/opt/bamboo-home/xml-data/build-dir/SCDT-LOCAL20XSKIPPER20X-KAFKA/local/skipper-server/nohup.log]
15-Mar-2020 00:02:50 Failed to connect to localhost:7577. Attempt  #1/60... will try again in [5] seconds
15-Mar-2020 00:02:55 Failed to connect to localhost:7577. Attempt  #2/60... will try again in [5] seconds
15-Mar-2020 00:03:00 Failed to connect to localhost:7577. Attempt  #3/60... will try again in [5] seconds
15-Mar-2020 00:03:05 Failed to connect to localhost:7577. Attempt  #4/60... will try again in [5] seconds
15-Mar-2020 00:03:11 SCDF SERVER URI: http://localhost:9393
15-Mar-2020 00:03:11 Downloading server from https://repo.spring.io/libs-snapshot/org/springframework/cloud/spring-cloud-dataflow-server/2.0.4.BUILD-SNAPSHOT/spring-cloud-dataflow-server-2.0.4.BUILD-SNAPSHOT.jar
15-Mar-2020 00:03:28 2020-03-15 00:03:28 URL:https://repo.spring.io/libs-snapshot/org/springframework/cloud/spring-cloud-dataflow-server/2.0.4.BUILD-SNAPSHOT/spring-cloud-dataflow-server-2.0.4.BUILD-SNAPSHOT.jar [87897631/87897631] -> "/opt/bamboo-home/xml-data/build-dir/SCDT-LOCAL20XSKIPPER20X-KAFKA/local/server/scdf-server.jar" [1]
15-Mar-2020 00:03:28 SPRING_PROFILES_ACTIVE []
15-Mar-2020 00:03:28 executing [nohup /opt/jdk-8/bin/java  -Xmx1024m -Xss1024k -jar /opt/bamboo-home/xml-data/build-dir/SCDT-LOCAL20XSKIPPER20X-KAFKA/local/server/scdf-server.jar  --spring.datasource.driver-class-name=org.mariadb.jdbc.Driver --spring.datasource.url=jdbc:mysql://localhost/dataflow --spring.datasource.username=spring --spring.datasource.password=cloud  --spring.cloud.dataflow.applicationProperties.stream.spring.cloud.stream.kafka.binder.brokers=localhost --spring.cloud.dataflow.applicationProperties.stream.spring.cloud.stream.kafka.binder.zkNodes=localhost  --spring.redis.host=127.0.0.1 --spring.cloud.skipper.server.platform.local.accounts.default.workingDirectoriesRoot=/opt/bamboo-home/xml-data/build-dir/SCDT-LOCAL20XSKIPPER20X-KAFKA/local/skipper-server/app-logs --spring.cloud.dataflow.features.skipper-enabled=true > /opt/bamboo-home/xml-data/build-dir/SCDT-LOCAL20XSKIPPER20X-KAFKA/local/server/scdf-server.log &]
15-Mar-2020 00:03:28 [/opt/bamboo-home/xml-data/build-dir/SCDT-LOCAL20XSKIPPER20X-KAFKA/local/server] process pid is [3848]
15-Mar-2020 00:03:28 System props are []
15-Mar-2020 00:03:28 Logs are under [/opt/bamboo-home/xml-data/build-dir/SCDT-LOCAL20XSKIPPER20X-KAFKA/local/server/scdf-server.log] or from nohup [/opt/bamboo-home/xml-data/build-dir/SCDT-LOCAL20XSKIPPER20X-KAFKA/local/server/nohup.log]
15-Mar-2020 00:03:28 Failed to connect to localhost:9393. Attempt  #1/60... will try again in [5] seconds
15-Mar-2020 00:03:33 Failed to connect to localhost:9393. Attempt  #2/60... will try again in [5] seconds
15-Mar-2020 00:03:38 Failed to connect to localhost:9393. Attempt  #3/60... will try again in [5] seconds
15-Mar-2020 00:03:44 SCDF SERVER ABOUT:
15-Mar-2020 00:03:44 --2020-03-15 00:03:44--  http://localhost:9393/about
15-Mar-2020 00:03:44 Resolving localhost (localhost)... ::1, 127.0.0.1
15-Mar-2020 00:03:44 Connecting to localhost (localhost)|::1|:9393... connected.
15-Mar-2020 00:03:44 HTTP request sent, awaiting response... 200
15-Mar-2020 00:03:44 Length: unspecified [application/hal+json]
15-Mar-2020 00:03:44 Saving to: ‘STDOUT’
15-Mar-2020 00:03:44
15-Mar-2020 00:03:44      0K .                                                       161M=0s
15-Mar-2020 00:03:44 {
15-Mar-2020 00:03:44     "_links": {
15-Mar-2020 00:03:44         "self": {
15-Mar-2020 00:03:44
15-Mar-2020 00:03:44             "href": "http://localhost:9393/about"
15-Mar-2020 00:03:44 2020-03-15 00:03:44 (161 MB/s) - written to stdout [1681]
15-Mar-2020 00:03:44         }
15-Mar-2020 00:03:44
15-Mar-2020 00:03:44     },
15-Mar-2020 00:03:44     "featureInfo": {
15-Mar-2020 00:03:44         "analyticsEnabled": true,
15-Mar-2020 00:03:44         "grafanaEnabled": false,
15-Mar-2020 00:03:44         "schedulesEnabled": false,
15-Mar-2020 00:03:44         "streamsEnabled": true,
15-Mar-2020 00:03:44         "tasksEnabled": true
15-Mar-2020 00:03:44     },
15-Mar-2020 00:03:44     "grafanaInfo": {
15-Mar-2020 00:03:44         "refreshInterval": 15,
15-Mar-2020 00:03:44         "url": ""
15-Mar-2020 00:03:44     },
15-Mar-2020 00:03:44     "runtimeEnvironment": {
15-Mar-2020 00:03:44         "appDeployer": {
15-Mar-2020 00:03:44             "deployerImplementationVersion": "2.0.4.BUILD-SNAPSHOT",
15-Mar-2020 00:03:44             "deployerName": "Spring Cloud Skipper Server",
15-Mar-2020 00:03:44             "deployerSpiVersion": "2.0.3.RELEASE",
15-Mar-2020 00:03:44             "javaVersion": "1.8.0_232",
15-Mar-2020 00:03:44             "platformApiVersion": "",
15-Mar-2020 00:03:44             "platformClientVersion": "",
15-Mar-2020 00:03:44             "platformHostVersion": "",
15-Mar-2020 00:03:44             "platformSpecificInfo": {
15-Mar-2020 00:03:44                 "default": "local"
15-Mar-2020 00:03:44             },
15-Mar-2020 00:03:44             "platformType": "Skipper Managed",
15-Mar-2020 00:03:44             "springBootVersion": "2.1.3.RELEASE",
15-Mar-2020 00:03:44             "springVersion": "5.1.5.RELEASE"
15-Mar-2020 00:03:44         },
15-Mar-2020 00:03:44         "taskLaunchers": [
15-Mar-2020 00:03:44             {
15-Mar-2020 00:03:44                 "deployerImplementationVersion": "2.0.3.RELEASE",
15-Mar-2020 00:03:44                 "deployerName": "LocalTaskLauncher",
15-Mar-2020 00:03:44                 "deployerSpiVersion": "2.0.2.RELEASE",
15-Mar-2020 00:03:44                 "javaVersion": "1.8.0_232",
15-Mar-2020 00:03:44                 "platformApiVersion": "Linux 4.15.0-76-generic",
15-Mar-2020 00:03:44                 "platformClientVersion": "4.15.0-76-generic",
15-Mar-2020 00:03:44                 "platformHostVersion": "4.15.0-76-generic",
15-Mar-2020 00:03:44                 "platformSpecificInfo": {},
15-Mar-2020 00:03:44                 "platformType": "Local",
15-Mar-2020 00:03:44                 "springBootVersion": "2.1.3.RELEASE",
15-Mar-2020 00:03:44                 "springVersion": "5.1.5.RELEASE"
15-Mar-2020 00:03:44             }
15-Mar-2020 00:03:44         ]
15-Mar-2020 00:03:44     },
15-Mar-2020 00:03:44     "securityInfo": {
15-Mar-2020 00:03:44         "authenticated": false,
15-Mar-2020 00:03:44         "authenticationEnabled": false,
15-Mar-2020 00:03:44         "roles": [],
15-Mar-2020 00:03:44         "username": null
15-Mar-2020 00:03:44     },
15-Mar-2020 00:03:44     "versionInfo": {
15-Mar-2020 00:03:44         "core": {
15-Mar-2020 00:03:44             "name": "Spring Cloud Data Flow Core",
15-Mar-2020 00:03:44             "version": "2.0.4.BUILD-SNAPSHOT"
15-Mar-2020 00:03:44         },
15-Mar-2020 00:03:44         "dashboard": {
15-Mar-2020 00:03:44             "name": "Spring Cloud Dataflow UI",
15-Mar-2020 00:03:44             "version": "2.0.3.RELEASE"
15-Mar-2020 00:03:44         },
15-Mar-2020 00:03:44         "implementation": {
15-Mar-2020 00:03:44             "name": "spring-cloud-dataflow-server",
15-Mar-2020 00:03:44             "version": "2.0.4.BUILD-SNAPSHOT"
15-Mar-2020 00:03:44         },
15-Mar-2020 00:03:44         "shell": {
15-Mar-2020 00:03:44             "name": "Spring Cloud Data Flow Shell",
15-Mar-2020 00:03:44             "url": "https://repo.spring.io/libs-snapshot/org/springframework/cloud/spring-cloud-dataflow-shell/2.0.4.BUILD-SNAPSHOT/spring-cloud-dataflow-shell-2.0.4.BUILD-SNAPSHOT.jar",
15-Mar-2020 00:03:44             "version": "2.0.4.BUILD-SNAPSHOT"
15-Mar-2020 00:03:44         }
15-Mar-2020 00:03:44     }
15-Mar-2020 00:03:44 }
15-Mar-2020 00:03:44 SKIPPER SERVER ABOUT:
15-Mar-2020 00:03:44 --2020-03-15 00:03:44--  http://localhost:7577/api/about
15-Mar-2020 00:03:44 Resolving localhost (localhost)... ::1, 127.0.0.1
15-Mar-2020 00:03:44 Connecting to localhost (localhost)|::1|:7577... connected.
15-Mar-2020 00:03:44 HTTP request sent, awaiting response... 200
15-Mar-2020 00:03:44 Length: unspecified [application/hal+json]
15-Mar-2020 00:03:44 Saving to: ‘STDOUT’
15-Mar-2020 00:03:44
15-Mar-2020 00:03:44      0K                                                        48.8M=0s
15-Mar-2020 00:03:44
15-Mar-2020 00:03:44 2020-03-15 00:03:44 (48.8 MB/s) - written to stdout [426]
15-Mar-2020 00:03:44
15-Mar-2020 00:03:44 {
15-Mar-2020 00:03:44     "versionInfo": {
15-Mar-2020 00:03:44         "server": {
15-Mar-2020 00:03:44             "name": "Spring Cloud Skipper Server",
15-Mar-2020 00:03:44             "version": "2.0.4.BUILD-SNAPSHOT"
15-Mar-2020 00:03:44         },
15-Mar-2020 00:03:44         "shell": {
15-Mar-2020 00:03:44             "name": "Spring Cloud Skipper Shell",
15-Mar-2020 00:03:44             "url": "https://repo.spring.io/libs-snapshot/org/springframework/cloud/spring-cloud-skipper-shell/2.0.4.BUILD-SNAPSHOT/spring-cloud-skipper-shell-2.0.4.BUILD-SNAPSHOT.jar",
15-Mar-2020 00:03:44             "version": "2.0.4.BUILD-SNAPSHOT"
15-Mar-2020 00:03:44         }
15-Mar-2020 00:03:44     }
15-Mar-2020 00:03:44 }
15-Mar-2020 00:03:45 [INFO] Scanning for projects...
15-Mar-2020 00:03:46 [INFO] Downloading: https://repo.spring.io/libs-snapshot-local/org/codehaus/mojo/maven-metadata.xml
15-Mar-2020 00:03:46 [INFO] Downloading: https://repo.spring.io/libs-snapshot-local/org/apache/maven/plugins/maven-metadata.xml
15-Mar-2020 00:03:46 [INFO] Downloading: https://repo.spring.io/libs-milestone-local/org/codehaus/mojo/maven-metadata.xml
15-Mar-2020 00:03:46 [INFO] Downloading: https://repo.spring.io/libs-milestone-local/org/apache/maven/plugins/maven-metadata.xml
15-Mar-2020 00:03:46 [INFO] Downloading: https://repo.spring.io/libs-milestone-local/org/apache/maven/plugins/maven-surefire-report-plugin/maven-metadata.xml
15-Mar-2020 00:03:46 [INFO] Downloading: https://repo.spring.io/libs-snapshot-local/org/apache/maven/plugins/maven-surefire-report-plugin/maven-metadata.xml
15-Mar-2020 00:03:47 [INFO]                                                                         
15-Mar-2020 00:03:47 [INFO] ------------------------------------------------------------------------
15-Mar-2020 00:03:47 [INFO] Building Data Flow Acceptance Tests 1.1.0.BUILD-SNAPSHOT
15-Mar-2020 00:03:47 [INFO] ------------------------------------------------------------------------
15-Mar-2020 00:03:47 [INFO] Downloading: https://repo.spring.io/libs-snapshot-local/org/springframework/cloud/spring-cloud-dataflow-rest-client/1.7.0.BUILD-SNAPSHOT/maven-metadata.xml
15-Mar-2020 00:03:47 [INFO] Downloaded: https://repo.spring.io/libs-snapshot-local/org/springframework/cloud/spring-cloud-dataflow-rest-client/1.7.0.BUILD-SNAPSHOT/maven-metadata.xml (2 KB at 7.0 KB/sec)
15-Mar-2020 00:03:47 [INFO] Downloading: https://repo.spring.io/libs-snapshot-local/org/springframework/cloud/spring-cloud-dataflow-parent/1.7.0.BUILD-SNAPSHOT/maven-metadata.xml
15-Mar-2020 00:03:48 [INFO] Downloaded: https://repo.spring.io/libs-snapshot-local/org/springframework/cloud/spring-cloud-dataflow-parent/1.7.0.BUILD-SNAPSHOT/maven-metadata.xml (646 B at 3.6 KB/sec)
15-Mar-2020 00:03:48 [INFO] Downloading: https://repo.spring.io/libs-snapshot-local/org/springframework/cloud/spring-cloud-dataflow-dependencies/1.7.0.BUILD-SNAPSHOT/maven-metadata.xml
15-Mar-2020 00:03:48 [INFO] Downloaded: https://repo.spring.io/libs-snapshot-local/org/springframework/cloud/spring-cloud-dataflow-dependencies/1.7.0.BUILD-SNAPSHOT/maven-metadata.xml (652 B at 4.0 KB/sec)
15-Mar-2020 00:03:48 [INFO] Downloading: https://repo.spring.io/libs-snapshot-local/org/springframework/cloud/spring-cloud-dataflow-rest-resource/1.7.0.BUILD-SNAPSHOT/maven-metadata.xml
15-Mar-2020 00:03:48 [INFO] Downloaded: https://repo.spring.io/libs-snapshot-local/org/springframework/cloud/spring-cloud-dataflow-rest-resource/1.7.0.BUILD-SNAPSHOT/maven-metadata.xml (2 KB at 6.4 KB/sec)
15-Mar-2020 00:03:48 [INFO] Downloading: https://repo.spring.io/libs-snapshot-local/org/springframework/cloud/spring-cloud-dataflow-core/1.7.0.BUILD-SNAPSHOT/maven-metadata.xml
15-Mar-2020 00:03:48 [INFO] Downloaded: https://repo.spring.io/libs-snapshot-local/org/springframework/cloud/spring-cloud-dataflow-core/1.7.0.BUILD-SNAPSHOT/maven-metadata.xml (2 KB at 6.9 KB/sec)
15-Mar-2020 00:03:48 [INFO]
15-Mar-2020 00:03:48 [INFO] --- maven-checkstyle-plugin:2.17:check (checkstyle-validation) @ spring-cloud-dataflow-acceptance-tests ---
15-Mar-2020 00:03:49 [INFO]
15-Mar-2020 00:03:49 [INFO] --- maven-resources-plugin:2.6:resources (default-resources) @ spring-cloud-dataflow-acceptance-tests ---
15-Mar-2020 00:03:49 [INFO] Using 'UTF-8' encoding to copy filtered resources.
15-Mar-2020 00:03:49 [INFO] skip non existing resourceDirectory /opt/bamboo-home/xml-data/build-dir/SCDT-LOCAL20XSKIPPER20X-KAFKA/src/main/resources
15-Mar-2020 00:03:49 [INFO] skip non existing resourceDirectory /opt/bamboo-home/xml-data/build-dir/SCDT-LOCAL20XSKIPPER20X-KAFKA/src/main/resources
15-Mar-2020 00:03:49 [INFO]
15-Mar-2020 00:03:49 [INFO] --- maven-compiler-plugin:3.1:compile (default-compile) @ spring-cloud-dataflow-acceptance-tests ---
15-Mar-2020 00:03:50 [INFO] Changes detected - recompiling the module!
15-Mar-2020 00:03:50 [INFO] Compiling 8 source files to /opt/bamboo-home/xml-data/build-dir/SCDT-LOCAL20XSKIPPER20X-KAFKA/target/classes
15-Mar-2020 00:03:50 [INFO]
15-Mar-2020 00:03:50 [INFO] --- maven-resources-plugin:2.6:testResources (default-testResources) @ spring-cloud-dataflow-acceptance-tests ---
15-Mar-2020 00:03:50 [INFO] Using 'UTF-8' encoding to copy filtered resources.
15-Mar-2020 00:03:50 [INFO] Copying 1 resource
15-Mar-2020 00:03:50 [INFO]
15-Mar-2020 00:03:50 [INFO] --- maven-compiler-plugin:3.1:testCompile (default-testCompile) @ spring-cloud-dataflow-acceptance-tests ---
15-Mar-2020 00:03:50 [INFO] Changes detected - recompiling the module!
15-Mar-2020 00:03:50 [INFO] Compiling 16 source files to /opt/bamboo-home/xml-data/build-dir/SCDT-LOCAL20XSKIPPER20X-KAFKA/target/test-classes
15-Mar-2020 00:03:51 [WARNING] /opt/bamboo-home/xml-data/build-dir/SCDT-LOCAL20XSKIPPER20X-KAFKA/src/test/java/org/springframework/cloud/dataflow/acceptance/test/AbstractTaskTests.java: Some input files use unchecked or unsafe operations.
15-Mar-2020 00:03:51 [WARNING] /opt/bamboo-home/xml-data/build-dir/SCDT-LOCAL20XSKIPPER20X-KAFKA/src/test/java/org/springframework/cloud/dataflow/acceptance/test/AbstractTaskTests.java: Recompile with -Xlint:unchecked for details.
15-Mar-2020 00:03:51 [INFO]
15-Mar-2020 00:03:51 [INFO] --- maven-surefire-plugin:2.18.1:test (default-test) @ spring-cloud-dataflow-acceptance-tests ---
15-Mar-2020 00:03:51 [INFO] Surefire report directory: /opt/bamboo-home/xml-data/build-dir/SCDT-LOCAL20XSKIPPER20X-KAFKA/target/surefire-reports
15-Mar-2020 00:03:51
15-Mar-2020 00:03:51 -------------------------------------------------------
15-Mar-2020 00:03:51 T E S T S
15-Mar-2020 00:03:51 -------------------------------------------------------
15-Mar-2020 00:03:52 2020-03-15 00:03:52.014  INFO   --- [           main] .b.t.c.SpringBootTestContextBootstrapper : Neither @ContextConfiguration nor @ContextHierarchy found for test class [org.springframework.cloud.dataflow.acceptance.test.AnalyticsTests], using SpringBootContextLoader
15-Mar-2020 00:03:52 2020-03-15 00:03:52.073  INFO   --- [           main] .b.t.c.SpringBootTestContextBootstrapper : Loaded default TestExecutionListener class names from location [META-INF/spring.factories]: [org.springframework.boot.test.mock.mockito.MockitoTestExecutionListener, org.springframework.boot.test.mock.mockito.ResetMocksTestExecutionListener, org.springframework.boot.test.autoconfigure.restdocs.RestDocsTestExecutionListener, org.springframework.boot.test.autoconfigure.web.client.MockRestServiceServerResetTestExecutionListener, org.springframework.boot.test.autoconfigure.web.servlet.MockMvcPrintOnlyOnFailureTestExecutionListener, org.springframework.boot.test.autoconfigure.web.servlet.WebDriverTestExecutionListener, org.springframework.test.context.web.ServletTestExecutionListener, org.springframework.test.context.support.DirtiesContextBeforeModesTestExecutionListener, org.springframework.test.context.support.DependencyInjectionTestExecutionListener, org.springframework.test.context.support.DirtiesContextTestExecutionListener, org.springframework.test.context.transaction.TransactionalTestExecutionListener, org.springframework.test.context.jdbc.SqlScriptsTestExecutionListener]
15-Mar-2020 00:03:52 2020-03-15 00:03:52.095  INFO   --- [           main] .b.t.c.SpringBootTestContextBootstrapper : Using TestExecutionListeners: [org.springframework.test.context.web.ServletTestExecutionListener@4b5d6a01, org.springframework.test.context.support.DirtiesContextBeforeModesTestExecutionListener@4a22f9e2, org.springframework.boot.test.autoconfigure.SpringBootDependencyInjectionTestExecutionListener@3c419631, org.springframework.test.context.support.DirtiesContextTestExecutionListener@418e7838, org.springframework.test.context.transaction.TransactionalTestExecutionListener@61230f6a, org.springframework.test.context.jdbc.SqlScriptsTestExecutionListener@3c130745, org.springframework.boot.test.mock.mockito.MockitoTestExecutionListener@cd3fee8, org.springframework.boot.test.autoconfigure.web.servlet.MockMvcPrintOnlyOnFailureTestExecutionListener@3e2e18f2, org.springframework.boot.test.autoconfigure.web.client.MockRestServiceServerResetTestExecutionListener@470f1802, org.springframework.boot.test.mock.mockito.ResetMocksTestExecutionListener@63021689, org.springframework.boot.test.autoconfigure.web.servlet.WebDriverTestExecutionListener@703580bf, org.springframework.boot.test.autoconfigure.restdocs.RestDocsTestExecutionListener@3e92efc3]
15-Mar-2020 00:03:52 2020-03-15 00:03:52.097  INFO   --- [           main] .b.t.c.SpringBootTestContextBootstrapper : Neither @ContextConfiguration nor @ContextHierarchy found for test class [org.springframework.cloud.dataflow.acceptance.test.WoodChuckTests], using SpringBootContextLoader
15-Mar-2020 00:03:52 2020-03-15 00:03:52.111  INFO   --- [           main] .b.t.c.SpringBootTestContextBootstrapper : Loaded default TestExecutionListener class names from location [META-INF/spring.factories]: [org.springframework.boot.test.mock.mockito.MockitoTestExecutionListener, org.springframework.boot.test.mock.mockito.ResetMocksTestExecutionListener, org.springframework.boot.test.autoconfigure.restdocs.RestDocsTestExecutionListener, org.springframework.boot.test.autoconfigure.web.client.MockRestServiceServerResetTestExecutionListener, org.springframework.boot.test.autoconfigure.web.servlet.MockMvcPrintOnlyOnFailureTestExecutionListener, org.springframework.boot.test.autoconfigure.web.servlet.WebDriverTestExecutionListener, org.springframework.test.context.web.ServletTestExecutionListener, org.springframework.test.context.support.DirtiesContextBeforeModesTestExecutionListener, org.springframework.test.context.support.DependencyInjectionTestExecutionListener, org.springframework.test.context.support.DirtiesContextTestExecutionListener, org.springframework.test.context.transaction.TransactionalTestExecutionListener, org.springframework.test.context.jdbc.SqlScriptsTestExecutionListener]
15-Mar-2020 00:03:52 2020-03-15 00:03:52.116  INFO   --- [           main] .b.t.c.SpringBootTestContextBootstrapper : Using TestExecutionListeners: [org.springframework.test.context.web.ServletTestExecutionListener@7ec7ffd3, org.springframework.test.context.support.DirtiesContextBeforeModesTestExecutionListener@5b239d7d, org.springframework.boot.test.autoconfigure.SpringBootDependencyInjectionTestExecutionListener@6572421, org.springframework.test.context.support.DirtiesContextTestExecutionListener@6b81ce95, org.springframework.test.context.transaction.TransactionalTestExecutionListener@2a798d51, org.springframework.test.context.jdbc.SqlScriptsTestExecutionListener@6d763516, org.springframework.boot.test.mock.mockito.MockitoTestExecutionListener@52bf72b5, org.springframework.boot.test.autoconfigure.web.servlet.MockMvcPrintOnlyOnFailureTestExecutionListener@37afeb11, org.springframework.boot.test.autoconfigure.web.client.MockRestServiceServerResetTestExecutionListener@515aebb0, org.springframework.boot.test.mock.mockito.ResetMocksTestExecutionListener@dd8ba08, org.springframework.boot.test.autoconfigure.web.servlet.WebDriverTestExecutionListener@245b4bdc, org.springframework.boot.test.autoconfigure.restdocs.RestDocsTestExecutionListener@6c64cb25]
15-Mar-2020 00:03:52 2020-03-15 00:03:52.118  INFO   --- [           main] .b.t.c.SpringBootTestContextBootstrapper : Neither @ContextConfiguration nor @ContextHierarchy found for test class [org.springframework.cloud.dataflow.acceptance.test.HttpSourceTests], using SpringBootContextLoader
15-Mar-2020 00:03:52 2020-03-15 00:03:52.129  INFO   --- [           main] .b.t.c.SpringBootTestContextBootstrapper : Loaded default TestExecutionListener class names from location [META-INF/spring.factories]: [org.springframework.boot.test.mock.mockito.MockitoTestExecutionListener, org.springframework.boot.test.mock.mockito.ResetMocksTestExecutionListener, org.springframework.boot.test.autoconfigure.restdocs.RestDocsTestExecutionListener, org.springframework.boot.test.autoconfigure.web.client.MockRestServiceServerResetTestExecutionListener, org.springframework.boot.test.autoconfigure.web.servlet.MockMvcPrintOnlyOnFailureTestExecutionListener, org.springframework.boot.test.autoconfigure.web.servlet.WebDriverTestExecutionListener, org.springframework.test.context.web.ServletTestExecutionListener, org.springframework.test.context.support.DirtiesContextBeforeModesTestExecutionListener, org.springframework.test.context.support.DependencyInjectionTestExecutionListener, org.springframework.test.context.support.DirtiesContextTestExecutionListener, org.springframework.test.context.transaction.TransactionalTestExecutionListener, org.springframework.test.context.jdbc.SqlScriptsTestExecutionListener]
15-Mar-2020 00:03:52 2020-03-15 00:03:52.133  INFO   --- [           main] .b.t.c.SpringBootTestContextBootstrapper : Using TestExecutionListeners: [org.springframework.test.context.web.ServletTestExecutionListener@40a4337a, org.springframework.test.context.support.DirtiesContextBeforeModesTestExecutionListener@6025e1b6, org.springframework.boot.test.autoconfigure.SpringBootDependencyInjectionTestExecutionListener@22ff4249, org.springframework.test.context.support.DirtiesContextTestExecutionListener@2d1ef81a, org.springframework.test.context.transaction.TransactionalTestExecutionListener@4c402120, org.springframework.test.context.jdbc.SqlScriptsTestExecutionListener@327514f, org.springframework.boot.test.mock.mockito.MockitoTestExecutionListener@5b12b668, org.springframework.boot.test.autoconfigure.web.servlet.MockMvcPrintOnlyOnFailureTestExecutionListener@1165b38, org.springframework.boot.test.autoconfigure.web.client.MockRestServiceServerResetTestExecutionListener@4c12331b, org.springframework.boot.test.mock.mockito.ResetMocksTestExecutionListener@7586beff, org.springframework.boot.test.autoconfigure.web.servlet.WebDriverTestExecutionListener@3b69e7d1, org.springframework.boot.test.autoconfigure.restdocs.RestDocsTestExecutionListener@815b41f]
15-Mar-2020 00:03:52 2020-03-15 00:03:52.153  INFO   --- [           main] .b.t.c.SpringBootTestContextBootstrapper : Neither @ContextConfiguration nor @ContextHierarchy found for test class [org.springframework.cloud.dataflow.acceptance.test.TickTockTests], using SpringBootContextLoader
15-Mar-2020 00:03:52 2020-03-15 00:03:52.163  INFO   --- [           main] .b.t.c.SpringBootTestContextBootstrapper : Loaded default TestExecutionListener class names from location [META-INF/spring.factories]: [org.springframework.boot.test.mock.mockito.MockitoTestExecutionListener, org.springframework.boot.test.mock.mockito.ResetMocksTestExecutionListener, org.springframework.boot.test.autoconfigure.restdocs.RestDocsTestExecutionListener, org.springframework.boot.test.autoconfigure.web.client.MockRestServiceServerResetTestExecutionListener, org.springframework.boot.test.autoconfigure.web.servlet.MockMvcPrintOnlyOnFailureTestExecutionListener, org.springframework.boot.test.autoconfigure.web.servlet.WebDriverTestExecutionListener, org.springframework.test.context.web.ServletTestExecutionListener, org.springframework.test.context.support.DirtiesContextBeforeModesTestExecutionListener, org.springframework.test.context.support.DependencyInjectionTestExecutionListener, org.springframework.test.context.support.DirtiesContextTestExecutionListener, org.springframework.test.context.transaction.TransactionalTestExecutionListener, org.springframework.test.context.jdbc.SqlScriptsTestExecutionListener]
15-Mar-2020 00:03:52 2020-03-15 00:03:52.167  INFO   --- [           main] .b.t.c.SpringBootTestContextBootstrapper : Using TestExecutionListeners: [org.springframework.test.context.web.ServletTestExecutionListener@55b53d44, org.springframework.test.context.support.DirtiesContextBeforeModesTestExecutionListener@482bce4f, org.springframework.boot.test.autoconfigure.SpringBootDependencyInjectionTestExecutionListener@366647c2, org.springframework.test.context.support.DirtiesContextTestExecutionListener@6a6afff2, org.springframework.test.context.transaction.TransactionalTestExecutionListener@1649b0e6, org.springframework.test.context.jdbc.SqlScriptsTestExecutionListener@865dd6, org.springframework.boot.test.mock.mockito.MockitoTestExecutionListener@4da4253, org.springframework.boot.test.autoconfigure.web.servlet.MockMvcPrintOnlyOnFailureTestExecutionListener@3972a855, org.springframework.boot.test.autoconfigure.web.client.MockRestServiceServerResetTestExecutionListener@62e7f11d, org.springframework.boot.test.mock.mockito.ResetMocksTestExecutionListener@503d687a, org.springframework.boot.test.autoconfigure.web.servlet.WebDriverTestExecutionListener@6a370f4, org.springframework.boot.test.autoconfigure.restdocs.RestDocsTestExecutionListener@2abf4075]
15-Mar-2020 00:03:52 2020-03-15 00:03:52.176  INFO   --- [           main] .b.t.c.SpringBootTestContextBootstrapper : Neither @ContextConfiguration nor @ContextHierarchy found for test class [org.springframework.cloud.dataflow.acceptance.test.TransformTests], using SpringBootContextLoader
15-Mar-2020 00:03:52 2020-03-15 00:03:52.186  INFO   --- [           main] .b.t.c.SpringBootTestContextBootstrapper : Loaded default TestExecutionListener class names from location [META-INF/spring.factories]: [org.springframework.boot.test.mock.mockito.MockitoTestExecutionListener, org.springframework.boot.test.mock.mockito.ResetMocksTestExecutionListener, org.springframework.boot.test.autoconfigure.restdocs.RestDocsTestExecutionListener, org.springframework.boot.test.autoconfigure.web.client.MockRestServiceServerResetTestExecutionListener, org.springframework.boot.test.autoconfigure.web.servlet.MockMvcPrintOnlyOnFailureTestExecutionListener, org.springframework.boot.test.autoconfigure.web.servlet.WebDriverTestExecutionListener, org.springframework.test.context.web.ServletTestExecutionListener, org.springframework.test.context.support.DirtiesContextBeforeModesTestExecutionListener, org.springframework.test.context.support.DependencyInjectionTestExecutionListener, org.springframework.test.context.support.DirtiesContextTestExecutionListener, org.springframework.test.context.transaction.TransactionalTestExecutionListener, org.springframework.test.context.jdbc.SqlScriptsTestExecutionListener]
15-Mar-2020 00:03:52 2020-03-15 00:03:52.189  INFO   --- [           main] .b.t.c.SpringBootTestContextBootstrapper : Using TestExecutionListeners: [org.springframework.test.context.web.ServletTestExecutionListener@51e69659, org.springframework.test.context.support.DirtiesContextBeforeModesTestExecutionListener@47e2e487, org.springframework.boot.test.autoconfigure.SpringBootDependencyInjectionTestExecutionListener@201a4587, org.springframework.test.context.support.DirtiesContextTestExecutionListener@61001b64, org.springframework.test.context.transaction.TransactionalTestExecutionListener@4310d43, org.springframework.test.context.jdbc.SqlScriptsTestExecutionListener@54a7079e, org.springframework.boot.test.mock.mockito.MockitoTestExecutionListener@26e356f0, org.springframework.boot.test.autoconfigure.web.servlet.MockMvcPrintOnlyOnFailureTestExecutionListener@47d9a273, org.springframework.boot.test.autoconfigure.web.client.MockRestServiceServerResetTestExecutionListener@4b8ee4de, org.springframework.boot.test.mock.mockito.ResetMocksTestExecutionListener@27f981c6, org.springframework.boot.test.autoconfigure.web.servlet.WebDriverTestExecutionListener@1b11171f, org.springframework.boot.test.autoconfigure.restdocs.RestDocsTestExecutionListener@1151e434]
15-Mar-2020 00:03:52 2020-03-15 00:03:52.205  INFO   --- [           main] .b.t.c.SpringBootTestContextBootstrapper : Neither @ContextConfiguration nor @ContextHierarchy found for test class [org.springframework.cloud.dataflow.acceptance.test.NamedChannelTests], using SpringBootContextLoader
15-Mar-2020 00:03:52 2020-03-15 00:03:52.214  INFO   --- [           main] .b.t.c.SpringBootTestContextBootstrapper : Loaded default TestExecutionListener class names from location [META-INF/spring.factories]: [org.springframework.boot.test.mock.mockito.MockitoTestExecutionListener, org.springframework.boot.test.mock.mockito.ResetMocksTestExecutionListener, org.springframework.boot.test.autoconfigure.restdocs.RestDocsTestExecutionListener, org.springframework.boot.test.autoconfigure.web.client.MockRestServiceServerResetTestExecutionListener, org.springframework.boot.test.autoconfigure.web.servlet.MockMvcPrintOnlyOnFailureTestExecutionListener, org.springframework.boot.test.autoconfigure.web.servlet.WebDriverTestExecutionListener, org.springframework.test.context.web.ServletTestExecutionListener, org.springframework.test.context.support.DirtiesContextBeforeModesTestExecutionListener, org.springframework.test.context.support.DependencyInjectionTestExecutionListener, org.springframework.test.context.support.DirtiesContextTestExecutionListener, org.springframework.test.context.transaction.TransactionalTestExecutionListener, org.springframework.test.context.jdbc.SqlScriptsTestExecutionListener]
15-Mar-2020 00:03:52 2020-03-15 00:03:52.217  INFO   --- [           main] .b.t.c.SpringBootTestContextBootstrapper : Using TestExecutionListeners: [org.springframework.test.context.web.ServletTestExecutionListener@70cf32e3, org.springframework.test.context.support.DirtiesContextBeforeModesTestExecutionListener@5a59ca5e, org.springframework.boot.test.autoconfigure.SpringBootDependencyInjectionTestExecutionListener@4bdeaabb, org.springframework.test.context.support.DirtiesContextTestExecutionListener@6c4906d3, org.springframework.test.context.transaction.TransactionalTestExecutionListener@65987993, org.springframework.test.context.jdbc.SqlScriptsTestExecutionListener@71075444, org.springframework.boot.test.mock.mockito.MockitoTestExecutionListener@4f32a3ad, org.springframework.boot.test.autoconfigure.web.servlet.MockMvcPrintOnlyOnFailureTestExecutionListener@6b695b06, org.springframework.boot.test.autoconfigure.web.client.MockRestServiceServerResetTestExecutionListener@4d1bf319, org.springframework.boot.test.mock.mockito.ResetMocksTestExecutionListener@6f53b8a, org.springframework.boot.test.autoconfigure.web.servlet.WebDriverTestExecutionListener@5c80cf32, org.springframework.boot.test.autoconfigure.restdocs.RestDocsTestExecutionListener@7d900ecf]
15-Mar-2020 00:03:52 Running org.springframework.cloud.dataflow.acceptance.test.AnalyticsTests
15-Mar-2020 00:03:52 2020-03-15 00:03:52.249  INFO   --- [           main] .b.t.c.SpringBootTestContextBootstrapper : Neither @ContextConfiguration nor @ContextHierarchy found for test class [org.springframework.cloud.dataflow.acceptance.test.AnalyticsTests], using SpringBootContextLoader
15-Mar-2020 00:03:52 2020-03-15 00:03:52.270  INFO   --- [           main] .b.t.c.SpringBootTestContextBootstrapper : Loaded default TestExecutionListener class names from location [META-INF/spring.factories]: [org.springframework.boot.test.mock.mockito.MockitoTestExecutionListener, org.springframework.boot.test.mock.mockito.ResetMocksTestExecutionListener, org.springframework.boot.test.autoconfigure.restdocs.RestDocsTestExecutionListener, org.springframework.boot.test.autoconfigure.web.client.MockRestServiceServerResetTestExecutionListener, org.springframework.boot.test.autoconfigure.web.servlet.MockMvcPrintOnlyOnFailureTestExecutionListener, org.springframework.boot.test.autoconfigure.web.servlet.WebDriverTestExecutionListener, org.springframework.test.context.web.ServletTestExecutionListener, org.springframework.test.context.support.DirtiesContextBeforeModesTestExecutionListener, org.springframework.test.context.support.DependencyInjectionTestExecutionListener, org.springframework.test.context.support.DirtiesContextTestExecutionListener, org.springframework.test.context.transaction.TransactionalTestExecutionListener, org.springframework.test.context.jdbc.SqlScriptsTestExecutionListener]
15-Mar-2020 00:03:52 2020-03-15 00:03:52.273  INFO   --- [           main] .b.t.c.SpringBootTestContextBootstrapper : Using TestExecutionListeners: [org.springframework.test.context.web.ServletTestExecutionListener@77659b30, org.springframework.test.context.support.DirtiesContextBeforeModesTestExecutionListener@456d6c1e, org.springframework.boot.test.autoconfigure.SpringBootDependencyInjectionTestExecutionListener@1e13529a, org.springframework.test.context.support.DirtiesContextTestExecutionListener@1ec9bd38, org.springframework.test.context.transaction.TransactionalTestExecutionListener@452e19ca, org.springframework.test.context.jdbc.SqlScriptsTestExecutionListener@6b0d80ed, org.springframework.boot.test.mock.mockito.MockitoTestExecutionListener@6f8e8894, org.springframework.boot.test.autoconfigure.web.servlet.MockMvcPrintOnlyOnFailureTestExecutionListener@3cfdd820, org.springframework.boot.test.autoconfigure.web.client.MockRestServiceServerResetTestExecutionListener@928763c, org.springframework.boot.test.mock.mockito.ResetMocksTestExecutionListener@e25951c, org.springframework.boot.test.autoconfigure.web.servlet.WebDriverTestExecutionListener@15f47664, org.springframework.boot.test.autoconfigure.restdocs.RestDocsTestExecutionListener@471a9022]
15-Mar-2020 00:03:53 2020-03-15 00:03:53.011  INFO 3955 --- [           main] s.c.a.AnnotationConfigApplicationContext : Refreshing org.springframework.context.annotation.AnnotationConfigApplicationContext@2fa7ae9: startup date [Sun Mar 15 00:03:53 UTC 2020]; root of context hierarchy
15-Mar-2020 00:03:53 2020-03-15 00:03:53.329  INFO 3955 --- [           main] trationDelegate$BeanPostProcessorChecker : Bean 'configurationPropertiesRebinderAutoConfiguration' of type [class org.springframework.cloud.autoconfigure.ConfigurationPropertiesRebinderAutoConfiguration$$EnhancerBySpringCGLIB$$ed959188] is not eligible for getting processed by all BeanPostProcessors (for example: not eligible for auto-proxying)
15-Mar-2020 00:03:53
15-Mar-2020 00:03:53   .   ____          _            __ _ _
15-Mar-2020 00:03:53 /\\ / ___'_ __ _ _(_)_ __  __ _ \ \ \ \
15-Mar-2020 00:03:53 ( ( )\___ | '_ | '_| | '_ \/ _` | \ \ \ \
15-Mar-2020 00:03:53 \\/  ___)| |_)| | | | | || (_| |  ) ) ) )
15-Mar-2020 00:03:53   '  |____| .__|_| |_|_| |_\__, | / / / /
15-Mar-2020 00:03:53 =========|_|==============|___/=/_/_/_/
15-Mar-2020 00:03:53 :: Spring Boot ::        (v1.4.1.RELEASE)
15-Mar-2020 00:03:53
15-Mar-2020 00:03:53 2020-03-15 00:03:53.652  INFO 3955 --- [           main] c.c.c.ConfigServicePropertySourceLocator : Fetching config from server at: http://localhost:8888
15-Mar-2020 00:03:53 2020-03-15 00:03:53.743  WARN 3955 --- [           main] c.c.c.ConfigServicePropertySourceLocator : Could not locate PropertySource: I/O error on GET request for "http://localhost:8888//blah": Connection refused (Connection refused); nested exception is java.net.ConnectException: Connection refused (Connection refused)
15-Mar-2020 00:03:53 2020-03-15 00:03:53.750  INFO 3955 --- [           main] o.s.c.d.acceptance.test.AnalyticsTests   : The following profiles are active: blah
15-Mar-2020 00:03:53 2020-03-15 00:03:53.977  INFO 3955 --- [           main] o.s.c.d.acceptance.test.AnalyticsTests   : Started AnalyticsTests in 1.632 seconds (JVM running for 2.446)
15-Mar-2020 00:03:54 2020-03-15 00:03:54.255  INFO 3955 --- [           main] junit.logTestName                        : Starting Test analyticsTest(org.springframework.cloud.dataflow.acceptance.test.AnalyticsTests)
15-Mar-2020 00:03:54 2020-03-15 00:03:54.261  INFO 3955 --- [           main] o.s.c.d.acceptance.test.AnalyticsTests   : Importing stream apps from uri resource: https://dataflow.spring.io/kafka-maven-latest
15-Mar-2020 00:03:56 2020-03-15 00:03:56.522  INFO 3955 --- [           main] junit.logTestName                        : Finished Test analyticsTest(org.springframework.cloud.dataflow.acceptance.test.AnalyticsTests)
15-Mar-2020 00:03:56 2020-03-15 00:03:56.522  INFO 3955 --- [           main] o.s.c.d.acceptance.test.AnalyticsTests   : Destroy all streams
15-Mar-2020 00:03:56 Tests run: 1, Failures: 0, Errors: 0, Skipped: 1, Time elapsed: 4.297 sec - in org.springframework.cloud.dataflow.acceptance.test.AnalyticsTests
15-Mar-2020 00:03:56 Running org.springframework.cloud.dataflow.acceptance.test.WoodChuckTests
15-Mar-2020 00:03:56 2020-03-15 00:03:56.546  INFO 3955 --- [           main] .b.t.c.SpringBootTestContextBootstrapper : Neither @ContextConfiguration nor @ContextHierarchy found for test class [org.springframework.cloud.dataflow.acceptance.test.WoodChuckTests], using SpringBootContextLoader
15-Mar-2020 00:03:56 2020-03-15 00:03:56.590  INFO 3955 --- [           main] .b.t.c.SpringBootTestContextBootstrapper : Loaded default TestExecutionListener class names from location [META-INF/spring.factories]: [org.springframework.boot.test.mock.mockito.MockitoTestExecutionListener, org.springframework.boot.test.mock.mockito.ResetMocksTestExecutionListener, org.springframework.boot.test.autoconfigure.restdocs.RestDocsTestExecutionListener, org.springframework.boot.test.autoconfigure.web.client.MockRestServiceServerResetTestExecutionListener, org.springframework.boot.test.autoconfigure.web.servlet.MockMvcPrintOnlyOnFailureTestExecutionListener, org.springframework.boot.test.autoconfigure.web.servlet.WebDriverTestExecutionListener, org.springframework.test.context.web.ServletTestExecutionListener, org.springframework.test.context.support.DirtiesContextBeforeModesTestExecutionListener, org.springframework.test.context.support.DependencyInjectionTestExecutionListener, org.springframework.test.context.support.DirtiesContextTestExecutionListener, org.springframework.test.context.transaction.TransactionalTestExecutionListener, org.springframework.test.context.jdbc.SqlScriptsTestExecutionListener]
15-Mar-2020 00:03:56 2020-03-15 00:03:56.600  INFO 3955 --- [           main] .b.t.c.SpringBootTestContextBootstrapper : Using TestExecutionListeners: [org.springframework.test.context.web.ServletTestExecutionListener@6d1dcdff, org.springframework.test.context.support.DirtiesContextBeforeModesTestExecutionListener@102ecc22, org.springframework.boot.test.autoconfigure.SpringBootDependencyInjectionTestExecutionListener@7ff35a3f, org.springframework.test.context.support.DirtiesContextTestExecutionListener@26dc9bd5, org.springframework.test.context.transaction.TransactionalTestExecutionListener@252dc8c4, org.springframework.test.context.jdbc.SqlScriptsTestExecutionListener@43045f9f, org.springframework.boot.test.mock.mockito.MockitoTestExecutionListener@2643d762, org.springframework.boot.test.autoconfigure.web.servlet.MockMvcPrintOnlyOnFailureTestExecutionListener@6403e24c, org.springframework.boot.test.autoconfigure.web.client.MockRestServiceServerResetTestExecutionListener@2f236de0, org.springframework.boot.test.mock.mockito.ResetMocksTestExecutionListener@4eba373c, org.springframework.boot.test.autoconfigure.web.servlet.WebDriverTestExecutionListener@767a014e, org.springframework.boot.test.autoconfigure.restdocs.RestDocsTestExecutionListener@d109c4f]
15-Mar-2020 00:03:56 2020-03-15 00:03:56.716  INFO 3955 --- [           main] junit.logTestName                        : Starting Test testPartitioning(org.springframework.cloud.dataflow.acceptance.test.WoodChuckTests)
15-Mar-2020 00:03:56 2020-03-15 00:03:56.729  INFO 3955 --- [           main] o.s.c.d.acceptance.test.WoodChuckTests   : Creating stream 'WOODCHUCK-TEST'
15-Mar-2020 00:03:56 2020-03-15 00:03:56.862  INFO 3955 --- [           main] o.s.c.d.acceptance.test.WoodChuckTests   : Deploying stream 'WOODCHUCK-TEST' with properties: {app.*.spring.cloud.streamapp.security.enabled=false, app.log.logging.pattern.level=WOODCHUCK-${INSTANCE_INDEX:${CF_INSTANCE_INDEX:${spring.cloud.stream.instanceIndex:0}}} %5p, app.*.logging.file=${PID}-test.log, app.splitter.producer.partitionKeyExpression=payload, app.*.endpoints.logfile.sensitive=false, app.log.spring.cloud.stream.kafka.bindings.input.consumer.autoRebalanceEnabled=false, app.*.management.endpoints.web.exposure.include=*, deployer.log.count=2}
15-Mar-2020 00:03:59 2020-03-15 00:03:59.361  INFO 3955 --- [           main] o.s.c.d.acceptance.test.WoodChuckTests   : Checking: Stream=WOODCHUCK-TEST, status = deploying, status description = The stream is being deployed.
15-Mar-2020 00:03:59 2020-03-15 00:03:59.361  INFO 3955 --- [           main] o.s.c.d.acceptance.test.WoodChuckTests   : Sleeping to check status of Stream=WOODCHUCK-TEST
15-Mar-2020 00:04:09 2020-03-15 00:04:09.538  INFO 3955 --- [           main] o.s.c.d.acceptance.test.WoodChuckTests   : Checking: Stream=WOODCHUCK-TEST, status = deploying, status description = The stream is being deployed.
15-Mar-2020 00:04:09 2020-03-15 00:04:09.539  INFO 3955 --- [           main] o.s.c.d.acceptance.test.WoodChuckTests   : Sleeping to check status of Stream=WOODCHUCK-TEST
15-Mar-2020 00:04:19 2020-03-15 00:04:19.697  INFO 3955 --- [           main] o.s.c.d.acceptance.test.WoodChuckTests   : Checking: Stream=WOODCHUCK-TEST, status = deploying, status description = The stream is being deployed.
15-Mar-2020 00:04:19 2020-03-15 00:04:19.697  INFO 3955 --- [           main] o.s.c.d.acceptance.test.WoodChuckTests   : Sleeping to check status of Stream=WOODCHUCK-TEST
15-Mar-2020 00:04:29 2020-03-15 00:04:29.865  INFO 3955 --- [           main] o.s.c.d.acceptance.test.WoodChuckTests   : Checking: Stream=WOODCHUCK-TEST, status = deployed, status description = The stream has been successfully deployed
15-Mar-2020 00:04:30 2020-03-15 00:04:30.042  INFO 3955 --- [           main] o.s.c.d.acceptance.test.WoodChuckTests   : Sleeping to check status of Stream=WOODCHUCK-TEST
15-Mar-2020 00:04:40 2020-03-15 00:04:40.042  INFO 3955 --- [           main] o.s.c.d.acceptance.test.WoodChuckTests   : Stream 'WOODCHUCK-TEST' started with status: deployed
15-Mar-2020 00:04:40 2020-03-15 00:04:40.043  INFO 3955 --- [           main] o.s.c.d.acceptance.test.WoodChuckTests   : App 'log' has instances: {WOODCHUCK-TEST.log-v1-0=http://10.194.6.131:52882, WOODCHUCK-TEST.log-v1-1=http://10.194.6.131:31385}
15-Mar-2020 00:04:40 2020-03-15 00:04:40.043  INFO 3955 --- [           main] o.s.c.d.acceptance.test.WoodChuckTests   : App 'http' has instances: {WOODCHUCK-TEST.http-v1-0=http://10.194.6.131:52260}
15-Mar-2020 00:04:40 2020-03-15 00:04:40.043  INFO 3955 --- [           main] o.s.c.d.acceptance.test.WoodChuckTests   : App 'splitter' has instances: {WOODCHUCK-TEST.splitter-v1-0=http://10.194.6.131:46088}
15-Mar-2020 00:04:40 2020-03-15 00:04:40.043  INFO 3955 --- [           main] o.s.c.d.acceptance.test.WoodChuckTests   : Looking for 'Started HttpSource' in logfile for http
15-Mar-2020 00:04:50 2020-03-15 00:04:50.044  INFO 3955 --- [           main] o.s.c.d.acceptance.test.WoodChuckTests   : Requesting log for app WOODCHUCK-TEST.http-v1-0
15-Mar-2020 00:04:50 2020-03-15 00:04:50.362  INFO 3955 --- [           main] o.s.c.d.acceptance.test.WoodChuckTests   : Retrieved logfile from 'http://10.194.6.131:52260/actuator/logfile
15-Mar-2020 00:04:50 2020-03-15 00:04:50.367  INFO 3955 --- [           main] o.s.c.d.acceptance.test.WoodChuckTests   : Matched all 'Started HttpSource' in logfile for app http (source WOODCHUCK-TEST.http-v1-0)
15-Mar-2020 00:04:50 2020-03-15 00:04:50.368  INFO 3955 --- [           main] o.s.c.d.acceptance.test.WoodChuckTests   : Looking for 'Started SplitterProcessor' in logfile for splitter
15-Mar-2020 00:05:00 2020-03-15 00:05:00.368  INFO 3955 --- [           main] o.s.c.d.acceptance.test.WoodChuckTests   : Requesting log for app WOODCHUCK-TEST.splitter-v1-0
15-Mar-2020 00:05:00 2020-03-15 00:05:00.507  INFO 3955 --- [           main] o.s.c.d.acceptance.test.WoodChuckTests   : Retrieved logfile from 'http://10.194.6.131:46088/actuator/logfile
15-Mar-2020 00:05:00 2020-03-15 00:05:00.507  INFO 3955 --- [           main] o.s.c.d.acceptance.test.WoodChuckTests   : Matched all 'Started SplitterProcessor' in logfile for app splitter (source WOODCHUCK-TEST.splitter-v1-0)
15-Mar-2020 00:05:00 2020-03-15 00:05:00.507  INFO 3955 --- [           main] o.s.c.d.acceptance.test.WoodChuckTests   : Looking for 'Started LogSink' in logfile for log
15-Mar-2020 00:05:10 2020-03-15 00:05:10.507  INFO 3955 --- [           main] o.s.c.d.acceptance.test.WoodChuckTests   : Requesting log for app WOODCHUCK-TEST.log-v1-0
15-Mar-2020 00:05:10 2020-03-15 00:05:10.667  INFO 3955 --- [           main] o.s.c.d.acceptance.test.WoodChuckTests   : Retrieved logfile from 'http://10.194.6.131:52882/actuator/logfile
15-Mar-2020 00:05:10 2020-03-15 00:05:10.667  INFO 3955 --- [           main] o.s.c.d.acceptance.test.WoodChuckTests   : Requesting log for app WOODCHUCK-TEST.log-v1-1
15-Mar-2020 00:05:11 2020-03-15 00:05:11.028  INFO 3955 --- [           main] o.s.c.d.acceptance.test.WoodChuckTests   : Retrieved logfile from 'http://10.194.6.131:31385/actuator/logfile
15-Mar-2020 00:05:11 2020-03-15 00:05:11.028  INFO 3955 --- [           main] o.s.c.d.acceptance.test.WoodChuckTests   : Matched all 'Started LogSink' in logfile for app log (source WOODCHUCK-TEST.log-v1-0)
15-Mar-2020 00:05:11 2020-03-15 00:05:11.211  INFO 3955 --- [           main] o.s.c.d.acceptance.test.WoodChuckTests   : Looking for 'WOODCHUCK-0,How,chuck' in logfile for log
15-Mar-2020 00:05:21 2020-03-15 00:05:21.211  INFO 3955 --- [           main] o.s.c.d.acceptance.test.WoodChuckTests   : Requesting log for app WOODCHUCK-TEST.log-v1-0
15-Mar-2020 00:05:21 2020-03-15 00:05:21.220  INFO 3955 --- [           main] o.s.c.d.acceptance.test.WoodChuckTests   : Retrieved logfile from 'http://10.194.6.131:52882/actuator/logfile
15-Mar-2020 00:05:21 2020-03-15 00:05:21.220  INFO 3955 --- [           main] o.s.c.d.acceptance.test.WoodChuckTests   : Requesting log for app WOODCHUCK-TEST.log-v1-1
15-Mar-2020 00:05:21 2020-03-15 00:05:21.230  INFO 3955 --- [           main] o.s.c.d.acceptance.test.WoodChuckTests   : Retrieved logfile from 'http://10.194.6.131:31385/actuator/logfile
15-Mar-2020 00:05:21 2020-03-15 00:05:21.231  INFO 3955 --- [           main] o.s.c.d.acceptance.test.WoodChuckTests   : Matched all 'WOODCHUCK-0,How,chuck' in logfile for app log (source WOODCHUCK-TEST.log-v1-0)
15-Mar-2020 00:05:21 2020-03-15 00:05:21.231  INFO 3955 --- [           main] o.s.c.d.acceptance.test.WoodChuckTests   : Looking for 'WOODCHUCK-1,much,wood,would,if,a,woodchuck,could' in logfile for log
15-Mar-2020 00:05:31 2020-03-15 00:05:31.231  INFO 3955 --- [           main] o.s.c.d.acceptance.test.WoodChuckTests   : Requesting log for app WOODCHUCK-TEST.log-v1-0
15-Mar-2020 00:05:31 2020-03-15 00:05:31.240  INFO 3955 --- [           main] o.s.c.d.acceptance.test.WoodChuckTests   : Retrieved logfile from 'http://10.194.6.131:52882/actuator/logfile
15-Mar-2020 00:05:31 2020-03-15 00:05:31.240  INFO 3955 --- [           main] o.s.c.d.acceptance.test.WoodChuckTests   : Requesting log for app WOODCHUCK-TEST.log-v1-1
15-Mar-2020 00:05:31 2020-03-15 00:05:31.248  INFO 3955 --- [           main] o.s.c.d.acceptance.test.WoodChuckTests   : Retrieved logfile from 'http://10.194.6.131:31385/actuator/logfile
15-Mar-2020 00:05:31 2020-03-15 00:05:31.249  INFO 3955 --- [           main] o.s.c.d.acceptance.test.WoodChuckTests   : Matched all 'WOODCHUCK-1,much,wood,would,if,a,woodchuck,could' in logfile for app log (source WOODCHUCK-TEST.log-v1-1)
15-Mar-2020 00:05:31 2020-03-15 00:05:31.251  INFO 3955 --- [           main] junit.logTestName                        : Test testPartitioning(org.springframework.cloud.dataflow.acceptance.test.WoodChuckTests) Succeeded
15-Mar-2020 00:05:31 2020-03-15 00:05:31.251  INFO 3955 --- [           main] junit.logTestName                        : Finished Test testPartitioning(org.springframework.cloud.dataflow.acceptance.test.WoodChuckTests)
15-Mar-2020 00:05:31 2020-03-15 00:05:31.251  INFO 3955 --- [           main] o.s.c.d.acceptance.test.WoodChuckTests   : Destroy all streams
15-Mar-2020 00:05:31 Tests run: 1, Failures: 0, Errors: 0, Skipped: 0, Time elapsed: 95.108 sec - in org.springframework.cloud.dataflow.acceptance.test.WoodChuckTests
15-Mar-2020 00:05:31 Running org.springframework.cloud.dataflow.acceptance.test.HttpSourceTests
15-Mar-2020 00:05:31 2020-03-15 00:05:31.710  INFO 3955 --- [           main] .b.t.c.SpringBootTestContextBootstrapper : Neither @ContextConfiguration nor @ContextHierarchy found for test class [org.springframework.cloud.dataflow.acceptance.test.HttpSourceTests], using SpringBootContextLoader
15-Mar-2020 00:05:31 2020-03-15 00:05:31.716  INFO 3955 --- [           main] .b.t.c.SpringBootTestContextBootstrapper : Loaded default TestExecutionListener class names from location [META-INF/spring.factories]: [org.springframework.boot.test.mock.mockito.MockitoTestExecutionListener, org.springframework.boot.test.mock.mockito.ResetMocksTestExecutionListener, org.springframework.boot.test.autoconfigure.restdocs.RestDocsTestExecutionListener, org.springframework.boot.test.autoconfigure.web.client.MockRestServiceServerResetTestExecutionListener, org.springframework.boot.test.autoconfigure.web.servlet.MockMvcPrintOnlyOnFailureTestExecutionListener, org.springframework.boot.test.autoconfigure.web.servlet.WebDriverTestExecutionListener, org.springframework.test.context.web.ServletTestExecutionListener, org.springframework.test.context.support.DirtiesContextBeforeModesTestExecutionListener, org.springframework.test.context.support.DependencyInjectionTestExecutionListener, org.springframework.test.context.support.DirtiesContextTestExecutionListener, org.springframework.test.context.transaction.TransactionalTestExecutionListener, org.springframework.test.context.jdbc.SqlScriptsTestExecutionListener]
15-Mar-2020 00:05:31 2020-03-15 00:05:31.719  INFO 3955 --- [           main] .b.t.c.SpringBootTestContextBootstrapper : Using TestExecutionListeners: [org.springframework.test.context.web.ServletTestExecutionListener@53cf9c99, org.springframework.test.context.support.DirtiesContextBeforeModesTestExecutionListener@7b306b9f, org.springframework.boot.test.autoconfigure.SpringBootDependencyInjectionTestExecutionListener@142213d5, org.springframework.test.context.support.DirtiesContextTestExecutionListener@934b52f, org.springframework.test.context.transaction.TransactionalTestExecutionListener@2630dbc4, org.springframework.test.context.jdbc.SqlScriptsTestExecutionListener@5ea4300e, org.springframework.boot.test.mock.mockito.MockitoTestExecutionListener@5a1c3cb4, org.springframework.boot.test.autoconfigure.web.servlet.MockMvcPrintOnlyOnFailureTestExecutionListener@76ad6715, org.springframework.boot.test.autoconfigure.web.client.MockRestServiceServerResetTestExecutionListener@56637cff, org.springframework.boot.test.mock.mockito.ResetMocksTestExecutionListener@2938127d, org.springframework.boot.test.autoconfigure.web.servlet.WebDriverTestExecutionListener@127a7272, org.springframework.boot.test.autoconfigure.restdocs.RestDocsTestExecutionListener@ff23ae7]
15-Mar-2020 00:05:31 2020-03-15 00:05:31.830  INFO 3955 --- [           main] junit.logTestName                        : Starting Test httpSourceTests(org.springframework.cloud.dataflow.acceptance.test.HttpSourceTests)
15-Mar-2020 00:05:31 2020-03-15 00:05:31.831  INFO 3955 --- [           main] o.s.c.d.acceptance.test.HttpSourceTests  : Creating stream 'HTTP-TEST'
15-Mar-2020 00:05:31 2020-03-15 00:05:31.874  INFO 3955 --- [           main] o.s.c.d.acceptance.test.HttpSourceTests  : Deploying stream 'HTTP-TEST' with properties: {app.*.spring.cloud.streamapp.security.enabled=false, app.*.logging.file=${PID}-test.log, app.*.endpoints.logfile.sensitive=false, app.*.management.endpoints.web.exposure.include=*}
15-Mar-2020 00:05:32 2020-03-15 00:05:32.584  INFO 3955 --- [           main] o.s.c.d.acceptance.test.HttpSourceTests  : Checking: Stream=HTTP-TEST, status = deploying, status description = The stream is being deployed.
15-Mar-2020 00:05:32 2020-03-15 00:05:32.584  INFO 3955 --- [           main] o.s.c.d.acceptance.test.HttpSourceTests  : Sleeping to check status of Stream=HTTP-TEST
15-Mar-2020 00:05:42 2020-03-15 00:05:42.660  INFO 3955 --- [           main] o.s.c.d.acceptance.test.HttpSourceTests  : Checking: Stream=HTTP-TEST, status = deploying, status description = The stream is being deployed.
15-Mar-2020 00:05:42 2020-03-15 00:05:42.660  INFO 3955 --- [           main] o.s.c.d.acceptance.test.HttpSourceTests  : Sleeping to check status of Stream=HTTP-TEST
15-Mar-2020 00:05:52 2020-03-15 00:05:52.699  INFO 3955 --- [           main] o.s.c.d.acceptance.test.HttpSourceTests  : Checking: Stream=HTTP-TEST, status = deployed, status description = The stream has been successfully deployed
15-Mar-2020 00:05:52 2020-03-15 00:05:52.738  INFO 3955 --- [           main] o.s.c.d.acceptance.test.HttpSourceTests  : Sleeping to check status of Stream=HTTP-TEST
15-Mar-2020 00:06:02 2020-03-15 00:06:02.739  INFO 3955 --- [           main] o.s.c.d.acceptance.test.HttpSourceTests  : Stream 'HTTP-TEST' started with status: deployed
15-Mar-2020 00:06:02 2020-03-15 00:06:02.739  INFO 3955 --- [           main] o.s.c.d.acceptance.test.HttpSourceTests  : App 'log' has instances: {HTTP-TEST.log-v1-0=http://10.194.6.131:54881}
15-Mar-2020 00:06:02 2020-03-15 00:06:02.739  INFO 3955 --- [           main] o.s.c.d.acceptance.test.HttpSourceTests  : App 'http' has instances: {HTTP-TEST.http-v1-0=http://10.194.6.131:50860}
15-Mar-2020 00:06:02 2020-03-15 00:06:02.746  INFO 3955 --- [           main] o.s.c.d.acceptance.test.HttpSourceTests  : Looking for 'Started HttpSource' in logfile for http
15-Mar-2020 00:06:12 2020-03-15 00:06:12.746  INFO 3955 --- [           main] o.s.c.d.acceptance.test.HttpSourceTests  : Requesting log for app HTTP-TEST.http-v1-0
15-Mar-2020 00:06:13 2020-03-15 00:06:13.051  INFO 3955 --- [           main] o.s.c.d.acceptance.test.HttpSourceTests  : Retrieved logfile from 'http://10.194.6.131:50860/actuator/logfile
15-Mar-2020 00:06:13 2020-03-15 00:06:13.051  INFO 3955 --- [           main] o.s.c.d.acceptance.test.HttpSourceTests  : Matched all 'Started HttpSource' in logfile for app http (source HTTP-TEST.http-v1-0)
15-Mar-2020 00:06:13 2020-03-15 00:06:13.051  INFO 3955 --- [           main] o.s.c.d.acceptance.test.HttpSourceTests  : Looking for 'Started LogSink' in logfile for log
15-Mar-2020 00:06:23 2020-03-15 00:06:23.052  INFO 3955 --- [           main] o.s.c.d.acceptance.test.HttpSourceTests  : Requesting log for app HTTP-TEST.log-v1-0
15-Mar-2020 00:06:23 2020-03-15 00:06:23.189  INFO 3955 --- [           main] o.s.c.d.acceptance.test.HttpSourceTests  : Retrieved logfile from 'http://10.194.6.131:54881/actuator/logfile
15-Mar-2020 00:06:23 2020-03-15 00:06:23.190  INFO 3955 --- [           main] o.s.c.d.acceptance.test.HttpSourceTests  : Matched all 'Started LogSink' in logfile for app log (source HTTP-TEST.log-v1-0)
15-Mar-2020 00:06:23 2020-03-15 00:06:23.368  INFO 3955 --- [           main] o.s.c.d.acceptance.test.HttpSourceTests  : Looking for '63f9bb8d-8b1a-4d99-b112-149a804249e9' in logfile for log
15-Mar-2020 00:06:33 2020-03-15 00:06:33.368  INFO 3955 --- [           main] o.s.c.d.acceptance.test.HttpSourceTests  : Requesting log for app HTTP-TEST.log-v1-0
15-Mar-2020 00:06:33 2020-03-15 00:06:33.378  INFO 3955 --- [           main] o.s.c.d.acceptance.test.HttpSourceTests  : Retrieved logfile from 'http://10.194.6.131:54881/actuator/logfile
15-Mar-2020 00:06:33 2020-03-15 00:06:33.379  INFO 3955 --- [           main] o.s.c.d.acceptance.test.HttpSourceTests  : Matched all '63f9bb8d-8b1a-4d99-b112-149a804249e9' in logfile for app log (source HTTP-TEST.log-v1-0)
15-Mar-2020 00:06:33 2020-03-15 00:06:33.380  INFO 3955 --- [           main] junit.logTestName                        : Test httpSourceTests(org.springframework.cloud.dataflow.acceptance.test.HttpSourceTests) Succeeded
15-Mar-2020 00:06:33 2020-03-15 00:06:33.381  INFO 3955 --- [           main] junit.logTestName                        : Finished Test httpSourceTests(org.springframework.cloud.dataflow.acceptance.test.HttpSourceTests)
15-Mar-2020 00:06:33 2020-03-15 00:06:33.381  INFO 3955 --- [           main] o.s.c.d.acceptance.test.HttpSourceTests  : Destroy all streams
15-Mar-2020 00:06:33 Tests run: 1, Failures: 0, Errors: 0, Skipped: 0, Time elapsed: 61.886 sec - in org.springframework.cloud.dataflow.acceptance.test.HttpSourceTests
15-Mar-2020 00:06:33 Running org.springframework.cloud.dataflow.acceptance.test.TimestampTaskTests
15-Mar-2020 00:06:33 2020-03-15 00:06:33.607  INFO 3955 --- [           main] o.s.c.support.GenericApplicationContext  : Refreshing org.springframework.context.support.GenericApplicationContext@378f002a: startup date [Sun Mar 15 00:06:33 UTC 2020]; root of context hierarchy
15-Mar-2020 00:06:33 2020-03-15 00:06:33.720  INFO 3955 --- [           main] junit.logTestName                        : Starting Test timeStampTests(org.springframework.cloud.dataflow.acceptance.test.TimestampTaskTests)
15-Mar-2020 00:06:33 2020-03-15 00:06:33.721  INFO 3955 --- [           main] o.s.c.d.a.test.AbstractTaskTests         : Importing task apps from uri resource: https://dataflow.spring.io/task-maven-latest
15-Mar-2020 00:06:34 2020-03-15 00:06:34.274  INFO 3955 --- [           main] o.s.c.d.a.test.AbstractTaskTests         : Done importing task apps.
15-Mar-2020 00:06:44 2020-03-15 00:06:44.682  INFO 3955 --- [           main] junit.logTestName                        : Test timeStampTests(org.springframework.cloud.dataflow.acceptance.test.TimestampTaskTests) Succeeded
15-Mar-2020 00:06:44 2020-03-15 00:06:44.682  INFO 3955 --- [           main] junit.logTestName                        : Finished Test timeStampTests(org.springframework.cloud.dataflow.acceptance.test.TimestampTaskTests)
15-Mar-2020 00:06:44 2020-03-15 00:06:44.752  INFO 3955 --- [           main] junit.logTestName                        : Starting Test timeStampTestsMultipleLaunch(org.springframework.cloud.dataflow.acceptance.test.TimestampTaskTests)
15-Mar-2020 00:07:05 2020-03-15 00:07:05.216  INFO 3955 --- [           main] junit.logTestName                        : Test timeStampTestsMultipleLaunch(org.springframework.cloud.dataflow.acceptance.test.TimestampTaskTests) Succeeded
15-Mar-2020 00:07:05 2020-03-15 00:07:05.217  INFO 3955 --- [           main] junit.logTestName                        : Finished Test timeStampTestsMultipleLaunch(org.springframework.cloud.dataflow.acceptance.test.TimestampTaskTests)
15-Mar-2020 00:07:05 Tests run: 2, Failures: 0, Errors: 0, Skipped: 0, Time elapsed: 31.62 sec - in org.springframework.cloud.dataflow.acceptance.test.TimestampTaskTests
15-Mar-2020 00:07:05 Running org.springframework.cloud.dataflow.acceptance.test.TickTockTests
15-Mar-2020 00:07:05 2020-03-15 00:07:05.220  INFO 3955 --- [           main] .b.t.c.SpringBootTestContextBootstrapper : Neither @ContextConfiguration nor @ContextHierarchy found for test class [org.springframework.cloud.dataflow.acceptance.test.TickTockTests], using SpringBootContextLoader
15-Mar-2020 00:07:05 2020-03-15 00:07:05.225  INFO 3955 --- [           main] .b.t.c.SpringBootTestContextBootstrapper : Loaded default TestExecutionListener class names from location [META-INF/spring.factories]: [org.springframework.boot.test.mock.mockito.MockitoTestExecutionListener, org.springframework.boot.test.mock.mockito.ResetMocksTestExecutionListener, org.springframework.boot.test.autoconfigure.restdocs.RestDocsTestExecutionListener, org.springframework.boot.test.autoconfigure.web.client.MockRestServiceServerResetTestExecutionListener, org.springframework.boot.test.autoconfigure.web.servlet.MockMvcPrintOnlyOnFailureTestExecutionListener, org.springframework.boot.test.autoconfigure.web.servlet.WebDriverTestExecutionListener, org.springframework.test.context.web.ServletTestExecutionListener, org.springframework.test.context.support.DirtiesContextBeforeModesTestExecutionListener, org.springframework.test.context.support.DependencyInjectionTestExecutionListener, org.springframework.test.context.support.DirtiesContextTestExecutionListener, org.springframework.test.context.transaction.TransactionalTestExecutionListener, org.springframework.test.context.jdbc.SqlScriptsTestExecutionListener]
15-Mar-2020 00:07:05 2020-03-15 00:07:05.228  INFO 3955 --- [           main] .b.t.c.SpringBootTestContextBootstrapper : Using TestExecutionListeners: [org.springframework.test.context.web.ServletTestExecutionListener@a4b5ce3, org.springframework.test.context.support.DirtiesContextBeforeModesTestExecutionListener@f5b6e78, org.springframework.boot.test.autoconfigure.SpringBootDependencyInjectionTestExecutionListener@4b4eced1, org.springframework.test.context.support.DirtiesContextTestExecutionListener@71926a36, org.springframework.test.context.transaction.TransactionalTestExecutionListener@216e9ca3, org.springframework.test.context.jdbc.SqlScriptsTestExecutionListener@75120e58, org.springframework.boot.test.mock.mockito.MockitoTestExecutionListener@48976e6d, org.springframework.boot.test.autoconfigure.web.servlet.MockMvcPrintOnlyOnFailureTestExecutionListener@2a367e93, org.springframework.boot.test.autoconfigure.web.client.MockRestServiceServerResetTestExecutionListener@7f6874f2, org.springframework.boot.test.mock.mockito.ResetMocksTestExecutionListener@1a6dc589, org.springframework.boot.test.autoconfigure.web.servlet.WebDriverTestExecutionListener@697a34af, org.springframework.boot.test.autoconfigure.restdocs.RestDocsTestExecutionListener@70211df5]
15-Mar-2020 00:07:05 2020-03-15 00:07:05.302  INFO 3955 --- [           main] junit.logTestName                        : Starting Test tickTockUpdateRollbackTests(org.springframework.cloud.dataflow.acceptance.test.TickTockTests)
15-Mar-2020 00:07:05 2020-03-15 00:07:05.337  INFO 3955 --- [           main] o.s.c.d.acceptance.test.TickTockTests    : Creating stream 'TICKTOCK'
15-Mar-2020 00:07:05 2020-03-15 00:07:05.371  INFO 3955 --- [           main] o.s.c.d.acceptance.test.TickTockTests    : Deploying stream 'TICKTOCK' with properties: {app.*.spring.cloud.streamapp.security.enabled=false, app.*.logging.file=${PID}-test.log, app.*.endpoints.logfile.sensitive=false, app.log.log.expression='TICKTOCK - TIMESTAMP: '.concat(payload), app.*.management.endpoints.web.exposure.include=*}
15-Mar-2020 00:07:06 2020-03-15 00:07:06.010  INFO 3955 --- [           main] o.s.c.d.acceptance.test.TickTockTests    : Checking: Stream=TICKTOCK, status = deploying, status description = The stream is being deployed.
15-Mar-2020 00:07:06 2020-03-15 00:07:06.010  INFO 3955 --- [           main] o.s.c.d.acceptance.test.TickTockTests    : Sleeping to check status of Stream=TICKTOCK
15-Mar-2020 00:07:16 2020-03-15 00:07:16.090  INFO 3955 --- [           main] o.s.c.d.acceptance.test.TickTockTests    : Checking: Stream=TICKTOCK, status = deploying, status description = The stream is being deployed.
15-Mar-2020 00:07:16 2020-03-15 00:07:16.091  INFO 3955 --- [           main] o.s.c.d.acceptance.test.TickTockTests    : Sleeping to check status of Stream=TICKTOCK
15-Mar-2020 00:07:26 2020-03-15 00:07:26.123  INFO 3955 --- [           main] o.s.c.d.acceptance.test.TickTockTests    : Checking: Stream=TICKTOCK, status = deployed, status description = The stream has been successfully deployed
15-Mar-2020 00:07:26 2020-03-15 00:07:26.158  INFO 3955 --- [           main] o.s.c.d.acceptance.test.TickTockTests    : Sleeping to check status of Stream=TICKTOCK
15-Mar-2020 00:07:36 2020-03-15 00:07:36.158  INFO 3955 --- [           main] o.s.c.d.acceptance.test.TickTockTests    : Stream 'TICKTOCK' started with status: deployed
15-Mar-2020 00:07:36 2020-03-15 00:07:36.159  INFO 3955 --- [           main] o.s.c.d.acceptance.test.TickTockTests    : App 'log' has instances: {TICKTOCK.log-v1-0=http://10.194.6.131:22324}
15-Mar-2020 00:07:36 2020-03-15 00:07:36.159  INFO 3955 --- [           main] o.s.c.d.acceptance.test.TickTockTests    : App 'time' has instances: {TICKTOCK.time-v1-0=http://10.194.6.131:48510}
15-Mar-2020 00:07:36 2020-03-15 00:07:36.160  INFO 3955 --- [           main] o.s.c.d.acceptance.test.TickTockTests    : Looking for 'Started TimeSource' in logfile for time
15-Mar-2020 00:07:46 2020-03-15 00:07:46.160  INFO 3955 --- [           main] o.s.c.d.acceptance.test.TickTockTests    : Requesting log for app TICKTOCK.time-v1-0
15-Mar-2020 00:07:46 2020-03-15 00:07:46.440  INFO 3955 --- [           main] o.s.c.d.acceptance.test.TickTockTests    : Retrieved logfile from 'http://10.194.6.131:48510/actuator/logfile
15-Mar-2020 00:07:46 2020-03-15 00:07:46.441  INFO 3955 --- [           main] o.s.c.d.acceptance.test.TickTockTests    : Matched all 'Started TimeSource' in logfile for app time (source TICKTOCK.time-v1-0)
15-Mar-2020 00:07:46 2020-03-15 00:07:46.441  INFO 3955 --- [           main] o.s.c.d.acceptance.test.TickTockTests    : Looking for 'Started LogSink' in logfile for log
15-Mar-2020 00:07:56 2020-03-15 00:07:56.441  INFO 3955 --- [           main] o.s.c.d.acceptance.test.TickTockTests    : Requesting log for app TICKTOCK.log-v1-0
15-Mar-2020 00:07:56 2020-03-15 00:07:56.562  INFO 3955 --- [           main] o.s.c.d.acceptance.test.TickTockTests    : Retrieved logfile from 'http://10.194.6.131:22324/actuator/logfile
15-Mar-2020 00:07:56 2020-03-15 00:07:56.562  INFO 3955 --- [           main] o.s.c.d.acceptance.test.TickTockTests    : Matched all 'Started LogSink' in logfile for app log (source TICKTOCK.log-v1-0)
15-Mar-2020 00:07:56 2020-03-15 00:07:56.563  INFO 3955 --- [           main] o.s.c.d.acceptance.test.TickTockTests    : Looking for 'TICKTOCK - TIMESTAMP:' in logfile for log
15-Mar-2020 00:08:06 2020-03-15 00:08:06.563  INFO 3955 --- [           main] o.s.c.d.acceptance.test.TickTockTests    : Requesting log for app TICKTOCK.log-v1-0
15-Mar-2020 00:08:06 2020-03-15 00:08:06.572  INFO 3955 --- [           main] o.s.c.d.acceptance.test.TickTockTests    : Retrieved logfile from 'http://10.194.6.131:22324/actuator/logfile
15-Mar-2020 00:08:06 2020-03-15 00:08:06.572  INFO 3955 --- [           main] o.s.c.d.acceptance.test.TickTockTests    : Matched all 'TICKTOCK - TIMESTAMP:' in logfile for app log (source TICKTOCK.log-v1-0)
15-Mar-2020 00:08:06 2020-03-15 00:08:06.574  INFO 3955 --- [           main] o.s.c.d.acceptance.test.TickTockTests    : Updating stream 'TICKTOCK'
15-Mar-2020 00:08:07 2020-03-15 00:08:07.173  INFO 3955 --- [           main] o.s.c.d.acceptance.test.TickTockTests    : Checking: Stream=TICKTOCK, status = deploying, status description = The stream is being deployed.
15-Mar-2020 00:08:07 2020-03-15 00:08:07.173  INFO 3955 --- [           main] o.s.c.d.acceptance.test.TickTockTests    : Sleeping to check status of Stream=TICKTOCK
15-Mar-2020 00:08:17 2020-03-15 00:08:17.210  INFO 3955 --- [           main] o.s.c.d.acceptance.test.TickTockTests    : Checking: Stream=TICKTOCK, status = deployed, status description = The stream has been successfully deployed
15-Mar-2020 00:08:17 2020-03-15 00:08:17.243  INFO 3955 --- [           main] o.s.c.d.acceptance.test.TickTockTests    : Sleeping to check status of Stream=TICKTOCK
15-Mar-2020 00:08:27 2020-03-15 00:08:27.243  INFO 3955 --- [           main] o.s.c.d.acceptance.test.TickTockTests    : Stream 'TICKTOCK' started with status: deployed
15-Mar-2020 00:08:27 2020-03-15 00:08:27.243  INFO 3955 --- [           main] o.s.c.d.acceptance.test.TickTockTests    : App 'log' has instances: {TICKTOCK.log-v1-0=http://10.194.6.131:22324, TICKTOCK.log-v2-0=http://10.194.6.131:39923}
15-Mar-2020 00:08:27 2020-03-15 00:08:27.243  INFO 3955 --- [           main] o.s.c.d.acceptance.test.TickTockTests    : App 'time' has instances: {TICKTOCK.time-v1-0=http://10.194.6.131:48510}
15-Mar-2020 00:08:27 2020-03-15 00:08:27.243  INFO 3955 --- [           main] o.s.c.d.acceptance.test.TickTockTests    : Looking for 'Started LogSink' in logfile for log
15-Mar-2020 00:08:37 2020-03-15 00:08:37.244  INFO 3955 --- [           main] o.s.c.d.acceptance.test.TickTockTests    : Requesting log for app TICKTOCK.log-v1-0
15-Mar-2020 00:08:37 2020-03-15 00:08:37.245  WARN 3955 --- [           main] o.s.c.d.acceptance.test.TickTockTests    : Error while trying to access logfile from 'http://10.194.6.131:22324/logfile' due to : org.springframework.web.client.ResourceAccessException: I/O error on GET request for "http://10.194.6.131:22324/logfile": Connection refused (Connection refused); nested exception is java.net.ConnectException: Connection refused (Connection refused)
15-Mar-2020 00:08:37 2020-03-15 00:08:37.245  INFO 3955 --- [           main] o.s.c.d.acceptance.test.TickTockTests    : Requesting log for app TICKTOCK.log-v2-0
15-Mar-2020 00:08:37 2020-03-15 00:08:37.533  INFO 3955 --- [           main] o.s.c.d.acceptance.test.TickTockTests    : Retrieved logfile from 'http://10.194.6.131:39923/actuator/logfile
15-Mar-2020 00:08:37 2020-03-15 00:08:37.533  INFO 3955 --- [           main] o.s.c.d.acceptance.test.TickTockTests    : Matched all 'Started LogSink' in logfile for app log (source TICKTOCK.log-v2-0)
15-Mar-2020 00:08:37 2020-03-15 00:08:37.533  INFO 3955 --- [           main] o.s.c.d.acceptance.test.TickTockTests    : Looking for 'TICKTOCK Updated - TIMESTAMP:' in logfile for log
15-Mar-2020 00:08:47 2020-03-15 00:08:47.533  INFO 3955 --- [           main] o.s.c.d.acceptance.test.TickTockTests    : Requesting log for app TICKTOCK.log-v1-0
15-Mar-2020 00:08:47 2020-03-15 00:08:47.535  WARN 3955 --- [           main] o.s.c.d.acceptance.test.TickTockTests    : Error while trying to access logfile from 'http://10.194.6.131:22324/logfile' due to : org.springframework.web.client.ResourceAccessException: I/O error on GET request for "http://10.194.6.131:22324/logfile": Connection refused (Connection refused); nested exception is java.net.ConnectException: Connection refused (Connection refused)
15-Mar-2020 00:08:47 2020-03-15 00:08:47.535  INFO 3955 --- [           main] o.s.c.d.acceptance.test.TickTockTests    : Requesting log for app TICKTOCK.log-v2-0
15-Mar-2020 00:08:47 2020-03-15 00:08:47.544  INFO 3955 --- [           main] o.s.c.d.acceptance.test.TickTockTests    : Retrieved logfile from 'http://10.194.6.131:39923/actuator/logfile
15-Mar-2020 00:08:47 2020-03-15 00:08:47.544  INFO 3955 --- [           main] o.s.c.d.acceptance.test.TickTockTests    : Matched all 'TICKTOCK Updated - TIMESTAMP:' in logfile for app log (source TICKTOCK.log-v2-0)
15-Mar-2020 00:08:47 2020-03-15 00:08:47.544  INFO 3955 --- [           main] o.s.c.d.acceptance.test.TickTockTests    : Rolling back the stream 'TICKTOCK' to the version 0
15-Mar-2020 00:08:47 2020-03-15 00:08:47.954  INFO 3955 --- [           main] o.s.c.d.acceptance.test.TickTockTests    : Checking: Stream=TICKTOCK, status = deploying, status description = The stream is being deployed.
15-Mar-2020 00:08:47 2020-03-15 00:08:47.955  INFO 3955 --- [           main] o.s.c.d.acceptance.test.TickTockTests    : Sleeping to check status of Stream=TICKTOCK
15-Mar-2020 00:08:57 2020-03-15 00:08:57.985  INFO 3955 --- [           main] o.s.c.d.acceptance.test.TickTockTests    : Checking: Stream=TICKTOCK, status = deployed, status description = The stream has been successfully deployed
15-Mar-2020 00:08:58 2020-03-15 00:08:58.053  INFO 3955 --- [           main] o.s.c.d.acceptance.test.TickTockTests    : Sleeping to check status of Stream=TICKTOCK
15-Mar-2020 00:09:08 2020-03-15 00:09:08.054  INFO 3955 --- [           main] o.s.c.d.acceptance.test.TickTockTests    : Stream 'TICKTOCK' started with status: deployed
15-Mar-2020 00:09:08 2020-03-15 00:09:08.054  INFO 3955 --- [           main] o.s.c.d.acceptance.test.TickTockTests    : App 'log' has instances: {TICKTOCK.log-v1-0=http://10.194.6.131:22324, TICKTOCK.log-v3-0=http://10.194.6.131:28352, TICKTOCK.log-v2-0=http://10.194.6.131:39923}
15-Mar-2020 00:09:08 2020-03-15 00:09:08.054  INFO 3955 --- [           main] o.s.c.d.acceptance.test.TickTockTests    : App 'time' has instances: {TICKTOCK.time-v1-0=http://10.194.6.131:48510}
15-Mar-2020 00:09:08 2020-03-15 00:09:08.054  INFO 3955 --- [           main] o.s.c.d.acceptance.test.TickTockTests    : Looking for 'TICKTOCK - TIMESTAMP:' in logfile for log
15-Mar-2020 00:09:18 2020-03-15 00:09:18.054  INFO 3955 --- [           main] o.s.c.d.acceptance.test.TickTockTests    : Requesting log for app TICKTOCK.log-v1-0
15-Mar-2020 00:09:18 2020-03-15 00:09:18.056  WARN 3955 --- [           main] o.s.c.d.acceptance.test.TickTockTests    : Error while trying to access logfile from 'http://10.194.6.131:22324/logfile' due to : org.springframework.web.client.ResourceAccessException: I/O error on GET request for "http://10.194.6.131:22324/logfile": Connection refused (Connection refused); nested exception is java.net.ConnectException: Connection refused (Connection refused)
15-Mar-2020 00:09:18 2020-03-15 00:09:18.056  INFO 3955 --- [           main] o.s.c.d.acceptance.test.TickTockTests    : Requesting log for app TICKTOCK.log-v3-0
15-Mar-2020 00:09:18 2020-03-15 00:09:18.189  INFO 3955 --- [           main] o.s.c.d.acceptance.test.TickTockTests    : Retrieved logfile from 'http://10.194.6.131:28352/actuator/logfile
15-Mar-2020 00:09:18 2020-03-15 00:09:18.189  INFO 3955 --- [           main] o.s.c.d.acceptance.test.TickTockTests    : Requesting log for app TICKTOCK.log-v2-0
15-Mar-2020 00:09:18 2020-03-15 00:09:18.190  WARN 3955 --- [           main] o.s.c.d.acceptance.test.TickTockTests    : Error while trying to access logfile from 'http://10.194.6.131:39923/logfile' due to : org.springframework.web.client.ResourceAccessException: I/O error on GET request for "http://10.194.6.131:39923/logfile": Connection refused (Connection refused); nested exception is java.net.ConnectException: Connection refused (Connection refused)
15-Mar-2020 00:09:18 2020-03-15 00:09:18.190  INFO 3955 --- [           main] o.s.c.d.acceptance.test.TickTockTests    : Matched all 'TICKTOCK - TIMESTAMP:' in logfile for app log (source TICKTOCK.log-v3-0)
15-Mar-2020 00:09:18 2020-03-15 00:09:18.192  INFO 3955 --- [           main] junit.logTestName                        : Test tickTockUpdateRollbackTests(org.springframework.cloud.dataflow.acceptance.test.TickTockTests) Succeeded
15-Mar-2020 00:09:18 2020-03-15 00:09:18.192  INFO 3955 --- [           main] junit.logTestName                        : Finished Test tickTockUpdateRollbackTests(org.springframework.cloud.dataflow.acceptance.test.TickTockTests)
15-Mar-2020 00:09:18 2020-03-15 00:09:18.192  INFO 3955 --- [           main] o.s.c.d.acceptance.test.TickTockTests    : Destroy all streams
15-Mar-2020 00:09:18 2020-03-15 00:09:18.534  INFO 3955 --- [           main] junit.logTestName                        : Starting Test tickTockTests(org.springframework.cloud.dataflow.acceptance.test.TickTockTests)
15-Mar-2020 00:09:18 2020-03-15 00:09:18.538  INFO 3955 --- [           main] o.s.c.d.acceptance.test.TickTockTests    : Creating stream 'TICKTOCK'
15-Mar-2020 00:09:18 2020-03-15 00:09:18.605  INFO 3955 --- [           main] o.s.c.d.acceptance.test.TickTockTests    : Deploying stream 'TICKTOCK' with properties: {app.*.spring.cloud.streamapp.security.enabled=false, app.*.logging.file=${PID}-test.log, app.*.endpoints.logfile.sensitive=false, app.log.log.expression='TICKTOCK - TIMESTAMP: '.concat(payload), app.*.management.endpoints.web.exposure.include=*}
15-Mar-2020 00:09:19 2020-03-15 00:09:19.198  INFO 3955 --- [           main] o.s.c.d.acceptance.test.TickTockTests    : Checking: Stream=TICKTOCK, status = deploying, status description = The stream is being deployed.
15-Mar-2020 00:09:19 2020-03-15 00:09:19.198  INFO 3955 --- [           main] o.s.c.d.acceptance.test.TickTockTests    : Sleeping to check status of Stream=TICKTOCK
15-Mar-2020 00:09:29 2020-03-15 00:09:29.243  INFO 3955 --- [           main] o.s.c.d.acceptance.test.TickTockTests    : Checking: Stream=TICKTOCK, status = deploying, status description = The stream is being deployed.
15-Mar-2020 00:09:29 2020-03-15 00:09:29.243  INFO 3955 --- [           main] o.s.c.d.acceptance.test.TickTockTests    : Sleeping to check status of Stream=TICKTOCK
15-Mar-2020 00:09:39 2020-03-15 00:09:39.269  INFO 3955 --- [           main] o.s.c.d.acceptance.test.TickTockTests    : Checking: Stream=TICKTOCK, status = deployed, status description = The stream has been successfully deployed
15-Mar-2020 00:09:39 2020-03-15 00:09:39.297  INFO 3955 --- [           main] o.s.c.d.acceptance.test.TickTockTests    : Sleeping to check status of Stream=TICKTOCK
15-Mar-2020 00:09:49 2020-03-15 00:09:49.298  INFO 3955 --- [           main] o.s.c.d.acceptance.test.TickTockTests    : Stream 'TICKTOCK' started with status: deployed
15-Mar-2020 00:09:49 2020-03-15 00:09:49.298  INFO 3955 --- [           main] o.s.c.d.acceptance.test.TickTockTests    : App 'log' has instances: {TICKTOCK.log-v4-0=http://10.194.6.131:34259}
15-Mar-2020 00:09:49 2020-03-15 00:09:49.298  INFO 3955 --- [           main] o.s.c.d.acceptance.test.TickTockTests    : App 'time' has instances: {TICKTOCK.time-v4-0=http://10.194.6.131:35290}
15-Mar-2020 00:09:49 2020-03-15 00:09:49.298  INFO 3955 --- [           main] o.s.c.d.acceptance.test.TickTockTests    : Looking for 'Started TimeSource' in logfile for time
15-Mar-2020 00:09:59 2020-03-15 00:09:59.299  INFO 3955 --- [           main] o.s.c.d.acceptance.test.TickTockTests    : Requesting log for app TICKTOCK.time-v4-0
15-Mar-2020 00:09:59 2020-03-15 00:09:59.579  INFO 3955 --- [           main] o.s.c.d.acceptance.test.TickTockTests    : Retrieved logfile from 'http://10.194.6.131:35290/actuator/logfile
15-Mar-2020 00:09:59 2020-03-15 00:09:59.579  INFO 3955 --- [           main] o.s.c.d.acceptance.test.TickTockTests    : Matched all 'Started TimeSource' in logfile for app time (source TICKTOCK.time-v4-0)
15-Mar-2020 00:09:59 2020-03-15 00:09:59.580  INFO 3955 --- [           main] o.s.c.d.acceptance.test.TickTockTests    : Looking for 'Started LogSink' in logfile for log
15-Mar-2020 00:10:09 2020-03-15 00:10:09.580  INFO 3955 --- [           main] o.s.c.d.acceptance.test.TickTockTests    : Requesting log for app TICKTOCK.log-v4-0
15-Mar-2020 00:10:09 2020-03-15 00:10:09.704  INFO 3955 --- [           main] o.s.c.d.acceptance.test.TickTockTests    : Retrieved logfile from 'http://10.194.6.131:34259/actuator/logfile
15-Mar-2020 00:10:09 2020-03-15 00:10:09.704  INFO 3955 --- [           main] o.s.c.d.acceptance.test.TickTockTests    : Matched all 'Started LogSink' in logfile for app log (source TICKTOCK.log-v4-0)
15-Mar-2020 00:10:09 2020-03-15 00:10:09.704  INFO 3955 --- [           main] o.s.c.d.acceptance.test.TickTockTests    : Looking for 'TICKTOCK - TIMESTAMP:' in logfile for log
15-Mar-2020 00:10:19 2020-03-15 00:10:19.705  INFO 3955 --- [           main] o.s.c.d.acceptance.test.TickTockTests    : Requesting log for app TICKTOCK.log-v4-0
15-Mar-2020 00:10:19 2020-03-15 00:10:19.714  INFO 3955 --- [           main] o.s.c.d.acceptance.test.TickTockTests    : Retrieved logfile from 'http://10.194.6.131:34259/actuator/logfile
15-Mar-2020 00:10:19 2020-03-15 00:10:19.715  INFO 3955 --- [           main] o.s.c.d.acceptance.test.TickTockTests    : Matched all 'TICKTOCK - TIMESTAMP:' in logfile for app log (source TICKTOCK.log-v4-0)
15-Mar-2020 00:10:19 2020-03-15 00:10:19.716  INFO 3955 --- [           main] junit.logTestName                        : Test tickTockTests(org.springframework.cloud.dataflow.acceptance.test.TickTockTests) Succeeded
15-Mar-2020 00:10:19 2020-03-15 00:10:19.716  INFO 3955 --- [           main] junit.logTestName                        : Finished Test tickTockTests(org.springframework.cloud.dataflow.acceptance.test.TickTockTests)
15-Mar-2020 00:10:19 2020-03-15 00:10:19.716  INFO 3955 --- [           main] o.s.c.d.acceptance.test.TickTockTests    : Destroy all streams
15-Mar-2020 00:10:20 2020-03-15 00:10:20.000  INFO 3955 --- [           main] junit.logTestName                        : Starting Test tickTockTestsFromConfigServer(org.springframework.cloud.dataflow.acceptance.test.TickTockTests)
15-Mar-2020 00:10:20 2020-03-15 00:10:20.007  INFO 3955 --- [           main] junit.logTestName                        : Finished Test tickTockTestsFromConfigServer(org.springframework.cloud.dataflow.acceptance.test.TickTockTests)
15-Mar-2020 00:10:20 2020-03-15 00:10:20.007  INFO 3955 --- [           main] o.s.c.d.acceptance.test.TickTockTests    : Destroy all streams
15-Mar-2020 00:10:20 Tests run: 3, Failures: 0, Errors: 0, Skipped: 1, Time elapsed: 194.793 sec - in org.springframework.cloud.dataflow.acceptance.test.TickTockTests
15-Mar-2020 00:10:20 Running org.springframework.cloud.dataflow.acceptance.test.ComposedTaskTests
15-Mar-2020 00:10:20 2020-03-15 00:10:20.091  INFO 3955 --- [           main] junit.logTestName                        : Starting Test ctrMultipleLaunchWithArguments(org.springframework.cloud.dataflow.acceptance.test.ComposedTaskTests)
15-Mar-2020 00:13:20 2020-03-15 00:13:20.584 ERROR 3955 --- [           main] junit.logTestName                        : !!! Test ctrMultipleLaunchWithArguments(org.springframework.cloud.dataflow.acceptance.test.ComposedTaskTests) Failed !!!
15-Mar-2020 00:13:20
15-Mar-2020 00:13:20 java.lang.AssertionError: null
15-Mar-2020 00:13:20         at org.junit.Assert.fail(Assert.java:86)
15-Mar-2020 00:13:20         at org.junit.Assert.assertTrue(Assert.java:41)
15-Mar-2020 00:13:20         at org.junit.Assert.assertTrue(Assert.java:52)
15-Mar-2020 00:13:20         at org.springframework.cloud.dataflow.acceptance.test.ComposedTaskTests.assertTaskExecutions(ComposedTaskTests.java:65)
15-Mar-2020 00:13:20         at org.springframework.cloud.dataflow.acceptance.test.ComposedTaskTests.ctrMultipleLaunchWithArguments(ComposedTaskTests.java:57)
15-Mar-2020 00:13:20         at sun.reflect.NativeMethodAccessorImpl.invoke0(Native Method)
15-Mar-2020 00:13:20         at sun.reflect.NativeMethodAccessorImpl.invoke(NativeMethodAccessorImpl.java:62)
15-Mar-2020 00:13:20         at sun.reflect.DelegatingMethodAccessorImpl.invoke(DelegatingMethodAccessorImpl.java:43)
15-Mar-2020 00:13:20         at java.lang.reflect.Method.invoke(Method.java:498)
15-Mar-2020 00:13:20         at org.junit.runners.model.FrameworkMethod$1.runReflectiveCall(FrameworkMethod.java:50)
15-Mar-2020 00:13:20         at org.junit.internal.runners.model.ReflectiveCallable.run(ReflectiveCallable.java:12)
15-Mar-2020 00:13:20         at org.junit.runners.model.FrameworkMethod.invokeExplosively(FrameworkMethod.java:47)
15-Mar-2020 00:13:20         at org.junit.internal.runners.statements.InvokeMethod.evaluate(InvokeMethod.java:17)
15-Mar-2020 00:13:20         at org.junit.internal.runners.statements.RunBefores.evaluate(RunBefores.java:26)
15-Mar-2020 00:13:20         at org.springframework.test.context.junit4.statements.RunBeforeTestMethodCallbacks.evaluate(RunBeforeTestMethodCallbacks.java:75)
15-Mar-2020 00:13:20         at org.junit.internal.runners.statements.RunAfters.evaluate(RunAfters.java:27)
15-Mar-2020 00:13:20         at org.springframework.test.context.junit4.statements.RunAfterTestMethodCallbacks.evaluate(RunAfterTestMethodCallbacks.java:86)
15-Mar-2020 00:13:20         at org.junit.rules.TestWatcher$1.evaluate(TestWatcher.java:55)
15-Mar-2020 00:13:20         at org.junit.rules.RunRules.evaluate(RunRules.java:20)
15-Mar-2020 00:13:20         at org.springframework.test.context.junit4.statements.SpringRepeat.evaluate(SpringRepeat.java:84)
15-Mar-2020 00:13:20         at org.junit.runners.ParentRunner.runLeaf(ParentRunner.java:325)
15-Mar-2020 00:13:20         at org.springframework.test.context.junit4.SpringJUnit4ClassRunner.runChild(SpringJUnit4ClassRunner.java:252)
15-Mar-2020 00:13:20         at org.springframework.test.context.junit4.SpringJUnit4ClassRunner.runChild(SpringJUnit4ClassRunner.java:94)
15-Mar-2020 00:13:20         at org.junit.runners.ParentRunner$3.run(ParentRunner.java:290)
15-Mar-2020 00:13:20         at org.junit.runners.ParentRunner$1.schedule(ParentRunner.java:71)
15-Mar-2020 00:13:20         at org.junit.runners.ParentRunner.runChildren(ParentRunner.java:288)
15-Mar-2020 00:13:20         at org.junit.runners.ParentRunner.access$000(ParentRunner.java:58)
15-Mar-2020 00:13:20         at org.junit.runners.ParentRunner$2.evaluate(ParentRunner.java:268)
15-Mar-2020 00:13:20         at org.springframework.test.context.junit4.statements.RunBeforeTestClassCallbacks.evaluate(RunBeforeTestClassCallbacks.java:61)
15-Mar-2020 00:13:20         at org.springframework.test.context.junit4.statements.RunAfterTestClassCallbacks.evaluate(RunAfterTestClassCallbacks.java:70)
15-Mar-2020 00:13:20         at org.junit.runners.ParentRunner.run(ParentRunner.java:363)
15-Mar-2020 00:13:20         at org.springframework.test.context.junit4.SpringJUnit4ClassRunner.run(SpringJUnit4ClassRunner.java:191)
15-Mar-2020 00:13:20         at org.apache.maven.surefire.junit4.JUnit4Provider.execute(JUnit4Provider.java:283)
15-Mar-2020 00:13:20         at org.apache.maven.surefire.junit4.JUnit4Provider.executeWithRerun(JUnit4Provider.java:173)
15-Mar-2020 00:13:20         at org.apache.maven.surefire.junit4.JUnit4Provider.executeTestSet(JUnit4Provider.java:153)
15-Mar-2020 00:13:20         at org.apache.maven.surefire.junit4.JUnit4Provider.invoke(JUnit4Provider.java:128)
15-Mar-2020 00:13:20         at org.apache.maven.surefire.booter.ForkedBooter.invokeProviderInSameClassLoader(ForkedBooter.java:203)
15-Mar-2020 00:13:20         at org.apache.maven.surefire.booter.ForkedBooter.runSuitesInProcess(ForkedBooter.java:155)
15-Mar-2020 00:13:20         at org.apache.maven.surefire.booter.ForkedBooter.main(ForkedBooter.java:103)
15-Mar-2020 00:13:20
15-Mar-2020 00:13:20 2020-03-15 00:13:20.586  INFO 3955 --- [           main] junit.logTestName                        : Finished Test ctrMultipleLaunchWithArguments(org.springframework.cloud.dataflow.acceptance.test.ComposedTaskTests)
15-Mar-2020 00:13:20 2020-03-15 00:13:20.648  INFO 3955 --- [           main] junit.logTestName                        : Starting Test ctrMultipleLaunch(org.springframework.cloud.dataflow.acceptance.test.ComposedTaskTests)
15-Mar-2020 00:16:21 2020-03-15 00:16:21.124 ERROR 3955 --- [           main] junit.logTestName                        : !!! Test ctrMultipleLaunch(org.springframework.cloud.dataflow.acceptance.test.ComposedTaskTests) Failed !!!
15-Mar-2020 00:16:21
15-Mar-2020 00:16:21 java.lang.AssertionError: null
15-Mar-2020 00:16:21         at org.junit.Assert.fail(Assert.java:86)
15-Mar-2020 00:16:21         at org.junit.Assert.assertTrue(Assert.java:41)
15-Mar-2020 00:16:21         at org.junit.Assert.assertTrue(Assert.java:52)
15-Mar-2020 00:16:21         at org.springframework.cloud.dataflow.acceptance.test.ComposedTaskTests.assertTaskExecutions(ComposedTaskTests.java:65)
15-Mar-2020 00:16:21         at org.springframework.cloud.dataflow.acceptance.test.ComposedTaskTests.ctrMultipleLaunch(ComposedTaskTests.java:47)
15-Mar-2020 00:16:21         at sun.reflect.NativeMethodAccessorImpl.invoke0(Native Method)
15-Mar-2020 00:16:21         at sun.reflect.NativeMethodAccessorImpl.invoke(NativeMethodAccessorImpl.java:62)
15-Mar-2020 00:16:21         at sun.reflect.DelegatingMethodAccessorImpl.invoke(DelegatingMethodAccessorImpl.java:43)
15-Mar-2020 00:16:21         at java.lang.reflect.Method.invoke(Method.java:498)
15-Mar-2020 00:16:21         at org.junit.runners.model.FrameworkMethod$1.runReflectiveCall(FrameworkMethod.java:50)
15-Mar-2020 00:16:21         at org.junit.internal.runners.model.ReflectiveCallable.run(ReflectiveCallable.java:12)
15-Mar-2020 00:16:21         at org.junit.runners.model.FrameworkMethod.invokeExplosively(FrameworkMethod.java:47)
15-Mar-2020 00:16:21         at org.junit.internal.runners.statements.InvokeMethod.evaluate(InvokeMethod.java:17)
15-Mar-2020 00:16:21         at org.junit.internal.runners.statements.RunBefores.evaluate(RunBefores.java:26)
15-Mar-2020 00:16:21         at org.springframework.test.context.junit4.statements.RunBeforeTestMethodCallbacks.evaluate(RunBeforeTestMethodCallbacks.java:75)
15-Mar-2020 00:16:21         at org.junit.internal.runners.statements.RunAfters.evaluate(RunAfters.java:27)
15-Mar-2020 00:16:21         at org.springframework.test.context.junit4.statements.RunAfterTestMethodCallbacks.evaluate(RunAfterTestMethodCallbacks.java:86)
15-Mar-2020 00:16:21         at org.junit.rules.TestWatcher$1.evaluate(TestWatcher.java:55)
15-Mar-2020 00:16:21         at org.junit.rules.RunRules.evaluate(RunRules.java:20)
15-Mar-2020 00:16:21         at org.springframework.test.context.junit4.statements.SpringRepeat.evaluate(SpringRepeat.java:84)
15-Mar-2020 00:16:21         at org.junit.runners.ParentRunner.runLeaf(ParentRunner.java:325)
15-Mar-2020 00:16:21         at org.springframework.test.context.junit4.SpringJUnit4ClassRunner.runChild(SpringJUnit4ClassRunner.java:252)
15-Mar-2020 00:16:21         at org.springframework.test.context.junit4.SpringJUnit4ClassRunner.runChild(SpringJUnit4ClassRunner.java:94)
15-Mar-2020 00:16:21         at org.junit.runners.ParentRunner$3.run(ParentRunner.java:290)
15-Mar-2020 00:16:21         at org.junit.runners.ParentRunner$1.schedule(ParentRunner.java:71)
15-Mar-2020 00:16:21         at org.junit.runners.ParentRunner.runChildren(ParentRunner.java:288)
15-Mar-2020 00:16:21         at org.junit.runners.ParentRunner.access$000(ParentRunner.java:58)
15-Mar-2020 00:16:21         at org.junit.runners.ParentRunner$2.evaluate(ParentRunner.java:268)
15-Mar-2020 00:16:21         at org.springframework.test.context.junit4.statements.RunBeforeTestClassCallbacks.evaluate(RunBeforeTestClassCallbacks.java:61)
15-Mar-2020 00:16:21         at org.springframework.test.context.junit4.statements.RunAfterTestClassCallbacks.evaluate(RunAfterTestClassCallbacks.java:70)
15-Mar-2020 00:16:21         at org.junit.runners.ParentRunner.run(ParentRunner.java:363)
15-Mar-2020 00:16:21         at org.springframework.test.context.junit4.SpringJUnit4ClassRunner.run(SpringJUnit4ClassRunner.java:191)
15-Mar-2020 00:16:21         at org.apache.maven.surefire.junit4.JUnit4Provider.execute(JUnit4Provider.java:283)
15-Mar-2020 00:16:21         at org.apache.maven.surefire.junit4.JUnit4Provider.executeWithRerun(JUnit4Provider.java:173)
15-Mar-2020 00:16:21         at org.apache.maven.surefire.junit4.JUnit4Provider.executeTestSet(JUnit4Provider.java:153)
15-Mar-2020 00:16:21         at org.apache.maven.surefire.junit4.JUnit4Provider.invoke(JUnit4Provider.java:128)
15-Mar-2020 00:16:21         at org.apache.maven.surefire.booter.ForkedBooter.invokeProviderInSameClassLoader(ForkedBooter.java:203)
15-Mar-2020 00:16:21         at org.apache.maven.surefire.booter.ForkedBooter.runSuitesInProcess(ForkedBooter.java:155)
15-Mar-2020 00:16:21         at org.apache.maven.surefire.booter.ForkedBooter.main(ForkedBooter.java:103)
15-Mar-2020 00:16:21
15-Mar-2020 00:16:21 2020-03-15 00:16:21.125  INFO 3955 --- [           main] junit.logTestName                        : Finished Test ctrMultipleLaunch(org.springframework.cloud.dataflow.acceptance.test.ComposedTaskTests)
15-Mar-2020 00:16:21 2020-03-15 00:16:21.186  INFO 3955 --- [           main] junit.logTestName                        : Starting Test ctrLaunch(org.springframework.cloud.dataflow.acceptance.test.ComposedTaskTests)
15-Mar-2020 00:19:21 2020-03-15 00:19:21.697 ERROR 3955 --- [           main] junit.logTestName                        : !!! Test ctrLaunch(org.springframework.cloud.dataflow.acceptance.test.ComposedTaskTests) Failed !!!
15-Mar-2020 00:19:21
15-Mar-2020 00:19:21 java.lang.AssertionError: null
15-Mar-2020 00:19:21         at org.junit.Assert.fail(Assert.java:86)
15-Mar-2020 00:19:21         at org.junit.Assert.assertTrue(Assert.java:41)
15-Mar-2020 00:19:21         at org.junit.Assert.assertTrue(Assert.java:52)
15-Mar-2020 00:19:21         at org.springframework.cloud.dataflow.acceptance.test.ComposedTaskTests.assertTaskExecutions(ComposedTaskTests.java:65)
15-Mar-2020 00:19:21         at org.springframework.cloud.dataflow.acceptance.test.ComposedTaskTests.ctrLaunch(ComposedTaskTests.java:41)
15-Mar-2020 00:19:21         at sun.reflect.NativeMethodAccessorImpl.invoke0(Native Method)
15-Mar-2020 00:19:21         at sun.reflect.NativeMethodAccessorImpl.invoke(NativeMethodAccessorImpl.java:62)
15-Mar-2020 00:19:21         at sun.reflect.DelegatingMethodAccessorImpl.invoke(DelegatingMethodAccessorImpl.java:43)
15-Mar-2020 00:19:21         at java.lang.reflect.Method.invoke(Method.java:498)
15-Mar-2020 00:19:21         at org.junit.runners.model.FrameworkMethod$1.runReflectiveCall(FrameworkMethod.java:50)
15-Mar-2020 00:19:21         at org.junit.internal.runners.model.ReflectiveCallable.run(ReflectiveCallable.java:12)
15-Mar-2020 00:19:21         at org.junit.runners.model.FrameworkMethod.invokeExplosively(FrameworkMethod.java:47)
15-Mar-2020 00:19:21         at org.junit.internal.runners.statements.InvokeMethod.evaluate(InvokeMethod.java:17)
15-Mar-2020 00:19:21         at org.junit.internal.runners.statements.RunBefores.evaluate(RunBefores.java:26)
15-Mar-2020 00:19:21         at org.springframework.test.context.junit4.statements.RunBeforeTestMethodCallbacks.evaluate(RunBeforeTestMethodCallbacks.java:75)
15-Mar-2020 00:19:21         at org.junit.internal.runners.statements.RunAfters.evaluate(RunAfters.java:27)
15-Mar-2020 00:19:21         at org.springframework.test.context.junit4.statements.RunAfterTestMethodCallbacks.evaluate(RunAfterTestMethodCallbacks.java:86)
15-Mar-2020 00:19:21         at org.junit.rules.TestWatcher$1.evaluate(TestWatcher.java:55)
15-Mar-2020 00:19:21         at org.junit.rules.RunRules.evaluate(RunRules.java:20)
15-Mar-2020 00:19:21         at org.springframework.test.context.junit4.statements.SpringRepeat.evaluate(SpringRepeat.java:84)
15-Mar-2020 00:19:21         at org.junit.runners.ParentRunner.runLeaf(ParentRunner.java:325)
15-Mar-2020 00:19:21         at org.springframework.test.context.junit4.SpringJUnit4ClassRunner.runChild(SpringJUnit4ClassRunner.java:252)
15-Mar-2020 00:19:21         at org.springframework.test.context.junit4.SpringJUnit4ClassRunner.runChild(SpringJUnit4ClassRunner.java:94)
15-Mar-2020 00:19:21         at org.junit.runners.ParentRunner$3.run(ParentRunner.java:290)
15-Mar-2020 00:19:21         at org.junit.runners.ParentRunner$1.schedule(ParentRunner.java:71)
15-Mar-2020 00:19:21         at org.junit.runners.ParentRunner.runChildren(ParentRunner.java:288)
15-Mar-2020 00:19:21         at org.junit.runners.ParentRunner.access$000(ParentRunner.java:58)
15-Mar-2020 00:19:21         at org.junit.runners.ParentRunner$2.evaluate(ParentRunner.java:268)
15-Mar-2020 00:19:21         at org.springframework.test.context.junit4.statements.RunBeforeTestClassCallbacks.evaluate(RunBeforeTestClassCallbacks.java:61)
15-Mar-2020 00:19:21         at org.springframework.test.context.junit4.statements.RunAfterTestClassCallbacks.evaluate(RunAfterTestClassCallbacks.java:70)
15-Mar-2020 00:19:21         at org.junit.runners.ParentRunner.run(ParentRunner.java:363)
15-Mar-2020 00:19:21         at org.springframework.test.context.junit4.SpringJUnit4ClassRunner.run(SpringJUnit4ClassRunner.java:191)
15-Mar-2020 00:19:21         at org.apache.maven.surefire.junit4.JUnit4Provider.execute(JUnit4Provider.java:283)
15-Mar-2020 00:19:21         at org.apache.maven.surefire.junit4.JUnit4Provider.executeWithRerun(JUnit4Provider.java:173)
15-Mar-2020 00:19:21         at org.apache.maven.surefire.junit4.JUnit4Provider.executeTestSet(JUnit4Provider.java:153)
15-Mar-2020 00:19:21         at org.apache.maven.surefire.junit4.JUnit4Provider.invoke(JUnit4Provider.java:128)
15-Mar-2020 00:19:21         at org.apache.maven.surefire.booter.ForkedBooter.invokeProviderInSameClassLoader(ForkedBooter.java:203)
15-Mar-2020 00:19:21         at org.apache.maven.surefire.booter.ForkedBooter.runSuitesInProcess(ForkedBooter.java:155)
15-Mar-2020 00:19:21         at org.apache.maven.surefire.booter.ForkedBooter.main(ForkedBooter.java:103)
15-Mar-2020 00:19:21
15-Mar-2020 00:19:21 2020-03-15 00:19:21.698  INFO 3955 --- [           main] junit.logTestName                        : Finished Test ctrLaunch(org.springframework.cloud.dataflow.acceptance.test.ComposedTaskTests)
15-Mar-2020 00:19:21 Tests run: 3, Failures: 3, Errors: 0, Skipped: 0, Time elapsed: 541.685 sec <<< FAILURE! - in org.springframework.cloud.dataflow.acceptance.test.ComposedTaskTests
15-Mar-2020 00:19:21 ctrMultipleLaunchWithArguments(org.springframework.cloud.dataflow.acceptance.test.ComposedTaskTests)  Time elapsed: 180.498 sec  <<< FAILURE!
15-Mar-2020 00:19:21 java.lang.AssertionError: null
15-Mar-2020 00:19:21         at org.junit.Assert.fail(Assert.java:86)
15-Mar-2020 00:19:21         at org.junit.Assert.assertTrue(Assert.java:41)
15-Mar-2020 00:19:21         at org.junit.Assert.assertTrue(Assert.java:52)
15-Mar-2020 00:19:21         at org.springframework.cloud.dataflow.acceptance.test.ComposedTaskTests.assertTaskExecutions(ComposedTaskTests.java:65)
15-Mar-2020 00:19:21         at org.springframework.cloud.dataflow.acceptance.test.ComposedTaskTests.ctrMultipleLaunchWithArguments(ComposedTaskTests.java:57)
15-Mar-2020 00:19:21
15-Mar-2020 00:19:21 ctrMultipleLaunch(org.springframework.cloud.dataflow.acceptance.test.ComposedTaskTests)  Time elapsed: 180.477 sec  <<< FAILURE!
15-Mar-2020 00:19:21 java.lang.AssertionError: null
15-Mar-2020 00:19:21         at org.junit.Assert.fail(Assert.java:86)
15-Mar-2020 00:19:21         at org.junit.Assert.assertTrue(Assert.java:41)
15-Mar-2020 00:19:21         at org.junit.Assert.assertTrue(Assert.java:52)
15-Mar-2020 00:19:21         at org.springframework.cloud.dataflow.acceptance.test.ComposedTaskTests.assertTaskExecutions(ComposedTaskTests.java:65)
15-Mar-2020 00:19:21         at org.springframework.cloud.dataflow.acceptance.test.ComposedTaskTests.ctrMultipleLaunch(ComposedTaskTests.java:47)
15-Mar-2020 00:19:21
15-Mar-2020 00:19:21 ctrLaunch(org.springframework.cloud.dataflow.acceptance.test.ComposedTaskTests)  Time elapsed: 180.513 sec  <<< FAILURE!
15-Mar-2020 00:19:21 java.lang.AssertionError: null
15-Mar-2020 00:19:21         at org.junit.Assert.fail(Assert.java:86)
15-Mar-2020 00:19:21         at org.junit.Assert.assertTrue(Assert.java:41)
15-Mar-2020 00:19:21         at org.junit.Assert.assertTrue(Assert.java:52)
15-Mar-2020 00:19:21         at org.springframework.cloud.dataflow.acceptance.test.ComposedTaskTests.assertTaskExecutions(ComposedTaskTests.java:65)
15-Mar-2020 00:19:21         at org.springframework.cloud.dataflow.acceptance.test.ComposedTaskTests.ctrLaunch(ComposedTaskTests.java:41)
15-Mar-2020 00:19:21
15-Mar-2020 00:19:21 Running org.springframework.cloud.dataflow.acceptance.test.TransformTests
15-Mar-2020 00:19:21 2020-03-15 00:19:21.706  INFO 3955 --- [           main] .b.t.c.SpringBootTestContextBootstrapper : Neither @ContextConfiguration nor @ContextHierarchy found for test class [org.springframework.cloud.dataflow.acceptance.test.TransformTests], using SpringBootContextLoader
15-Mar-2020 00:19:21 2020-03-15 00:19:21.716  INFO 3955 --- [           main] .b.t.c.SpringBootTestContextBootstrapper : Loaded default TestExecutionListener class names from location [META-INF/spring.factories]: [org.springframework.boot.test.mock.mockito.MockitoTestExecutionListener, org.springframework.boot.test.mock.mockito.ResetMocksTestExecutionListener, org.springframework.boot.test.autoconfigure.restdocs.RestDocsTestExecutionListener, org.springframework.boot.test.autoconfigure.web.client.MockRestServiceServerResetTestExecutionListener, org.springframework.boot.test.autoconfigure.web.servlet.MockMvcPrintOnlyOnFailureTestExecutionListener, org.springframework.boot.test.autoconfigure.web.servlet.WebDriverTestExecutionListener, org.springframework.test.context.web.ServletTestExecutionListener, org.springframework.test.context.support.DirtiesContextBeforeModesTestExecutionListener, org.springframework.test.context.support.DependencyInjectionTestExecutionListener, org.springframework.test.context.support.DirtiesContextTestExecutionListener, org.springframework.test.context.transaction.TransactionalTestExecutionListener, org.springframework.test.context.jdbc.SqlScriptsTestExecutionListener]
15-Mar-2020 00:19:21 2020-03-15 00:19:21.720  INFO 3955 --- [           main] .b.t.c.SpringBootTestContextBootstrapper : Using TestExecutionListeners: [org.springframework.test.context.web.ServletTestExecutionListener@52d6d273, org.springframework.test.context.support.DirtiesContextBeforeModesTestExecutionListener@4667c4c1, org.springframework.boot.test.autoconfigure.SpringBootDependencyInjectionTestExecutionListener@2f9a4401, org.springframework.test.context.support.DirtiesContextTestExecutionListener@22c75c01, org.springframework.test.context.transaction.TransactionalTestExecutionListener@46e64760, org.springframework.test.context.jdbc.SqlScriptsTestExecutionListener@3e5fd2b1, org.springframework.boot.test.mock.mockito.MockitoTestExecutionListener@43982337, org.springframework.boot.test.autoconfigure.web.servlet.MockMvcPrintOnlyOnFailureTestExecutionListener@5b275811, org.springframework.boot.test.autoconfigure.web.client.MockRestServiceServerResetTestExecutionListener@2f0ed952, org.springframework.boot.test.mock.mockito.ResetMocksTestExecutionListener@6f044c58, org.springframework.boot.test.autoconfigure.web.servlet.WebDriverTestExecutionListener@6d074b14, org.springframework.boot.test.autoconfigure.restdocs.RestDocsTestExecutionListener@c017175]
15-Mar-2020 00:19:21 2020-03-15 00:19:21.790  INFO 3955 --- [           main] junit.logTestName                        : Starting Test transformTests(org.springframework.cloud.dataflow.acceptance.test.TransformTests)
15-Mar-2020 00:19:21 2020-03-15 00:19:21.793  INFO 3955 --- [           main] o.s.c.d.acceptance.test.TransformTests   : Creating stream 'TRANSFORM-TEST'
15-Mar-2020 00:19:21 2020-03-15 00:19:21.824  INFO 3955 --- [           main] o.s.c.d.acceptance.test.TransformTests   : Deploying stream 'TRANSFORM-TEST' with properties: {app.*.spring.cloud.streamapp.security.enabled=false, app.*.logging.file=${PID}-test.log, app.*.endpoints.logfile.sensitive=false, app.*.management.endpoints.web.exposure.include=*}
15-Mar-2020 00:19:22 2020-03-15 00:19:22.653  INFO 3955 --- [           main] o.s.c.d.acceptance.test.TransformTests   : Checking: Stream=TRANSFORM-TEST, status = deploying, status description = The stream is being deployed.
15-Mar-2020 00:19:22 2020-03-15 00:19:22.653  INFO 3955 --- [           main] o.s.c.d.acceptance.test.TransformTests   : Sleeping to check status of Stream=TRANSFORM-TEST
15-Mar-2020 00:19:32 2020-03-15 00:19:32.682  INFO 3955 --- [           main] o.s.c.d.acceptance.test.TransformTests   : Checking: Stream=TRANSFORM-TEST, status = deploying, status description = The stream is being deployed.
15-Mar-2020 00:19:32 2020-03-15 00:19:32.682  INFO 3955 --- [           main] o.s.c.d.acceptance.test.TransformTests   : Sleeping to check status of Stream=TRANSFORM-TEST
15-Mar-2020 00:19:42 2020-03-15 00:19:42.724  INFO 3955 --- [           main] o.s.c.d.acceptance.test.TransformTests   : Checking: Stream=TRANSFORM-TEST, status = deployed, status description = The stream has been successfully deployed
15-Mar-2020 00:19:42 2020-03-15 00:19:42.787  INFO 3955 --- [           main] o.s.c.d.acceptance.test.TransformTests   : Sleeping to check status of Stream=TRANSFORM-TEST
15-Mar-2020 00:19:52 2020-03-15 00:19:52.787  INFO 3955 --- [           main] o.s.c.d.acceptance.test.TransformTests   : Stream 'TRANSFORM-TEST' started with status: deployed
15-Mar-2020 00:19:52 2020-03-15 00:19:52.787  INFO 3955 --- [           main] o.s.c.d.acceptance.test.TransformTests   : App 'transform' has instances: {TRANSFORM-TEST.transform-v1-0=http://10.194.6.131:58127}
15-Mar-2020 00:19:52 2020-03-15 00:19:52.787  INFO 3955 --- [           main] o.s.c.d.acceptance.test.TransformTests   : App 'log' has instances: {TRANSFORM-TEST.log-v1-0=http://10.194.6.131:52718}
15-Mar-2020 00:19:52 2020-03-15 00:19:52.787  INFO 3955 --- [           main] o.s.c.d.acceptance.test.TransformTests   : App 'http' has instances: {TRANSFORM-TEST.http-v1-0=http://10.194.6.131:46190}
15-Mar-2020 00:19:52 2020-03-15 00:19:52.787  INFO 3955 --- [           main] o.s.c.d.acceptance.test.TransformTests   : Looking for 'Started HttpSource' in logfile for http
15-Mar-2020 00:20:02 2020-03-15 00:20:02.787  INFO 3955 --- [           main] o.s.c.d.acceptance.test.TransformTests   : Requesting log for app TRANSFORM-TEST.http-v1-0
15-Mar-2020 00:20:03 2020-03-15 00:20:03.081  INFO 3955 --- [           main] o.s.c.d.acceptance.test.TransformTests   : Retrieved logfile from 'http://10.194.6.131:46190/actuator/logfile
15-Mar-2020 00:20:03 2020-03-15 00:20:03.081  INFO 3955 --- [           main] o.s.c.d.acceptance.test.TransformTests   : Matched all 'Started HttpSource' in logfile for app http (source TRANSFORM-TEST.http-v1-0)
15-Mar-2020 00:20:03 2020-03-15 00:20:03.224  INFO 3955 --- [           main] o.s.c.d.acceptance.test.TransformTests   : Looking for 'Started LogSink' in logfile for log
15-Mar-2020 00:20:13 2020-03-15 00:20:13.225  INFO 3955 --- [           main] o.s.c.d.acceptance.test.TransformTests   : Requesting log for app TRANSFORM-TEST.log-v1-0
15-Mar-2020 00:20:13 2020-03-15 00:20:13.356  INFO 3955 --- [           main] o.s.c.d.acceptance.test.TransformTests   : Retrieved logfile from 'http://10.194.6.131:52718/actuator/logfile
15-Mar-2020 00:20:13 2020-03-15 00:20:13.356  INFO 3955 --- [           main] o.s.c.d.acceptance.test.TransformTests   : Matched all 'Started LogSink' in logfile for app log (source TRANSFORM-TEST.log-v1-0)
15-Mar-2020 00:20:13 2020-03-15 00:20:13.356  INFO 3955 --- [           main] o.s.c.d.acceptance.test.TransformTests   : Looking for 'ABCDEFG' in logfile for log
15-Mar-2020 00:20:23 2020-03-15 00:20:23.356  INFO 3955 --- [           main] o.s.c.d.acceptance.test.TransformTests   : Requesting log for app TRANSFORM-TEST.log-v1-0
15-Mar-2020 00:20:23 2020-03-15 00:20:23.364  INFO 3955 --- [           main] o.s.c.d.acceptance.test.TransformTests   : Retrieved logfile from 'http://10.194.6.131:52718/actuator/logfile
15-Mar-2020 00:20:23 2020-03-15 00:20:23.364  INFO 3955 --- [           main] o.s.c.d.acceptance.test.TransformTests   : Matched all 'ABCDEFG' in logfile for app log (source TRANSFORM-TEST.log-v1-0)
15-Mar-2020 00:20:23 2020-03-15 00:20:23.366  INFO 3955 --- [           main] junit.logTestName                        : Test transformTests(org.springframework.cloud.dataflow.acceptance.test.TransformTests) Succeeded
15-Mar-2020 00:20:23 2020-03-15 00:20:23.366  INFO 3955 --- [           main] junit.logTestName                        : Finished Test transformTests(org.springframework.cloud.dataflow.acceptance.test.TransformTests)
15-Mar-2020 00:20:23 2020-03-15 00:20:23.366  INFO 3955 --- [           main] o.s.c.d.acceptance.test.TransformTests   : Destroy all streams
15-Mar-2020 00:20:23 Tests run: 1, Failures: 0, Errors: 0, Skipped: 0, Time elapsed: 61.937 sec - in org.springframework.cloud.dataflow.acceptance.test.TransformTests
15-Mar-2020 00:20:23 Running org.springframework.cloud.dataflow.acceptance.test.SchedulerTests
15-Mar-2020 00:20:23 2020-03-15 00:20:23.791  INFO 3955 --- [           main] s.c.a.AnnotationConfigApplicationContext : Refreshing org.springframework.context.annotation.AnnotationConfigApplicationContext@33379242: startup date [Sun Mar 15 00:20:23 UTC 2020]; root of context hierarchy
15-Mar-2020 00:20:23 2020-03-15 00:20:23.819  INFO 3955 --- [           main] trationDelegate$BeanPostProcessorChecker : Bean 'configurationPropertiesRebinderAutoConfiguration' of type [class org.springframework.cloud.autoconfigure.ConfigurationPropertiesRebinderAutoConfiguration$$EnhancerBySpringCGLIB$$ed959188] is not eligible for getting processed by all BeanPostProcessors (for example: not eligible for auto-proxying)
15-Mar-2020 00:20:23
15-Mar-2020 00:20:23   .   ____          _            __ _ _
15-Mar-2020 00:20:23 /\\ / ___'_ __ _ _(_)_ __  __ _ \ \ \ \
15-Mar-2020 00:20:23 ( ( )\___ | '_ | '_| | '_ \/ _` | \ \ \ \
15-Mar-2020 00:20:23 \\/  ___)| |_)| | | | | || (_| |  ) ) ) )
15-Mar-2020 00:20:23   '  |____| .__|_| |_|_| |_\__, | / / / /
15-Mar-2020 00:20:23 =========|_|==============|___/=/_/_/_/
15-Mar-2020 00:20:23 :: Spring Boot ::        (v1.4.1.RELEASE)
15-Mar-2020 00:20:23
15-Mar-2020 00:20:23 2020-03-15 00:20:23.921  INFO 3955 --- [           main] c.c.c.ConfigServicePropertySourceLocator : Fetching config from server at: http://localhost:8888
15-Mar-2020 00:20:23 2020-03-15 00:20:23.924  WARN 3955 --- [           main] c.c.c.ConfigServicePropertySourceLocator : Could not locate PropertySource: I/O error on GET request for "http://localhost:8888//blah": Connection refused (Connection refused); nested exception is java.net.ConnectException: Connection refused (Connection refused)
15-Mar-2020 00:20:23 2020-03-15 00:20:23.925  INFO 3955 --- [           main] o.a.maven.surefire.booter.ForkedBooter   : The following profiles are active: blah
15-Mar-2020 00:20:23 2020-03-15 00:20:23.927  INFO 3955 --- [           main] s.c.a.AnnotationConfigApplicationContext : Refreshing org.springframework.context.annotation.AnnotationConfigApplicationContext@70721c12: startup date [Sun Mar 15 00:20:23 UTC 2020]; parent: org.springframework.context.annotation.AnnotationConfigApplicationContext@33379242
15-Mar-2020 00:20:24 2020-03-15 00:20:24.015  INFO 3955 --- [           main] o.a.maven.surefire.booter.ForkedBooter   : Started ForkedBooter in 0.335 seconds (JVM running for 992.485)
15-Mar-2020 00:20:24 2020-03-15 00:20:24.016  INFO 3955 --- [           main] s.c.a.AnnotationConfigApplicationContext : Closing org.springframework.context.annotation.AnnotationConfigApplicationContext@70721c12: startup date [Sun Mar 15 00:20:23 UTC 2020]; parent: org.springframework.context.annotation.AnnotationConfigApplicationContext@33379242
15-Mar-2020 00:20:24 2020-03-15 00:20:24.017 ERROR 3955 --- [           main] o.s.c.d.a.test.util.SchedulerRule        : SCHEDULER IS NOT AVAILABLE, SKIPPING TESTS
15-Mar-2020 00:20:24
15-Mar-2020 00:20:24 java.lang.IllegalArgumentException: no SchedulerOperations bean is available.  Skipping test.
15-Mar-2020 00:20:24         at org.springframework.util.Assert.notNull(Assert.java:115)
15-Mar-2020 00:20:24         at org.springframework.cloud.dataflow.acceptance.test.util.SchedulerRule.obtainResource(SchedulerRule.java:57)
15-Mar-2020 00:20:24         at org.springframework.cloud.scheduler.spi.junit.AbstractExternalResourceTestSupport.apply(AbstractExternalResourceTestSupport.java:58)
15-Mar-2020 00:20:24         at org.junit.rules.RunRules.applyAll(RunRules.java:26)
15-Mar-2020 00:20:24         at org.junit.rules.RunRules.<init>(RunRules.java:15)
15-Mar-2020 00:20:24         at org.junit.runners.ParentRunner.withClassRules(ParentRunner.java:245)
15-Mar-2020 00:20:24         at org.junit.runners.ParentRunner.classBlock(ParentRunner.java:194)
15-Mar-2020 00:20:24         at org.junit.runners.ParentRunner.run(ParentRunner.java:362)
15-Mar-2020 00:20:24         at org.springframework.test.context.junit4.SpringJUnit4ClassRunner.run(SpringJUnit4ClassRunner.java:191)
15-Mar-2020 00:20:24         at org.apache.maven.surefire.junit4.JUnit4Provider.execute(JUnit4Provider.java:283)
15-Mar-2020 00:20:24         at org.apache.maven.surefire.junit4.JUnit4Provider.executeWithRerun(JUnit4Provider.java:173)
15-Mar-2020 00:20:24         at org.apache.maven.surefire.junit4.JUnit4Provider.executeTestSet(JUnit4Provider.java:153)
15-Mar-2020 00:20:24         at org.apache.maven.surefire.junit4.JUnit4Provider.invoke(JUnit4Provider.java:128)
15-Mar-2020 00:20:24         at org.apache.maven.surefire.booter.ForkedBooter.invokeProviderInSameClassLoader(ForkedBooter.java:203)
15-Mar-2020 00:20:24         at org.apache.maven.surefire.booter.ForkedBooter.runSuitesInProcess(ForkedBooter.java:155)
15-Mar-2020 00:20:24         at org.apache.maven.surefire.booter.ForkedBooter.main(ForkedBooter.java:103)
15-Mar-2020 00:20:24
15-Mar-2020 00:20:24 Tests run: 1, Failures: 0, Errors: 0, Skipped: 1, Time elapsed: 0.349 sec - in org.springframework.cloud.dataflow.acceptance.test.SchedulerTests
15-Mar-2020 00:20:24 Running org.springframework.cloud.dataflow.acceptance.test.NamedChannelTests
15-Mar-2020 00:20:24 2020-03-15 00:20:24.017  INFO 3955 --- [           main] .b.t.c.SpringBootTestContextBootstrapper : Neither @ContextConfiguration nor @ContextHierarchy found for test class [org.springframework.cloud.dataflow.acceptance.test.NamedChannelTests], using SpringBootContextLoader
15-Mar-2020 00:20:24 2020-03-15 00:20:24.022  INFO 3955 --- [           main] .b.t.c.SpringBootTestContextBootstrapper : Loaded default TestExecutionListener class names from location [META-INF/spring.factories]: [org.springframework.boot.test.mock.mockito.MockitoTestExecutionListener, org.springframework.boot.test.mock.mockito.ResetMocksTestExecutionListener, org.springframework.boot.test.autoconfigure.restdocs.RestDocsTestExecutionListener, org.springframework.boot.test.autoconfigure.web.client.MockRestServiceServerResetTestExecutionListener, org.springframework.boot.test.autoconfigure.web.servlet.MockMvcPrintOnlyOnFailureTestExecutionListener, org.springframework.boot.test.autoconfigure.web.servlet.WebDriverTestExecutionListener, org.springframework.test.context.web.ServletTestExecutionListener, org.springframework.test.context.support.DirtiesContextBeforeModesTestExecutionListener, org.springframework.test.context.support.DependencyInjectionTestExecutionListener, org.springframework.test.context.support.DirtiesContextTestExecutionListener, org.springframework.test.context.transaction.TransactionalTestExecutionListener, org.springframework.test.context.jdbc.SqlScriptsTestExecutionListener]
15-Mar-2020 00:20:24 2020-03-15 00:20:24.023  INFO 3955 --- [           main] .b.t.c.SpringBootTestContextBootstrapper : Using TestExecutionListeners: [org.springframework.test.context.web.ServletTestExecutionListener@56cc9f29, org.springframework.test.context.support.DirtiesContextBeforeModesTestExecutionListener@535b1ae6, org.springframework.boot.test.autoconfigure.SpringBootDependencyInjectionTestExecutionListener@626c19cf, org.springframework.test.context.support.DirtiesContextTestExecutionListener@54a2d96e, org.springframework.test.context.transaction.TransactionalTestExecutionListener@66a53104, org.springframework.test.context.jdbc.SqlScriptsTestExecutionListener@6d229b1c, org.springframework.boot.test.mock.mockito.MockitoTestExecutionListener@6f825516, org.springframework.boot.test.autoconfigure.web.servlet.MockMvcPrintOnlyOnFailureTestExecutionListener@2da99821, org.springframework.boot.test.autoconfigure.web.client.MockRestServiceServerResetTestExecutionListener@62cba181, org.springframework.boot.test.mock.mockito.ResetMocksTestExecutionListener@1b482cbf, org.springframework.boot.test.autoconfigure.web.servlet.WebDriverTestExecutionListener@661fe025, org.springframework.boot.test.autoconfigure.restdocs.RestDocsTestExecutionListener@7161457]
15-Mar-2020 00:20:24 2020-03-15 00:20:24.074  INFO 3955 --- [           main] junit.logTestName                        : Starting Test testDestination(org.springframework.cloud.dataflow.acceptance.test.NamedChannelTests)
15-Mar-2020 00:20:24 2020-03-15 00:20:24.076  INFO 3955 --- [           main] o.s.c.d.a.test.NamedChannelTests         : Creating stream 'LOG-DESTINATION-SINK'
15-Mar-2020 00:20:24 2020-03-15 00:20:24.109  INFO 3955 --- [           main] o.s.c.d.a.test.NamedChannelTests         : Deploying stream 'LOG-DESTINATION-SINK' with properties: {app.*.spring.cloud.streamapp.security.enabled=false, app.*.logging.file=${PID}-test.log, app.*.endpoints.logfile.sensitive=false, app.*.management.endpoints.web.exposure.include=*}
15-Mar-2020 00:20:24 2020-03-15 00:20:24.527  INFO 3955 --- [           main] o.s.c.d.a.test.NamedChannelTests         : Checking: Stream=LOG-DESTINATION-SINK, status = deploying, status description = The stream is being deployed.
15-Mar-2020 00:20:24 2020-03-15 00:20:24.527  INFO 3955 --- [           main] o.s.c.d.a.test.NamedChannelTests         : Sleeping to check status of Stream=LOG-DESTINATION-SINK
15-Mar-2020 00:20:34 2020-03-15 00:20:34.552  INFO 3955 --- [           main] o.s.c.d.a.test.NamedChannelTests         : Checking: Stream=LOG-DESTINATION-SINK, status = deployed, status description = The stream has been successfully deployed
15-Mar-2020 00:20:34 2020-03-15 00:20:34.575  INFO 3955 --- [           main] o.s.c.d.a.test.NamedChannelTests         : Sleeping to check status of Stream=LOG-DESTINATION-SINK
15-Mar-2020 00:20:44 2020-03-15 00:20:44.575  INFO 3955 --- [           main] o.s.c.d.a.test.NamedChannelTests         : Stream 'LOG-DESTINATION-SINK' started with status: deployed
15-Mar-2020 00:20:44 2020-03-15 00:20:44.576  INFO 3955 --- [           main] o.s.c.d.a.test.NamedChannelTests         : App 'log' has instances: {LOG-DESTINATION-SINK.log-v1-0=http://10.194.6.131:57579}
15-Mar-2020 00:20:44 2020-03-15 00:20:44.576  INFO 3955 --- [           main] o.s.c.d.a.test.NamedChannelTests         : Looking for 'Started LogSink' in logfile for log
15-Mar-2020 00:20:54 2020-03-15 00:20:54.576  INFO 3955 --- [           main] o.s.c.d.a.test.NamedChannelTests         : Requesting log for app LOG-DESTINATION-SINK.log-v1-0
15-Mar-2020 00:20:54 2020-03-15 00:20:54.892  INFO 3955 --- [           main] o.s.c.d.a.test.NamedChannelTests         : Retrieved logfile from 'http://10.194.6.131:57579/actuator/logfile
15-Mar-2020 00:20:54 2020-03-15 00:20:54.892  INFO 3955 --- [           main] o.s.c.d.a.test.NamedChannelTests         : Matched all 'Started LogSink' in logfile for app log (source LOG-DESTINATION-SINK.log-v1-0)
15-Mar-2020 00:20:54 2020-03-15 00:20:54.893  INFO 3955 --- [           main] o.s.c.d.a.test.NamedChannelTests         : Creating stream 'HTTP-DESTINATION-SOURCE'
15-Mar-2020 00:20:54 2020-03-15 00:20:54.919  INFO 3955 --- [           main] o.s.c.d.a.test.NamedChannelTests         : Deploying stream 'HTTP-DESTINATION-SOURCE' with properties: {app.*.spring.cloud.streamapp.security.enabled=false, app.*.logging.file=${PID}-test.log, app.*.endpoints.logfile.sensitive=false, app.*.management.endpoints.web.exposure.include=*}
15-Mar-2020 00:20:55 2020-03-15 00:20:55.371  INFO 3955 --- [           main] o.s.c.d.a.test.NamedChannelTests         : Checking: Stream=HTTP-DESTINATION-SOURCE, status = deploying, status description = The stream is being deployed.
15-Mar-2020 00:20:55 2020-03-15 00:20:55.371  INFO 3955 --- [           main] o.s.c.d.a.test.NamedChannelTests         : Sleeping to check status of Stream=HTTP-DESTINATION-SOURCE
15-Mar-2020 00:21:05 2020-03-15 00:21:05.407  INFO 3955 --- [           main] o.s.c.d.a.test.NamedChannelTests         : Checking: Stream=HTTP-DESTINATION-SOURCE, status = deployed, status description = The stream has been successfully deployed
15-Mar-2020 00:21:05 2020-03-15 00:21:05.429  INFO 3955 --- [           main] o.s.c.d.a.test.NamedChannelTests         : Sleeping to check status of Stream=HTTP-DESTINATION-SOURCE
15-Mar-2020 00:21:15 2020-03-15 00:21:15.430  INFO 3955 --- [           main] o.s.c.d.a.test.NamedChannelTests         : Stream 'HTTP-DESTINATION-SOURCE' started with status: deployed
15-Mar-2020 00:21:15 2020-03-15 00:21:15.430  INFO 3955 --- [           main] o.s.c.d.a.test.NamedChannelTests         : App 'http' has instances: {HTTP-DESTINATION-SOURCE.http-v1-0=http://10.194.6.131:20024}
15-Mar-2020 00:21:15 2020-03-15 00:21:15.430  INFO 3955 --- [           main] o.s.c.d.a.test.NamedChannelTests         : Looking for 'Started HttpSource' in logfile for http
15-Mar-2020 00:21:25 2020-03-15 00:21:25.431  INFO 3955 --- [           main] o.s.c.d.a.test.NamedChannelTests         : Requesting log for app HTTP-DESTINATION-SOURCE.http-v1-0
15-Mar-2020 00:21:25 2020-03-15 00:21:25.728  INFO 3955 --- [           main] o.s.c.d.a.test.NamedChannelTests         : Retrieved logfile from 'http://10.194.6.131:20024/actuator/logfile
15-Mar-2020 00:21:25 2020-03-15 00:21:25.728  INFO 3955 --- [           main] o.s.c.d.a.test.NamedChannelTests         : Matched all 'Started HttpSource' in logfile for app http (source HTTP-DESTINATION-SOURCE.http-v1-0)
15-Mar-2020 00:21:25 2020-03-15 00:21:25.886  INFO 3955 --- [           main] o.s.c.d.a.test.NamedChannelTests         : Looking for 'abcdefg' in logfile for log
15-Mar-2020 00:21:35 2020-03-15 00:21:35.886  INFO 3955 --- [           main] o.s.c.d.a.test.NamedChannelTests         : Requesting log for app LOG-DESTINATION-SINK.log-v1-0
15-Mar-2020 00:21:35 2020-03-15 00:21:35.894  INFO 3955 --- [           main] o.s.c.d.a.test.NamedChannelTests         : Retrieved logfile from 'http://10.194.6.131:57579/actuator/logfile
15-Mar-2020 00:21:35 2020-03-15 00:21:35.894  INFO 3955 --- [           main] o.s.c.d.a.test.NamedChannelTests         : Matched all 'abcdefg' in logfile for app log (source LOG-DESTINATION-SINK.log-v1-0)
15-Mar-2020 00:21:35 2020-03-15 00:21:35.896  INFO 3955 --- [           main] junit.logTestName                        : Test testDestination(org.springframework.cloud.dataflow.acceptance.test.NamedChannelTests) Succeeded
15-Mar-2020 00:21:35 2020-03-15 00:21:35.896  INFO 3955 --- [           main] junit.logTestName                        : Finished Test testDestination(org.springframework.cloud.dataflow.acceptance.test.NamedChannelTests)
15-Mar-2020 00:21:35 2020-03-15 00:21:35.896  INFO 3955 --- [           main] o.s.c.d.a.test.NamedChannelTests         : Destroy all streams
15-Mar-2020 00:21:36 2020-03-15 00:21:36.243  INFO 3955 --- [           main] junit.logTestName                        : Starting Test testTap(org.springframework.cloud.dataflow.acceptance.test.NamedChannelTests)
15-Mar-2020 00:21:36 2020-03-15 00:21:36.245  INFO 3955 --- [           main] o.s.c.d.a.test.NamedChannelTests         : Creating stream 'TAPHTTP'
15-Mar-2020 00:21:36 2020-03-15 00:21:36.271  INFO 3955 --- [           main] o.s.c.d.a.test.NamedChannelTests         : Deploying stream 'TAPHTTP' with properties: {app.*.spring.cloud.streamapp.security.enabled=false, app.*.logging.file=${PID}-test.log, app.*.endpoints.logfile.sensitive=false, app.*.management.endpoints.web.exposure.include=*}
15-Mar-2020 00:21:36 2020-03-15 00:21:36.792  INFO 3955 --- [           main] o.s.c.d.a.test.NamedChannelTests         : Checking: Stream=TAPHTTP, status = deploying, status description = The stream is being deployed.
15-Mar-2020 00:21:36 2020-03-15 00:21:36.792  INFO 3955 --- [           main] o.s.c.d.a.test.NamedChannelTests         : Sleeping to check status of Stream=TAPHTTP
15-Mar-2020 00:21:46 2020-03-15 00:21:46.827  INFO 3955 --- [           main] o.s.c.d.a.test.NamedChannelTests         : Checking: Stream=TAPHTTP, status = deploying, status description = The stream is being deployed.
15-Mar-2020 00:21:46 2020-03-15 00:21:46.827  INFO 3955 --- [           main] o.s.c.d.a.test.NamedChannelTests         : Sleeping to check status of Stream=TAPHTTP
15-Mar-2020 00:21:56 2020-03-15 00:21:56.852  INFO 3955 --- [           main] o.s.c.d.a.test.NamedChannelTests         : Checking: Stream=TAPHTTP, status = deployed, status description = The stream has been successfully deployed
15-Mar-2020 00:21:56 2020-03-15 00:21:56.875  INFO 3955 --- [           main] o.s.c.d.a.test.NamedChannelTests         : Sleeping to check status of Stream=TAPHTTP
15-Mar-2020 00:22:06 2020-03-15 00:22:06.876  INFO 3955 --- [           main] o.s.c.d.a.test.NamedChannelTests         : Stream 'TAPHTTP' started with status: deployed
15-Mar-2020 00:22:06 2020-03-15 00:22:06.876  INFO 3955 --- [           main] o.s.c.d.a.test.NamedChannelTests         : App 'log' has instances: {TAPHTTP.log-v1-0=http://10.194.6.131:50989}
15-Mar-2020 00:22:06 2020-03-15 00:22:06.876  INFO 3955 --- [           main] o.s.c.d.a.test.NamedChannelTests         : App 'http' has instances: {TAPHTTP.http-v1-0=http://10.194.6.131:34924}
15-Mar-2020 00:22:06 2020-03-15 00:22:06.876  INFO 3955 --- [           main] o.s.c.d.a.test.NamedChannelTests         : Looking for 'Started HttpSource' in logfile for http
15-Mar-2020 00:22:16 2020-03-15 00:22:16.876  INFO 3955 --- [           main] o.s.c.d.a.test.NamedChannelTests         : Requesting log for app TAPHTTP.http-v1-0
15-Mar-2020 00:22:17 2020-03-15 00:22:17.181  INFO 3955 --- [           main] o.s.c.d.a.test.NamedChannelTests         : Retrieved logfile from 'http://10.194.6.131:34924/actuator/logfile
15-Mar-2020 00:22:17 2020-03-15 00:22:17.181  INFO 3955 --- [           main] o.s.c.d.a.test.NamedChannelTests         : Matched all 'Started HttpSource' in logfile for app http (source TAPHTTP.http-v1-0)
15-Mar-2020 00:22:17 2020-03-15 00:22:17.181  INFO 3955 --- [           main] o.s.c.d.a.test.NamedChannelTests         : Looking for 'Started LogSink' in logfile for log
15-Mar-2020 00:22:27 2020-03-15 00:22:27.184  INFO 3955 --- [           main] o.s.c.d.a.test.NamedChannelTests         : Requesting log for app TAPHTTP.log-v1-0
15-Mar-2020 00:22:27 2020-03-15 00:22:27.309  INFO 3955 --- [           main] o.s.c.d.a.test.NamedChannelTests         : Retrieved logfile from 'http://10.194.6.131:50989/actuator/logfile
15-Mar-2020 00:22:27 2020-03-15 00:22:27.309  INFO 3955 --- [           main] o.s.c.d.a.test.NamedChannelTests         : Matched all 'Started LogSink' in logfile for app log (source TAPHTTP.log-v1-0)
15-Mar-2020 00:22:27 2020-03-15 00:22:27.309  INFO 3955 --- [           main] o.s.c.d.a.test.NamedChannelTests         : Creating stream 'TAPSTREAM'
15-Mar-2020 00:22:27 2020-03-15 00:22:27.335  INFO 3955 --- [           main] o.s.c.d.a.test.NamedChannelTests         : Deploying stream 'TAPSTREAM' with properties: {app.*.spring.cloud.streamapp.security.enabled=false, app.*.logging.file=${PID}-test.log, app.*.endpoints.logfile.sensitive=false, app.*.management.endpoints.web.exposure.include=*}
15-Mar-2020 00:22:27 2020-03-15 00:22:27.800  INFO 3955 --- [           main] o.s.c.d.a.test.NamedChannelTests         : Checking: Stream=TAPSTREAM, status = deploying, status description = The stream is being deployed.
15-Mar-2020 00:22:27 2020-03-15 00:22:27.800  INFO 3955 --- [           main] o.s.c.d.a.test.NamedChannelTests         : Sleeping to check status of Stream=TAPSTREAM
15-Mar-2020 00:22:37 2020-03-15 00:22:37.845  INFO 3955 --- [           main] o.s.c.d.a.test.NamedChannelTests         : Checking: Stream=TAPSTREAM, status = deployed, status description = The stream has been successfully deployed
15-Mar-2020 00:22:37 2020-03-15 00:22:37.888  INFO 3955 --- [           main] o.s.c.d.a.test.NamedChannelTests         : Sleeping to check status of Stream=TAPSTREAM
15-Mar-2020 00:22:47 2020-03-15 00:22:47.888  INFO 3955 --- [           main] o.s.c.d.a.test.NamedChannelTests         : Stream 'TAPSTREAM' started with status: deployed
15-Mar-2020 00:22:47 2020-03-15 00:22:47.888  INFO 3955 --- [           main] o.s.c.d.a.test.NamedChannelTests         : App 'log' has instances: {TAPSTREAM.log-v1-0=http://10.194.6.131:58165}
15-Mar-2020 00:22:47 2020-03-15 00:22:47.889  INFO 3955 --- [           main] o.s.c.d.a.test.NamedChannelTests         : Looking for 'Started LogSink' in logfile for log
15-Mar-2020 00:22:57 2020-03-15 00:22:57.889  INFO 3955 --- [           main] o.s.c.d.a.test.NamedChannelTests         : Requesting log for app TAPSTREAM.log-v1-0
15-Mar-2020 00:22:58 2020-03-15 00:22:58.203  INFO 3955 --- [           main] o.s.c.d.a.test.NamedChannelTests         : Retrieved logfile from 'http://10.194.6.131:58165/actuator/logfile
15-Mar-2020 00:22:58 2020-03-15 00:22:58.204  INFO 3955 --- [           main] o.s.c.d.a.test.NamedChannelTests         : Matched all 'Started LogSink' in logfile for app log (source TAPSTREAM.log-v1-0)
15-Mar-2020 00:22:58 2020-03-15 00:22:58.347  INFO 3955 --- [           main] o.s.c.d.a.test.NamedChannelTests         : Looking for 'abcdefg' in logfile for log
15-Mar-2020 00:23:08 2020-03-15 00:23:08.348  INFO 3955 --- [           main] o.s.c.d.a.test.NamedChannelTests         : Requesting log for app TAPSTREAM.log-v1-0
15-Mar-2020 00:23:08 2020-03-15 00:23:08.355  INFO 3955 --- [           main] o.s.c.d.a.test.NamedChannelTests         : Retrieved logfile from 'http://10.194.6.131:58165/actuator/logfile
15-Mar-2020 00:23:08 2020-03-15 00:23:08.355  INFO 3955 --- [           main] o.s.c.d.a.test.NamedChannelTests         : Matched all 'abcdefg' in logfile for app log (source TAPSTREAM.log-v1-0)
15-Mar-2020 00:23:08 2020-03-15 00:23:08.356  INFO 3955 --- [           main] junit.logTestName                        : Test testTap(org.springframework.cloud.dataflow.acceptance.test.NamedChannelTests) Succeeded
15-Mar-2020 00:23:08 2020-03-15 00:23:08.356  INFO 3955 --- [           main] junit.logTestName                        : Finished Test testTap(org.springframework.cloud.dataflow.acceptance.test.NamedChannelTests)
15-Mar-2020 00:23:08 2020-03-15 00:23:08.356  INFO 3955 --- [           main] o.s.c.d.a.test.NamedChannelTests         : Destroy all streams
15-Mar-2020 00:23:08 2020-03-15 00:23:08.757  INFO 3955 --- [           main] junit.logTestName                        : Starting Test manyToOneTest(org.springframework.cloud.dataflow.acceptance.test.NamedChannelTests)
15-Mar-2020 00:23:08 2020-03-15 00:23:08.758  INFO 3955 --- [           main] o.s.c.d.a.test.NamedChannelTests         : Creating stream 'MANY-TO-ONE'
15-Mar-2020 00:23:08 2020-03-15 00:23:08.785  INFO 3955 --- [           main] o.s.c.d.a.test.NamedChannelTests         : Deploying stream 'MANY-TO-ONE' with properties: {app.*.spring.cloud.streamapp.security.enabled=false, app.*.logging.file=${PID}-test.log, app.*.endpoints.logfile.sensitive=false, app.*.management.endpoints.web.exposure.include=*}
15-Mar-2020 00:23:09 2020-03-15 00:23:09.171  INFO 3955 --- [           main] o.s.c.d.a.test.NamedChannelTests         : Checking: Stream=MANY-TO-ONE, status = deploying, status description = The stream is being deployed.
15-Mar-2020 00:23:09 2020-03-15 00:23:09.171  INFO 3955 --- [           main] o.s.c.d.a.test.NamedChannelTests         : Sleeping to check status of Stream=MANY-TO-ONE
15-Mar-2020 00:23:19 2020-03-15 00:23:19.198  INFO 3955 --- [           main] o.s.c.d.a.test.NamedChannelTests         : Checking: Stream=MANY-TO-ONE, status = deployed, status description = The stream has been successfully deployed
15-Mar-2020 00:23:19 2020-03-15 00:23:19.221  INFO 3955 --- [           main] o.s.c.d.a.test.NamedChannelTests         : Sleeping to check status of Stream=MANY-TO-ONE
15-Mar-2020 00:23:29 2020-03-15 00:23:29.222  INFO 3955 --- [           main] o.s.c.d.a.test.NamedChannelTests         : Stream 'MANY-TO-ONE' started with status: deployed
15-Mar-2020 00:23:29 2020-03-15 00:23:29.222  INFO 3955 --- [           main] o.s.c.d.a.test.NamedChannelTests         : App 'log' has instances: {MANY-TO-ONE.log-v1-0=http://10.194.6.131:55885}
15-Mar-2020 00:23:29 2020-03-15 00:23:29.222  INFO 3955 --- [           main] o.s.c.d.a.test.NamedChannelTests         : Looking for 'Started LogSink' in logfile for log
15-Mar-2020 00:23:39 2020-03-15 00:23:39.222  INFO 3955 --- [           main] o.s.c.d.a.test.NamedChannelTests         : Requesting log for app MANY-TO-ONE.log-v1-0
15-Mar-2020 00:23:39 2020-03-15 00:23:39.527  INFO 3955 --- [           main] o.s.c.d.a.test.NamedChannelTests         : Retrieved logfile from 'http://10.194.6.131:55885/actuator/logfile
15-Mar-2020 00:23:39 2020-03-15 00:23:39.527  INFO 3955 --- [           main] o.s.c.d.a.test.NamedChannelTests         : Matched all 'Started LogSink' in logfile for app log (source MANY-TO-ONE.log-v1-0)
15-Mar-2020 00:23:39 2020-03-15 00:23:39.527  INFO 3955 --- [           main] o.s.c.d.a.test.NamedChannelTests         : Creating stream 'HTTP-SOURCE-1'
15-Mar-2020 00:23:39 2020-03-15 00:23:39.552  INFO 3955 --- [           main] o.s.c.d.a.test.NamedChannelTests         : Deploying stream 'HTTP-SOURCE-1' with properties: {app.*.spring.cloud.streamapp.security.enabled=false, app.*.logging.file=${PID}-test.log, app.*.endpoints.logfile.sensitive=false, app.*.management.endpoints.web.exposure.include=*}
15-Mar-2020 00:23:39 2020-03-15 00:23:39.944  INFO 3955 --- [           main] o.s.c.d.a.test.NamedChannelTests         : Checking: Stream=HTTP-SOURCE-1, status = deploying, status description = The stream is being deployed.
15-Mar-2020 00:23:39 2020-03-15 00:23:39.944  INFO 3955 --- [           main] o.s.c.d.a.test.NamedChannelTests         : Sleeping to check status of Stream=HTTP-SOURCE-1
15-Mar-2020 00:23:49 2020-03-15 00:23:49.983  INFO 3955 --- [           main] o.s.c.d.a.test.NamedChannelTests         : Checking: Stream=HTTP-SOURCE-1, status = deployed, status description = The stream has been successfully deployed
15-Mar-2020 00:23:50 2020-03-15 00:23:50.008  INFO 3955 --- [           main] o.s.c.d.a.test.NamedChannelTests         : Sleeping to check status of Stream=HTTP-SOURCE-1
15-Mar-2020 00:24:00 2020-03-15 00:24:00.008  INFO 3955 --- [           main] o.s.c.d.a.test.NamedChannelTests         : Stream 'HTTP-SOURCE-1' started with status: deployed
15-Mar-2020 00:24:00 2020-03-15 00:24:00.008  INFO 3955 --- [           main] o.s.c.d.a.test.NamedChannelTests         : App 'http' has instances: {HTTP-SOURCE-1.http-v1-0=http://10.194.6.131:52035}
15-Mar-2020 00:24:00 2020-03-15 00:24:00.009  INFO 3955 --- [           main] o.s.c.d.a.test.NamedChannelTests         : Looking for 'Started HttpSource' in logfile for http
15-Mar-2020 00:24:10 2020-03-15 00:24:10.009  INFO 3955 --- [           main] o.s.c.d.a.test.NamedChannelTests         : Requesting log for app HTTP-SOURCE-1.http-v1-0
15-Mar-2020 00:24:10 2020-03-15 00:24:10.310  INFO 3955 --- [           main] o.s.c.d.a.test.NamedChannelTests         : Retrieved logfile from 'http://10.194.6.131:52035/actuator/logfile
15-Mar-2020 00:24:10 2020-03-15 00:24:10.310  INFO 3955 --- [           main] o.s.c.d.a.test.NamedChannelTests         : Matched all 'Started HttpSource' in logfile for app http (source HTTP-SOURCE-1.http-v1-0)
15-Mar-2020 00:24:10 2020-03-15 00:24:10.310  INFO 3955 --- [           main] o.s.c.d.a.test.NamedChannelTests         : Creating stream 'HTTP-SOURCE-2'
15-Mar-2020 00:24:10 2020-03-15 00:24:10.337  INFO 3955 --- [           main] o.s.c.d.a.test.NamedChannelTests         : Deploying stream 'HTTP-SOURCE-2' with properties: {app.*.spring.cloud.streamapp.security.enabled=false, app.*.logging.file=${PID}-test.log, app.*.endpoints.logfile.sensitive=false, app.*.management.endpoints.web.exposure.include=*}
15-Mar-2020 00:24:10 2020-03-15 00:24:10.761  INFO 3955 --- [           main] o.s.c.d.a.test.NamedChannelTests         : Checking: Stream=HTTP-SOURCE-2, status = deploying, status description = The stream is being deployed.
15-Mar-2020 00:24:10 2020-03-15 00:24:10.761  INFO 3955 --- [           main] o.s.c.d.a.test.NamedChannelTests         : Sleeping to check status of Stream=HTTP-SOURCE-2
15-Mar-2020 00:24:20 2020-03-15 00:24:20.804  INFO 3955 --- [           main] o.s.c.d.a.test.NamedChannelTests         : Checking: Stream=HTTP-SOURCE-2, status = deployed, status description = The stream has been successfully deployed
15-Mar-2020 00:24:20 2020-03-15 00:24:20.842  INFO 3955 --- [           main] o.s.c.d.a.test.NamedChannelTests         : Sleeping to check status of Stream=HTTP-SOURCE-2
15-Mar-2020 00:24:30 2020-03-15 00:24:30.842  INFO 3955 --- [           main] o.s.c.d.a.test.NamedChannelTests         : Stream 'HTTP-SOURCE-2' started with status: deployed
15-Mar-2020 00:24:30 2020-03-15 00:24:30.842  INFO 3955 --- [           main] o.s.c.d.a.test.NamedChannelTests         : App 'http' has instances: {HTTP-SOURCE-2.http-v1-0=http://10.194.6.131:30132}
15-Mar-2020 00:24:30 2020-03-15 00:24:30.842  INFO 3955 --- [           main] o.s.c.d.a.test.NamedChannelTests         : Looking for 'Started HttpSource' in logfile for http
15-Mar-2020 00:24:40 2020-03-15 00:24:40.843  INFO 3955 --- [           main] o.s.c.d.a.test.NamedChannelTests         : Requesting log for app HTTP-SOURCE-2.http-v1-0
15-Mar-2020 00:24:41 2020-03-15 00:24:41.123  INFO 3955 --- [           main] o.s.c.d.a.test.NamedChannelTests         : Retrieved logfile from 'http://10.194.6.131:30132/actuator/logfile
15-Mar-2020 00:24:41 2020-03-15 00:24:41.123  INFO 3955 --- [           main] o.s.c.d.a.test.NamedChannelTests         : Matched all 'Started HttpSource' in logfile for app http (source HTTP-SOURCE-2.http-v1-0)
15-Mar-2020 00:24:41 2020-03-15 00:24:41.291  INFO 3955 --- [           main] o.s.c.d.a.test.NamedChannelTests         : Looking for 'abcdefg' in logfile for log
15-Mar-2020 00:24:51 2020-03-15 00:24:51.291  INFO 3955 --- [           main] o.s.c.d.a.test.NamedChannelTests         : Requesting log for app MANY-TO-ONE.log-v1-0
15-Mar-2020 00:24:51 2020-03-15 00:24:51.302  INFO 3955 --- [           main] o.s.c.d.a.test.NamedChannelTests         : Retrieved logfile from 'http://10.194.6.131:55885/actuator/logfile
15-Mar-2020 00:24:51 2020-03-15 00:24:51.302  INFO 3955 --- [           main] o.s.c.d.a.test.NamedChannelTests         : Matched all 'abcdefg' in logfile for app log (source MANY-TO-ONE.log-v1-0)
15-Mar-2020 00:24:51 2020-03-15 00:24:51.445  INFO 3955 --- [           main] o.s.c.d.a.test.NamedChannelTests         : Looking for 'hijklmn' in logfile for log
15-Mar-2020 00:25:01 2020-03-15 00:25:01.445  INFO 3955 --- [           main] o.s.c.d.a.test.NamedChannelTests         : Requesting log for app MANY-TO-ONE.log-v1-0
15-Mar-2020 00:25:01 2020-03-15 00:25:01.452  INFO 3955 --- [           main] o.s.c.d.a.test.NamedChannelTests         : Retrieved logfile from 'http://10.194.6.131:55885/actuator/logfile
15-Mar-2020 00:25:01 2020-03-15 00:25:01.452  INFO 3955 --- [           main] o.s.c.d.a.test.NamedChannelTests         : Matched all 'hijklmn' in logfile for app log (source MANY-TO-ONE.log-v1-0)
15-Mar-2020 00:25:01 2020-03-15 00:25:01.453  INFO 3955 --- [           main] junit.logTestName                        : Test manyToOneTest(org.springframework.cloud.dataflow.acceptance.test.NamedChannelTests) Succeeded
15-Mar-2020 00:25:01 2020-03-15 00:25:01.453  INFO 3955 --- [           main] junit.logTestName                        : Finished Test manyToOneTest(org.springframework.cloud.dataflow.acceptance.test.NamedChannelTests)
15-Mar-2020 00:25:01 2020-03-15 00:25:01.453  INFO 3955 --- [           main] o.s.c.d.a.test.NamedChannelTests         : Destroy all streams
15-Mar-2020 00:25:01 Tests run: 4, Failures: 0, Errors: 0, Skipped: 1, Time elapsed: 277.775 sec - in org.springframework.cloud.dataflow.acceptance.test.NamedChannelTests
15-Mar-2020 00:25:01 Running org.springframework.cloud.dataflow.acceptance.test.util.PlatformHelperTests
15-Mar-2020 00:25:01 Tests run: 3, Failures: 0, Errors: 0, Skipped: 0, Time elapsed: 0.091 sec - in org.springframework.cloud.dataflow.acceptance.test.util.PlatformHelperTests
15-Mar-2020 00:25:01 Running org.springframework.cloud.dataflow.acceptance.test.util.ApplicationTests
15-Mar-2020 00:25:01 Tests run: 2, Failures: 0, Errors: 0, Skipped: 0, Time elapsed: 0 sec - in org.springframework.cloud.dataflow.acceptance.test.util.ApplicationTests
15-Mar-2020 00:25:01 2020-03-15 00:25:01.908  INFO 3955 --- [       Thread-6] o.s.c.support.GenericApplicationContext  : Closing org.springframework.context.support.GenericApplicationContext@378f002a: startup date [Sun Mar 15 00:06:33 UTC 2020]; root of context hierarchy
15-Mar-2020 00:25:01
15-Mar-2020 00:25:01 Results :
15-Mar-2020 00:25:01
15-Mar-2020 00:25:01 Failed tests:
15-Mar-2020 00:25:01   ComposedTaskTests.ctrLaunch:41->assertTaskExecutions:65 null
15-Mar-2020 00:25:01   ComposedTaskTests.ctrMultipleLaunch:47->assertTaskExecutions:65 null
15-Mar-2020 00:25:01   ComposedTaskTests.ctrMultipleLaunchWithArguments:57->assertTaskExecutions:65 null
15-Mar-2020 00:25:01
15-Mar-2020 00:25:01 Tests run: 22, Failures: 3, Errors: 0, Skipped: 4
15-Mar-2020 00:25:01
15-Mar-2020 00:25:01 [INFO] ------------------------------------------------------------------------
15-Mar-2020 00:25:01 [INFO] BUILD FAILURE
15-Mar-2020 00:25:01 [INFO] ------------------------------------------------------------------------
15-Mar-2020 00:25:01 [INFO] Total time: 21:15 min
15-Mar-2020 00:25:01 [INFO] Finished at: 2020-03-15T00:25:01+00:00
15-Mar-2020 00:25:02 [INFO] Final Memory: 51M/452M
15-Mar-2020 00:25:02 [INFO] ------------------------------------------------------------------------
15-Mar-2020 00:25:02 [ERROR] Failed to execute goal org.apache.maven.plugins:maven-surefire-plugin:2.18.1:test (default-test) on project spring-cloud-dataflow-acceptance-tests: There are test failures.
15-Mar-2020 00:25:02 [ERROR]
15-Mar-2020 00:25:02 [ERROR] Please refer to /opt/bamboo-home/xml-data/build-dir/SCDT-LOCAL20XSKIPPER20X-KAFKA/target/surefire-reports for the individual test results.
15-Mar-2020 00:25:02 [ERROR] -> [Help 1]
15-Mar-2020 00:25:02 [ERROR]
15-Mar-2020 00:25:02 [ERROR] To see the full stack trace of the errors, re-run Maven with the -e switch.
15-Mar-2020 00:25:02 [ERROR] Re-run Maven using the -X switch to enable full debug logging.
15-Mar-2020 00:25:02 [ERROR]
15-Mar-2020 00:25:02 [ERROR] For more information about the errors and possible solutions, please read the following articles:
15-Mar-2020 00:25:02 [ERROR] [Help 1] http://cwiki.apache.org/confluence/display/MAVEN/MojoFailureException
15-Mar-2020 00:25:02 Clean up, clean up, everybody everywhere; clean up clean up, everybody do your share!
15-Mar-2020 00:25:02 Clean up servers
15-Mar-2020 00:25:02 Killing process PID [3848]
15-Mar-2020 00:25:02 Killing process PID [3724]
15-Mar-2020 00:25:03 No stopped containers
15-Mar-2020 00:25:03 Stopping mysql_mysql_1 ...
15-Mar-2020 00:25:05
15-Mar-2020 00:25:05 Stopping mysql_mysql_1 ... done
15-Mar-2020 00:25:05 Removing mysql_mysql_1 ...
15-Mar-2020 00:25:05
15-Mar-2020 00:25:05 Removing mysql_mysql_1 ... done
15-Mar-2020 00:25:05 Going to remove mysql_mysql_1
15-Mar-2020 00:25:06 Stopping kafka_zookeeper_1 ...
15-Mar-2020 00:25:06 Stopping kafka_kafka_1     ...
15-Mar-2020 00:25:09
15-Mar-2020 00:25:09 Stopping kafka_kafka_1     ... done
15-Mar-2020 00:25:16
15-Mar-2020 00:25:16 Stopping kafka_zookeeper_1 ... done
15-Mar-2020 00:25:17 Removing kafka_zookeeper_1 ...
15-Mar-2020 00:25:17 Removing kafka_kafka_1     ...
15-Mar-2020 00:25:17
15-Mar-2020 00:25:17 Removing kafka_zookeeper_1 ... done
15-Mar-2020 00:25:17
15-Mar-2020 00:25:17 Removing kafka_kafka_1     ... done
15-Mar-2020 00:25:17 Going to remove kafka_zookeeper_1, kafka_kafka_1
15-Mar-2020 00:25:17
15-Mar-2020 00:25:17 Finished task 'Execute Acceptance Tests' with result: Success
15-Mar-2020 00:25:17 Starting task 'JUnit Parser' of type 'com.atlassian.bamboo.plugins.testresultparser:task.testresultparser.junit'
15-Mar-2020 00:25:17 Parsing test results under /opt/bamboo-home/xml-data/build-dir/SCDT-LOCAL20XSKIPPER20X-KAFKA...
15-Mar-2020 00:25:17 Failing task since 3 failing test cases were found.
15-Mar-2020 00:25:17 Finished task 'JUnit Parser' with result: Failed
15-Mar-2020 00:25:17 Starting task 'clean up' of type 'com.atlassian.bamboo.plugins.scripttask:task.builder.script'
15-Mar-2020 00:25:17
Beginning to execute external process for build 'Spring Cloud Data Flow Acceptance Tests - Local + SCDF-2.0.4.BS + Skipper 2.0.4.BS (12 am) - Run Data Flow Acceptance Tests for Kafka #288 (SCDT-LOCAL20XSKIPPER20X-KAFKA-288)'
... running command line:
/opt/bamboo-home/temp/SCDT-LOCAL20XSKIPPER20X-KAFKA-288-ScriptBuildTask-1415936662860350493.sh
... in: /opt/bamboo-home/xml-data/build-dir/SCDT-LOCAL20XSKIPPER20X-KAFKA
... using extra environment variables:
bamboo_planRepository_1_branch=master
bamboo_********_username_password=********
bamboo_signing_store_password=********
bamboo_capability_system_builder_ant_Ant_1_9=/opt/ant-1.9
bamboo_capability_system_builder_ant_Ant_1_8=/opt/ant-1.8
bamboo_planRepository_1_branchDisplayName=master
bamboo_repository_274694331_git_username=spring-buildmaster
bamboo_artifactory_override_resolve_repo=libs-milestone
bamboo_capability_system_builder_node_Node_js_10_16=/opt/node-10.16/bin/node
bamboo_repository_revision_number=dd41fb40bc32a7a65c2616a8ca39a0a5c2402ad1
bamboo_RIAK_BIN=/usr/sbin/riak
bamboo_buildKey=SCDT-LOCAL20XSKIPPER20X-KAFKA
bamboo_repository_274694331_branch_name=master
bamboo_ge_cache_username=ci
bamboo_bintray_password=********
bamboo_gradle_enterprise_cache_user=ci
bamboo_sonar_token_password=********
bamboo_shortJobName=Run Data Flow Acceptance Tests for Kafka
bamboo_artifactory_override_resolver_password=********
bamboo_sonatype_token=RSJChaox
bamboo_capability_system_builder_gradle___gradlew=./gradlew
bamboo_buildResultsUrl=https://build.spring.io/browse/SCDT-LOCAL20XSKIPPER20X-KAFKA-288
bamboo_capability_system_builder_mvn3_Maven_3_3=/opt/maven-3.3
bamboo_capability_system_builder_mvn3_Maven_3_2=/opt/maven-3.2
bamboo_capability_system_builder_mvn3_Maven_3_1=/opt/maven-3.1
bamboo_planRepository_repositoryUrl=https://github.com/spring-cloud/spring-cloud-dataflow-acceptance-tests.git
bamboo_capability_system_builder_mvn3_Maven_3_6=/opt/maven-3.6
bamboo_agentId=286195722
bamboo_capability_system_builder_mvn3_Maven_3_5=/opt/maven-3.5
bamboo_capability_system_builder_mvn3_Maven_3_0=/opt/maven-3.0
bamboo_planRepository_revision=dd41fb40bc32a7a65c2616a8ca39a0a5c2402ad1
bamboo_planRepository_previousRevision=dd41fb40bc32a7a65c2616a8ca39a0a5c2402ad1
bamboo_capability_remote_build=true
bamboo_repository_branch_name=master
bamboo_sonatype_token_password=********
bamboo_sonatype_user=springsource
bamboo_gradle_enterprise_cache_password=********
bamboo_repository_274694331_name=Git
bamboo_scdf_acceptance_tests_password=********
bamboo_APPLE_AC_PASSWORD=********
bamboo_repository_274694331_git_branch=master
bamboo_gradle_enterprise_secret_access_key=********
bamboo_planRepository_branch=master
bamboo_capability_system_jdk_JDK_15=/opt/jdk-15
bamboo_capability_system_jdk_JDK_13=/opt/jdk-13
bamboo_capability_system_jdk_JDK_14=/opt/jdk-14
bamboo_planRepository_1_type=gitv2
bamboo_planRepository_branchName=master
bamboo_capability_system_jdk_JDK_12=/opt/jdk-12
bamboo_capability_system_builder_gradlew_gradlew=./
bamboo_capability_system_builder_ant_Ant_1_10=/opt/ant-1.10
bamboo_sonar_password=********
bamboo_hg_cache_directory=/opt/bamboo-home/xml-data/build-dir/_hg-repositories-cache
bamboo_planRepository_1_username=spring-buildmaster
bamboo_repository_274694331_git_repositoryUrl=https://github.com/spring-cloud/spring-cloud-dataflow-acceptance-tests.git
bamboo_planRepository_type=gitv2
bamboo_git_cache_directory=/opt/bamboo-home/xml-data/build-dir/_git-repositories-cache
bamboo_artifactory_username=buildmaster
bamboo_tmp_directory=/opt/bamboo-home/temp
bamboo_planKey=SCDT-LOCAL20XSKIPPER20X
bamboo_planRepository_username=spring-buildmaster
bamboo_JDK8_HOME=/opt/jdk-8
bamboo_repository_274694331_previous_revision_number=dd41fb40bc32a7a65c2616a8ca39a0a5c2402ad1
bamboo_planRepository_1_branchName=master
bamboo_sonar_version=6.7.7
bamboo_sonar_jdbc_password=********
bamboo_bintray_api_key_password=********
bamboo_capability_system_jdk_JDK_1_11=/opt/jdk-11
bamboo_resultsUrl=https://build.spring.io/browse/SCDT-LOCAL20XSKIPPER20X-KAFKA-288
bamboo_APPLE_AC_USERNAME_PASSWORD=********
bamboo_capability_system_jdk_JDK_1_10=/opt/jdk-10
bamboo_build_working_directory=/opt/bamboo-home/xml-data/build-dir/SCDT-LOCAL20XSKIPPER20X-KAFKA
bamboo_planRepository_1_name=Git
bamboo_capability_system_os=ubuntu1804
bamboo_nexusPush_stagingProfile=buildmaster
bamboo_shortPlanName=Local + SCDF-2.0.4.BS + Skipper 2.0.4.BS (12 am)
bamboo_planRepository_name=Git
bamboo_buildNumber=288
bamboo_planName=Spring Cloud Data Flow Acceptance Tests - Local + SCDF-2.0.4.BS + Skipper 2.0.4.BS (12 am)
bamboo_JDK7_HOME=/opt/jdk-7
bamboo_build_commandline_com_atlassian_bamboo_plugins_scripttask_task_builder_script_7=/opt/bamboo-home/temp/SCDT-LOCAL20XSKIPPER20X-KAFKA-288-ScriptBuildTask-2801486810736389548.sh
bamboo_shortPlanKey=LOCAL20XSKIPPER20X
bamboo_shortJobKey=KAFKA
bamboo_artifactory_password=********
bamboo_buildTimeStamp=2020-03-15T00:00:04.311Z
bamboo_repository_previous_revision_number=dd41fb40bc32a7a65c2616a8ca39a0a5c2402ad1
bamboo_sonar_username=buildmaster
bamboo_********_password=********
bamboo_repository_git_branch=master
bamboo_buildResultKey=SCDT-LOCAL20XSKIPPER20X-KAFKA-288
bamboo_nexusPush_close=true
bamboo_artifactory_override_resolver_username=buildmaster
bamboo_buildPlanName=Spring Cloud Data Flow Acceptance Tests - Local + SCDF-2.0.4.BS + Skipper 2.0.4.BS (12 am) - Run Data Flow Acceptance Tests for Kafka
bamboo_repository_274694331_revision_number=dd41fb40bc32a7a65c2616a8ca39a0a5c2402ad1
bamboo_planRepository_1_revision=dd41fb40bc32a7a65c2616a8ca39a0a5c2402ad1
bamboo_repository_name=Git
bamboo_signing_key_password=********
bamboo_capability_system_builder_groovy_Groovy_2_5=/opt/groovy-2.5
bamboo_buildFailed=true
bamboo_capability_system_docker_executable=/usr/bin/docker
bamboo_capability_system_jdk_OpenJDK_7=/opt/jdk-7
bamboo_capability_system_builder_groovy_Groovy_2_4=/opt/groovy-2.4
bamboo_artifactory_override_deployer_username=buildmaster
bamboo_capability_system_builder_command_Bash=/bin/bash
bamboo_jobFailed=true
bamboo_agentWorkingDirectory=/opt/bamboo-home/xml-data/build-dir
bamboo_capability_system_git_executable=/usr/bin/git
bamboo_repository_git_username=spring-buildmaster
bamboo_planRepository_1_previousRevision=dd41fb40bc32a7a65c2616a8ca39a0a5c2402ad1
bamboo_capability_os_family=unix
bamboo_planRepository_branchDisplayName=master
bamboo_capability_system_builder_maven_Artifactory_Maven_3_6=/opt/maven-3.6
bamboo_capability_system_builder_maven_Artifactory_Maven_3_5=/opt/maven-3.5
bamboo_capability_system_builder_maven_Artifactory_Maven_3_3=/opt/maven-3.3
bamboo_capability_system_builder_maven_Artifactory_Maven_3_2=/opt/maven-3.2
bamboo_s3_properties=/home/bamboo/tools/s3.properties
bamboo_capability_system_builder_maven_Artifactory_Maven_3_1=/opt/maven-3.1
bamboo_artifactory_override_deploy_repo=libs-snapshot-local
bamboo_capability_system_builder_maven_Artifactory_Maven_3_0=/opt/maven-3.0
bamboo_plan_storageTag=plan-274497908
bamboo_bintray_username_password=********
bamboo_repository_git_repositoryUrl=https://github.com/spring-cloud/spring-cloud-dataflow-acceptance-tests.git
bamboo_working_directory=/opt/bamboo-home/xml-data/build-dir/SCDT-LOCAL20XSKIPPER20X-KAFKA
bamboo_planRepository_1_repositoryUrl=https://github.com/spring-cloud/spring-cloud-dataflow-acceptance-tests.git
bamboo_capability_system_jdk_JDK_1_8=/opt/jdk-8
bamboo_artifactory_override_deployer_password=********
bamboo_capability_system_jdk_JDK_1_9=/opt/jdk-9
bamboo_capability_system_jdk_JDK_1_6=/opt/jdk-6
bamboo_sonatype_password=********
bamboo_capability_system_jdk_JDK_1_7=/opt/jdk-7
bamboo_sonar_ip=10.194.6.9
bamboo_ge_cache_password=********
15-Mar-2020 00:25:17 CLEANING UP RESOURCES AFTER RUNNING TESTS
15-Mar-2020 00:25:17 Environment variable JAVA_HOME must be set
15-Mar-2020 00:25:17 FINISHED CLEANING UP RESOURCES
15-Mar-2020 00:25:17 Finished task 'clean up' with result: Success
15-Mar-2020 00:25:17 Running post build plugin 'Docker Container Cleanup'
15-Mar-2020 00:25:17 Running post build plugin 'NCover Results Collector'
15-Mar-2020 00:25:17 Running post build plugin 'Artifactory Release Management Staging'
15-Mar-2020 00:25:17 Running post build plugin 'Artifactory Build Info Copier'
15-Mar-2020 00:25:17 Running post build plugin 'Artifactory Gradle Properties Info Copier'
15-Mar-2020 00:25:17 Running post build plugin 'Clover Results Collector'
15-Mar-2020 00:25:17 Running post build plugin 'npm Cache Cleanup'
15-Mar-2020 00:25:17 Running post build plugin 'Artifact Copier'
15-Mar-2020 00:25:17 Publishing an artifact: App and Server Logs
15-Mar-2020 00:25:17 Finished publishing of artifact Non required job artifact: [App and Server Logs], pattern: [**/*.log] anchored at: [local] in 45.12 ms
15-Mar-2020 00:25:17 Publishing an artifact: Test Results
15-Mar-2020 00:25:17 Finished publishing of artifact Non required job artifact: [Test Results], pattern: [**/target/surefire-reports/**/*.*] in 51.17 ms
15-Mar-2020 00:25:17 Successfully removed working directory at '/opt/bamboo-home/xml-data/build-dir/SCDT-LOCAL20XSKIPPER20X-KAFKA'
15-Mar-2020 00:25:17 Finalising the build...
15-Mar-2020 00:25:17 Stopping timer.
15-Mar-2020 00:25:17 Build SCDT-LOCAL20XSKIPPER20X-KAFKA-288 completed.
15-Mar-2020 00:25:17 Running on server: post build plugin 'NCover Results Collector'
15-Mar-2020 00:25:17 Running on server: post build plugin 'Build Hanging Detection Configuration'
15-Mar-2020 00:25:17 Running on server: post build plugin 'Bamboo project link creator'
15-Mar-2020 00:25:17 Running on server: post build plugin 'Clover Delta Calculator'
15-Mar-2020 00:25:17 Running on server: post build plugin 'Maven Dependencies Postprocessor'
15-Mar-2020 00:25:17 All post build plugins have finished
15-Mar-2020 00:25:17 Generating build results summary...
15-Mar-2020 00:25:17 Saving build results to disk...
15-Mar-2020 00:25:17 Logging substituted variables...
15-Mar-2020 00:25:17 Indexing build results...
15-Mar-2020 00:25:17 Finished building SCDT-LOCAL20XSKIPPER20X-KAFKA-288.