Build: #3 was successful

Job: Run Data Flow Acceptance Tests for Kafka was successful

Stages & jobs

  1. Test Stage - Kafka

  2. Test Stage - Rabbit

Build log

The build generated 2,177 lines of output.The output is too long and has been truncated to the last 1,000 lines. Download or view full build log

08-Nov-2018 19:51:57 [INFO] Downloading: http://repo.spring.io/libs-snapshot-local/org/springframework/integration/spring-integration-jmx/4.3.2.RELEASE/spring-integration-jmx-4.3.2.RELEASE.jar
08-Nov-2018 19:51:57 [INFO] Downloading: http://repo.spring.io/libs-snapshot-local/org/springframework/retry/spring-retry/1.1.4.RELEASE/spring-retry-1.1.4.RELEASE.jar
08-Nov-2018 19:51:57 [INFO] Downloading: http://repo.spring.io/libs-snapshot-local/org/springframework/cloud/spring-cloud-stream-metrics/1.3.1.RELEASE/spring-cloud-stream-metrics-1.3.1.RELEASE.jar
08-Nov-2018 19:51:57 [INFO] Downloading: http://repo.spring.io/libs-snapshot-local/org/springframework/integration/spring-integration-xml/4.3.2.RELEASE/spring-integration-xml-4.3.2.RELEASE.jar
08-Nov-2018 19:51:57 [INFO] Downloading: http://repo.spring.io/libs-snapshot-local/org/springframework/spring-oxm/4.3.3.RELEASE/spring-oxm-4.3.3.RELEASE.jar
08-Nov-2018 19:51:57 [INFO] Downloading: http://repo.spring.io/libs-snapshot-local/org/springframework/ws/spring-xml/2.3.0.RELEASE/spring-xml-2.3.0.RELEASE.jar
08-Nov-2018 19:51:57 [INFO] Downloading: http://repo.spring.io/libs-snapshot-local/org/springframework/boot/spring-boot-starter-security/1.4.1.RELEASE/spring-boot-starter-security-1.4.1.RELEASE.jar
08-Nov-2018 19:51:57 [INFO] Downloading: http://repo.spring.io/libs-snapshot-local/org/springframework/security/spring-security-config/4.1.3.RELEASE/spring-security-config-4.1.3.RELEASE.jar
08-Nov-2018 19:51:57 [INFO] Downloading: http://repo.spring.io/libs-snapshot-local/org/springframework/security/spring-security-core/4.1.3.RELEASE/spring-security-core-4.1.3.RELEASE.jar
08-Nov-2018 19:51:57 [INFO] Downloading: http://repo.spring.io/libs-snapshot-local/org/springframework/security/spring-security-web/4.1.3.RELEASE/spring-security-web-4.1.3.RELEASE.jar
08-Nov-2018 19:51:57 [INFO] Downloading: http://repo.spring.io/libs-snapshot-local/io/pivotal/spring/cloud/spring-cloud-services-starter-config-client/1.5.0.RELEASE/spring-cloud-services-starter-config-client-1.5.0.RELEASE.jar
08-Nov-2018 19:51:57 [INFO] Downloading: http://repo.spring.io/libs-snapshot-local/org/springframework/security/spring-security-crypto/4.1.3.RELEASE/spring-security-crypto-4.1.3.RELEASE.jar
08-Nov-2018 19:51:57 [INFO] Downloading: http://repo.spring.io/libs-snapshot-local/org/springframework/cloud/spring-cloud-commons/1.2.2.RELEASE/spring-cloud-commons-1.2.2.RELEASE.jar
08-Nov-2018 19:51:57 [INFO] Downloading: http://repo.spring.io/libs-snapshot-local/org/springframework/cloud/spring-cloud-config-client/1.3.1.RELEASE/spring-cloud-config-client-1.3.1.RELEASE.jar
08-Nov-2018 19:51:57 [INFO] Downloading: http://repo.spring.io/libs-snapshot-local/org/springframework/cloud/spring-cloud-context/1.2.2.RELEASE/spring-cloud-context-1.2.2.RELEASE.jar
08-Nov-2018 19:51:57 [INFO] Downloading: http://repo.spring.io/libs-snapshot-local/org/springframework/security/oauth/spring-security-oauth2/2.0.11.RELEASE/spring-security-oauth2-2.0.11.RELEASE.jar
08-Nov-2018 19:51:57 [INFO] Downloading: http://repo.spring.io/libs-snapshot-local/org/codehaus/jackson/jackson-mapper-asl/1.9.13/jackson-mapper-asl-1.9.13.jar
08-Nov-2018 19:51:57 [INFO] Downloading: http://repo.spring.io/libs-snapshot-local/org/codehaus/jackson/jackson-core-asl/1.9.13/jackson-core-asl-1.9.13.jar
08-Nov-2018 19:51:57 [INFO] Downloading: http://repo.spring.io/libs-snapshot-local/io/pivotal/spring/cloud/spring-cloud-services-cloudfoundry-connector/1.5.0.RELEASE/spring-cloud-services-cloudfoundry-connector-1.5.0.RELEASE.jar
08-Nov-2018 19:51:57 [INFO] Downloading: http://repo.spring.io/libs-snapshot-local/io/pivotal/spring/cloud/spring-cloud-services-connector-core/1.5.0.RELEASE/spring-cloud-services-connector-core-1.5.0.RELEASE.jar
08-Nov-2018 19:51:57 [INFO] Downloading: http://repo.spring.io/libs-snapshot-local/org/springframework/cloud/spring-cloud-core/1.2.3.RELEASE/spring-cloud-core-1.2.3.RELEASE.jar
08-Nov-2018 19:51:57 [INFO] Downloading: http://repo.spring.io/libs-snapshot-local/org/springframework/cloud/spring-cloud-cloudfoundry-connector/1.2.3.RELEASE/spring-cloud-cloudfoundry-connector-1.2.3.RELEASE.jar
08-Nov-2018 19:51:57 [INFO] Downloading: http://repo.spring.io/libs-snapshot-local/io/pivotal/spring/cloud/spring-cloud-services-spring-connector/1.5.0.RELEASE/spring-cloud-services-spring-connector-1.5.0.RELEASE.jar
08-Nov-2018 19:51:57 [INFO] Downloading: http://repo.spring.io/libs-snapshot-local/org/projectlombok/lombok/1.16.10/lombok-1.16.10.jar
08-Nov-2018 19:51:57 [INFO] Downloading: http://repo.spring.io/libs-snapshot-local/org/springframework/cloud/spring-cloud-spring-service-connector/1.2.3.RELEASE/spring-cloud-spring-service-connector-1.2.3.RELEASE.jar
08-Nov-2018 19:51:57 [INFO] Downloading: http://repo.spring.io/libs-snapshot-local/io/pivotal/spring/cloud/cloudfoundry-certificate-truster/1.0.1.RELEASE/cloudfoundry-certificate-truster-1.0.1.RELEASE.jar
08-Nov-2018 19:51:57 [INFO] Downloading: http://repo.spring.io/libs-snapshot-local/io/micrometer/micrometer-spring-legacy/1.0.3/micrometer-spring-legacy-1.0.3.jar
08-Nov-2018 19:51:57 [INFO] Downloading: http://repo.spring.io/libs-snapshot-local/io/micrometer/micrometer-core/1.0.3/micrometer-core-1.0.3.jar
08-Nov-2018 19:51:57 [INFO] Downloading: http://repo.spring.io/libs-snapshot-local/org/springframework/boot/spring-boot-starter-data-redis/1.4.1.RELEASE/spring-boot-starter-data-redis-1.4.1.RELEASE.jar
08-Nov-2018 19:51:57 [INFO] Downloading: http://repo.spring.io/libs-snapshot-local/org/springframework/data/spring-data-redis/1.7.3.RELEASE/spring-data-redis-1.7.3.RELEASE.jar
08-Nov-2018 19:51:57 [INFO] Downloading: http://repo.spring.io/libs-snapshot-local/org/springframework/data/spring-data-keyvalue/1.1.3.RELEASE/spring-data-keyvalue-1.1.3.RELEASE.jar
08-Nov-2018 19:51:57 [INFO] Downloading: http://repo.spring.io/libs-snapshot-local/org/springframework/spring-tx/4.3.3.RELEASE/spring-tx-4.3.3.RELEASE.jar
08-Nov-2018 19:51:57 [INFO] Downloading: http://repo.spring.io/libs-snapshot-local/org/springframework/spring-context-support/4.3.3.RELEASE/spring-context-support-4.3.3.RELEASE.jar
08-Nov-2018 19:51:57 [INFO] Downloading: http://repo.spring.io/libs-snapshot-local/redis/clients/jedis/2.8.1/jedis-2.8.1.jar
08-Nov-2018 19:51:57 [INFO] Downloading: http://repo.spring.io/libs-snapshot-local/org/apache/commons/commons-pool2/2.4.2/commons-pool2-2.4.2.jar
08-Nov-2018 19:51:57 [INFO] Downloading: http://repo.spring.io/libs-snapshot-local/org/springframework/spring-web/4.3.4.RELEASE/spring-web-4.3.4.RELEASE.jar
08-Nov-2018 19:51:57 [INFO] Downloading: http://repo.spring.io/libs-snapshot-local/org/springframework/cloud/spring-cloud-dataflow-rest-client/1.7.0.BUILD-SNAPSHOT/spring-cloud-dataflow-rest-client-1.7.0.BUILD-20181023.141453-130.jar
08-Nov-2018 19:51:57 [INFO] Downloading: http://repo.spring.io/libs-snapshot-local/org/springframework/plugin/spring-plugin-core/1.2.0.RELEASE/spring-plugin-core-1.2.0.RELEASE.jar
08-Nov-2018 19:51:57 [INFO] Downloading: http://repo.spring.io/libs-snapshot-local/joda-time/joda-time/2.9.4/joda-time-2.9.4.jar
08-Nov-2018 19:51:57 [INFO] Downloading: http://repo.spring.io/libs-snapshot-local/org/springframework/analytics/spring-analytics/1.1.3.RELEASE/spring-analytics-1.1.3.RELEASE.jar
08-Nov-2018 19:51:57 [INFO] Downloading: http://repo.spring.io/libs-snapshot-local/org/springframework/hateoas/spring-hateoas/0.20.0.RELEASE/spring-hateoas-0.20.0.RELEASE.jar
08-Nov-2018 19:51:57 [INFO] Downloading: http://repo.spring.io/libs-snapshot-local/org/springframework/data/spring-data-commons/1.12.3.RELEASE/spring-data-commons-1.12.3.RELEASE.jar
08-Nov-2018 19:51:57 [INFO] Downloading: http://repo.spring.io/libs-snapshot-local/org/springframework/cloud/spring-cloud-skipper/1.1.0.RELEASE/spring-cloud-skipper-1.1.0.RELEASE.jar
08-Nov-2018 19:51:57 [INFO] Downloading: http://repo.spring.io/libs-snapshot-local/com/fasterxml/jackson/dataformat/jackson-dataformat-yaml/2.8.3/jackson-dataformat-yaml-2.8.3.jar
08-Nov-2018 19:51:58 [INFO] Downloading: http://repo.spring.io/libs-snapshot-local/org/zeroturnaround/zt-zip/1.11/zt-zip-1.11.jar
08-Nov-2018 19:51:58 [INFO] Downloading: http://repo.spring.io/libs-snapshot-local/org/springframework/cloud/spring-cloud-dataflow-rest-resource/1.7.0.BUILD-SNAPSHOT/spring-cloud-dataflow-rest-resource-1.7.0.BUILD-20181023.141453-130.jar
08-Nov-2018 19:51:58 [INFO] Downloading: http://repo.spring.io/libs-snapshot-local/org/springframework/boot/spring-boot-configuration-metadata/1.4.1.RELEASE/spring-boot-configuration-metadata-1.4.1.RELEASE.jar
08-Nov-2018 19:51:58 [INFO] Downloading: http://repo.spring.io/libs-snapshot-local/org/springframework/batch/spring-batch-core/3.0.7.RELEASE/spring-batch-core-3.0.7.RELEASE.jar
08-Nov-2018 19:51:58 [INFO] Downloading: http://repo.spring.io/libs-snapshot-local/com/ibm/jbatch/com.ibm.jbatch-tck-spi/1.0/com.ibm.jbatch-tck-spi-1.0.jar
08-Nov-2018 19:51:58 [INFO] Downloading: http://repo.spring.io/libs-snapshot-local/javax/batch/javax.batch-api/1.0/javax.batch-api-1.0.jar
08-Nov-2018 19:51:58 [INFO] Downloading: http://repo.spring.io/libs-snapshot-local/com/thoughtworks/xstream/xstream/1.4.7/xstream-1.4.7.jar
08-Nov-2018 19:51:58 [INFO] Downloading: http://repo.spring.io/libs-snapshot-local/xmlpull/xmlpull/1.1.3.1/xmlpull-1.1.3.1.jar
08-Nov-2018 19:51:58 [INFO] Downloading: http://repo.spring.io/libs-snapshot-local/xpp3/xpp3_min/1.1.4c/xpp3_min-1.1.4c.jar
08-Nov-2018 19:51:58 [INFO] Downloading: http://repo.spring.io/libs-snapshot-local/org/codehaus/jettison/jettison/1.2/jettison-1.2.jar
08-Nov-2018 19:51:58 [INFO] Downloading: http://repo.spring.io/libs-snapshot-local/org/springframework/batch/spring-batch-infrastructure/3.0.7.RELEASE/spring-batch-infrastructure-3.0.7.RELEASE.jar
08-Nov-2018 19:51:58 [INFO] Downloading: http://repo.spring.io/libs-snapshot-local/org/springframework/cloud/spring-cloud-task-core/1.3.0.RELEASE/spring-cloud-task-core-1.3.0.RELEASE.jar
08-Nov-2018 19:51:58 [INFO] Downloading: http://repo.spring.io/libs-snapshot-local/org/springframework/cloud/spring-cloud-deployer-resource-support/1.2.1.RELEASE/spring-cloud-deployer-resource-support-1.2.1.RELEASE.jar
08-Nov-2018 19:51:58 [INFO] Downloaded: http://repo.spring.io/libs-snapshot-local/org/springframework/cloud/spring-cloud-dataflow-rest-client/1.7.0.BUILD-SNAPSHOT/spring-cloud-dataflow-rest-client-1.7.0.BUILD-20181023.141453-130.jar (70 KB at 59.8 KB/sec)
08-Nov-2018 19:51:58 [INFO] Downloading: http://repo.spring.io/libs-snapshot-local/org/springframework/spring-jdbc/4.3.3.RELEASE/spring-jdbc-4.3.3.RELEASE.jar
08-Nov-2018 19:51:58 [INFO] Downloading: http://repo.spring.io/libs-snapshot-local/com/fasterxml/jackson/datatype/jackson-datatype-jsr310/2.8.3/jackson-datatype-jsr310-2.8.3.jar
08-Nov-2018 19:51:58 [INFO] Downloaded: http://repo.spring.io/libs-snapshot-local/org/springframework/cloud/spring-cloud-dataflow-rest-resource/1.7.0.BUILD-SNAPSHOT/spring-cloud-dataflow-rest-resource-1.7.0.BUILD-20181023.141453-130.jar (69 KB at 56.8 KB/sec)
08-Nov-2018 19:51:58 [INFO] Downloading: http://repo.spring.io/libs-snapshot-local/org/springframework/cloud/spring-cloud-scheduler-spi/1.0.1.RELEASE/spring-cloud-scheduler-spi-1.0.1.RELEASE.jar
08-Nov-2018 19:51:58 [INFO] Downloading: http://repo.spring.io/libs-snapshot-local/com/vdurmont/semver4j/2.2.0/semver4j-2.2.0.jar
08-Nov-2018 19:51:58 [INFO] Downloading: http://repo.spring.io/libs-snapshot-local/org/springframework/cloud/spring-cloud-dataflow-core/1.7.0.BUILD-SNAPSHOT/spring-cloud-dataflow-core-1.7.0.BUILD-20181023.141453-130.jar
08-Nov-2018 19:51:58 [INFO] Downloading: http://repo.spring.io/libs-snapshot-local/org/springframework/cloud/spring-cloud-deployer-spi/1.3.4.RELEASE/spring-cloud-deployer-spi-1.3.4.RELEASE.jar
08-Nov-2018 19:51:58 [INFO] Downloaded: http://repo.spring.io/libs-snapshot-local/org/springframework/cloud/spring-cloud-dataflow-core/1.7.0.BUILD-SNAPSHOT/spring-cloud-dataflow-core-1.7.0.BUILD-20181023.141453-130.jar (112 KB at 68.0 KB/sec)
08-Nov-2018 19:51:58 [INFO] Downloading: http://repo.spring.io/libs-milestone-local/org/springframework/boot/spring-boot-starter-validation/1.4.1.RELEASE/spring-boot-starter-validation-1.4.1.RELEASE.jar
08-Nov-2018 19:51:58 [INFO] Downloading: http://repo.spring.io/libs-milestone-local/org/springframework/cloud/stream/app/app-starters-test-support/1.3.3.RELEASE/app-starters-test-support-1.3.3.RELEASE.jar
08-Nov-2018 19:51:58 [INFO] Downloading: http://repo.spring.io/libs-milestone-local/org/hamcrest/hamcrest-all/1.3/hamcrest-all-1.3.jar
08-Nov-2018 19:51:58 [INFO] Downloading: http://repo.spring.io/libs-milestone-local/org/springframework/integration/spring-integration-test/4.3.2.RELEASE/spring-integration-test-4.3.2.RELEASE.jar
08-Nov-2018 19:51:58 [INFO] Downloading: http://repo.spring.io/libs-milestone-local/org/springframework/spring-messaging/4.3.3.RELEASE/spring-messaging-4.3.3.RELEASE.jar
08-Nov-2018 19:51:58 [INFO] Downloading: http://repo.spring.io/libs-milestone-local/org/springframework/cloud/spring-cloud-stream-test-support-internal/1.3.1.RELEASE/spring-cloud-stream-test-support-internal-1.3.1.RELEASE.jar
08-Nov-2018 19:51:58 [INFO] Downloading: http://repo.spring.io/libs-milestone-local/org/springframework/cloud/spring-cloud-stream/1.3.1.RELEASE/spring-cloud-stream-1.3.1.RELEASE.jar
08-Nov-2018 19:51:58 [INFO] Downloading: http://repo.spring.io/libs-milestone-local/org/springframework/boot/spring-boot-starter-actuator/1.4.1.RELEASE/spring-boot-starter-actuator-1.4.1.RELEASE.jar
08-Nov-2018 19:51:58 [INFO] Downloading: http://repo.spring.io/libs-milestone-local/org/springframework/boot/spring-boot-actuator/1.4.1.RELEASE/spring-boot-actuator-1.4.1.RELEASE.jar
08-Nov-2018 19:51:58 [INFO] Downloading: http://repo.spring.io/libs-milestone-local/org/springframework/integration/spring-integration-core/4.3.2.RELEASE/spring-integration-core-4.3.2.RELEASE.jar
08-Nov-2018 19:51:58 [INFO] Downloading: http://repo.spring.io/libs-milestone-local/org/springframework/integration/spring-integration-jmx/4.3.2.RELEASE/spring-integration-jmx-4.3.2.RELEASE.jar
08-Nov-2018 19:51:58 [INFO] Downloading: http://repo.spring.io/libs-milestone-local/org/springframework/retry/spring-retry/1.1.4.RELEASE/spring-retry-1.1.4.RELEASE.jar
08-Nov-2018 19:51:58 [INFO] Downloading: http://repo.spring.io/libs-milestone-local/org/springframework/cloud/spring-cloud-stream-metrics/1.3.1.RELEASE/spring-cloud-stream-metrics-1.3.1.RELEASE.jar
08-Nov-2018 19:51:58 [INFO] Downloading: http://repo.spring.io/libs-milestone-local/org/springframework/integration/spring-integration-xml/4.3.2.RELEASE/spring-integration-xml-4.3.2.RELEASE.jar
08-Nov-2018 19:51:58 [INFO] Downloading: http://repo.spring.io/libs-milestone-local/org/springframework/spring-oxm/4.3.3.RELEASE/spring-oxm-4.3.3.RELEASE.jar
08-Nov-2018 19:51:59 [INFO] Downloading: http://repo.spring.io/libs-milestone-local/org/springframework/ws/spring-xml/2.3.0.RELEASE/spring-xml-2.3.0.RELEASE.jar
08-Nov-2018 19:51:59 [INFO] Downloading: http://repo.spring.io/libs-milestone-local/org/springframework/boot/spring-boot-starter-security/1.4.1.RELEASE/spring-boot-starter-security-1.4.1.RELEASE.jar
08-Nov-2018 19:51:59 [INFO] Downloading: http://repo.spring.io/libs-milestone-local/org/springframework/security/spring-security-core/4.1.3.RELEASE/spring-security-core-4.1.3.RELEASE.jar
08-Nov-2018 19:51:59 [INFO] Downloading: http://repo.spring.io/libs-milestone-local/org/springframework/security/spring-security-web/4.1.3.RELEASE/spring-security-web-4.1.3.RELEASE.jar
08-Nov-2018 19:51:59 [INFO] Downloading: http://repo.spring.io/libs-milestone-local/org/springframework/security/spring-security-config/4.1.3.RELEASE/spring-security-config-4.1.3.RELEASE.jar
08-Nov-2018 19:51:59 [INFO] Downloading: http://repo.spring.io/libs-milestone-local/io/pivotal/spring/cloud/spring-cloud-services-starter-config-client/1.5.0.RELEASE/spring-cloud-services-starter-config-client-1.5.0.RELEASE.jar
08-Nov-2018 19:51:59 [INFO] Downloading: http://repo.spring.io/libs-milestone-local/org/springframework/cloud/spring-cloud-config-client/1.3.1.RELEASE/spring-cloud-config-client-1.3.1.RELEASE.jar
08-Nov-2018 19:51:59 [INFO] Downloading: http://repo.spring.io/libs-milestone-local/org/springframework/cloud/spring-cloud-commons/1.2.2.RELEASE/spring-cloud-commons-1.2.2.RELEASE.jar
08-Nov-2018 19:51:59 [INFO] Downloading: http://repo.spring.io/libs-milestone-local/org/springframework/security/spring-security-crypto/4.1.3.RELEASE/spring-security-crypto-4.1.3.RELEASE.jar
08-Nov-2018 19:51:59 [INFO] Downloading: http://repo.spring.io/libs-milestone-local/org/springframework/cloud/spring-cloud-context/1.2.2.RELEASE/spring-cloud-context-1.2.2.RELEASE.jar
08-Nov-2018 19:51:59 [INFO] Downloading: http://repo.spring.io/libs-milestone-local/org/springframework/security/oauth/spring-security-oauth2/2.0.11.RELEASE/spring-security-oauth2-2.0.11.RELEASE.jar
08-Nov-2018 19:51:59 [INFO] Downloading: http://repo.spring.io/libs-milestone-local/org/codehaus/jackson/jackson-mapper-asl/1.9.13/jackson-mapper-asl-1.9.13.jar
08-Nov-2018 19:51:59 [INFO] Downloading: http://repo.spring.io/libs-milestone-local/org/codehaus/jackson/jackson-core-asl/1.9.13/jackson-core-asl-1.9.13.jar
08-Nov-2018 19:51:59 [INFO] Downloading: http://repo.spring.io/libs-milestone-local/io/pivotal/spring/cloud/spring-cloud-services-cloudfoundry-connector/1.5.0.RELEASE/spring-cloud-services-cloudfoundry-connector-1.5.0.RELEASE.jar
08-Nov-2018 19:51:59 [INFO] Downloading: http://repo.spring.io/libs-milestone-local/io/pivotal/spring/cloud/spring-cloud-services-connector-core/1.5.0.RELEASE/spring-cloud-services-connector-core-1.5.0.RELEASE.jar
08-Nov-2018 19:51:59 [INFO] Downloading: http://repo.spring.io/libs-milestone-local/org/springframework/cloud/spring-cloud-core/1.2.3.RELEASE/spring-cloud-core-1.2.3.RELEASE.jar
08-Nov-2018 19:51:59 [INFO] Downloading: http://repo.spring.io/libs-milestone-local/org/springframework/cloud/spring-cloud-cloudfoundry-connector/1.2.3.RELEASE/spring-cloud-cloudfoundry-connector-1.2.3.RELEASE.jar
08-Nov-2018 19:51:59 [INFO] Downloading: http://repo.spring.io/libs-milestone-local/io/pivotal/spring/cloud/spring-cloud-services-spring-connector/1.5.0.RELEASE/spring-cloud-services-spring-connector-1.5.0.RELEASE.jar
08-Nov-2018 19:51:59 [INFO] Downloading: http://repo.spring.io/libs-milestone-local/org/projectlombok/lombok/1.16.10/lombok-1.16.10.jar
08-Nov-2018 19:51:59 [INFO] Downloading: http://repo.spring.io/libs-milestone-local/org/springframework/cloud/spring-cloud-spring-service-connector/1.2.3.RELEASE/spring-cloud-spring-service-connector-1.2.3.RELEASE.jar
08-Nov-2018 19:51:59 [INFO] Downloading: http://repo.spring.io/libs-milestone-local/io/pivotal/spring/cloud/cloudfoundry-certificate-truster/1.0.1.RELEASE/cloudfoundry-certificate-truster-1.0.1.RELEASE.jar
08-Nov-2018 19:51:59 [INFO] Downloading: http://repo.spring.io/libs-milestone-local/io/micrometer/micrometer-spring-legacy/1.0.3/micrometer-spring-legacy-1.0.3.jar
08-Nov-2018 19:51:59 [INFO] Downloading: http://repo.spring.io/libs-milestone-local/io/micrometer/micrometer-core/1.0.3/micrometer-core-1.0.3.jar
08-Nov-2018 19:51:59 [INFO] Downloading: http://repo.spring.io/libs-milestone-local/org/springframework/boot/spring-boot-starter-data-redis/1.4.1.RELEASE/spring-boot-starter-data-redis-1.4.1.RELEASE.jar
08-Nov-2018 19:51:59 [INFO] Downloading: http://repo.spring.io/libs-milestone-local/org/springframework/data/spring-data-redis/1.7.3.RELEASE/spring-data-redis-1.7.3.RELEASE.jar
08-Nov-2018 19:51:59 [INFO] Downloading: http://repo.spring.io/libs-milestone-local/org/springframework/data/spring-data-keyvalue/1.1.3.RELEASE/spring-data-keyvalue-1.1.3.RELEASE.jar
08-Nov-2018 19:51:59 [INFO] Downloading: http://repo.spring.io/libs-milestone-local/org/springframework/spring-tx/4.3.3.RELEASE/spring-tx-4.3.3.RELEASE.jar
08-Nov-2018 19:51:59 [INFO] Downloading: http://repo.spring.io/libs-milestone-local/org/springframework/spring-context-support/4.3.3.RELEASE/spring-context-support-4.3.3.RELEASE.jar
08-Nov-2018 19:51:59 [INFO] Downloading: http://repo.spring.io/libs-milestone-local/redis/clients/jedis/2.8.1/jedis-2.8.1.jar
08-Nov-2018 19:51:59 [INFO] Downloading: http://repo.spring.io/libs-milestone-local/org/apache/commons/commons-pool2/2.4.2/commons-pool2-2.4.2.jar
08-Nov-2018 19:51:59 [INFO] Downloading: http://repo.spring.io/libs-milestone-local/org/springframework/spring-web/4.3.4.RELEASE/spring-web-4.3.4.RELEASE.jar
08-Nov-2018 19:51:59 [INFO] Downloading: http://repo.spring.io/libs-milestone-local/org/springframework/plugin/spring-plugin-core/1.2.0.RELEASE/spring-plugin-core-1.2.0.RELEASE.jar
08-Nov-2018 19:51:59 [INFO] Downloading: http://repo.spring.io/libs-milestone-local/joda-time/joda-time/2.9.4/joda-time-2.9.4.jar
08-Nov-2018 19:51:59 [INFO] Downloading: http://repo.spring.io/libs-milestone-local/org/springframework/analytics/spring-analytics/1.1.3.RELEASE/spring-analytics-1.1.3.RELEASE.jar
08-Nov-2018 19:51:59 [INFO] Downloading: http://repo.spring.io/libs-milestone-local/org/springframework/hateoas/spring-hateoas/0.20.0.RELEASE/spring-hateoas-0.20.0.RELEASE.jar
08-Nov-2018 19:51:59 [INFO] Downloading: http://repo.spring.io/libs-milestone-local/org/springframework/data/spring-data-commons/1.12.3.RELEASE/spring-data-commons-1.12.3.RELEASE.jar
08-Nov-2018 19:51:59 [INFO] Downloading: http://repo.spring.io/libs-milestone-local/org/springframework/cloud/spring-cloud-skipper/1.1.0.RELEASE/spring-cloud-skipper-1.1.0.RELEASE.jar
08-Nov-2018 19:51:59 [INFO] Downloading: http://repo.spring.io/libs-milestone-local/com/fasterxml/jackson/dataformat/jackson-dataformat-yaml/2.8.3/jackson-dataformat-yaml-2.8.3.jar
08-Nov-2018 19:51:59 [INFO] Downloading: http://repo.spring.io/libs-milestone-local/org/zeroturnaround/zt-zip/1.11/zt-zip-1.11.jar
08-Nov-2018 19:51:59 [INFO] Downloading: http://repo.spring.io/libs-milestone-local/org/springframework/boot/spring-boot-configuration-metadata/1.4.1.RELEASE/spring-boot-configuration-metadata-1.4.1.RELEASE.jar
08-Nov-2018 19:51:59 [INFO] Downloading: http://repo.spring.io/libs-milestone-local/org/springframework/batch/spring-batch-core/3.0.7.RELEASE/spring-batch-core-3.0.7.RELEASE.jar
08-Nov-2018 19:51:59 [INFO] Downloading: http://repo.spring.io/libs-milestone-local/com/ibm/jbatch/com.ibm.jbatch-tck-spi/1.0/com.ibm.jbatch-tck-spi-1.0.jar
08-Nov-2018 19:51:59 [INFO] Downloading: http://repo.spring.io/libs-milestone-local/javax/batch/javax.batch-api/1.0/javax.batch-api-1.0.jar
08-Nov-2018 19:51:59 [INFO] Downloading: http://repo.spring.io/libs-milestone-local/com/thoughtworks/xstream/xstream/1.4.7/xstream-1.4.7.jar
08-Nov-2018 19:51:59 [INFO] Downloading: http://repo.spring.io/libs-milestone-local/xmlpull/xmlpull/1.1.3.1/xmlpull-1.1.3.1.jar
08-Nov-2018 19:51:59 [INFO] Downloading: http://repo.spring.io/libs-milestone-local/xpp3/xpp3_min/1.1.4c/xpp3_min-1.1.4c.jar
08-Nov-2018 19:51:59 [INFO] Downloading: http://repo.spring.io/libs-milestone-local/org/codehaus/jettison/jettison/1.2/jettison-1.2.jar
08-Nov-2018 19:51:59 [INFO] Downloading: http://repo.spring.io/libs-milestone-local/org/springframework/batch/spring-batch-infrastructure/3.0.7.RELEASE/spring-batch-infrastructure-3.0.7.RELEASE.jar
08-Nov-2018 19:51:59 [INFO] Downloading: http://repo.spring.io/libs-milestone-local/org/springframework/cloud/spring-cloud-task-core/1.3.0.RELEASE/spring-cloud-task-core-1.3.0.RELEASE.jar
08-Nov-2018 19:51:59 [INFO] Downloading: http://repo.spring.io/libs-milestone-local/org/springframework/cloud/spring-cloud-deployer-resource-support/1.2.1.RELEASE/spring-cloud-deployer-resource-support-1.2.1.RELEASE.jar
08-Nov-2018 19:51:59 [INFO] Downloading: http://repo.spring.io/libs-milestone-local/org/springframework/spring-jdbc/4.3.3.RELEASE/spring-jdbc-4.3.3.RELEASE.jar
08-Nov-2018 19:51:59 [INFO] Downloading: http://repo.spring.io/libs-milestone-local/com/fasterxml/jackson/datatype/jackson-datatype-jsr310/2.8.3/jackson-datatype-jsr310-2.8.3.jar
08-Nov-2018 19:51:59 [INFO] Downloading: http://repo.spring.io/libs-milestone-local/org/springframework/cloud/spring-cloud-scheduler-spi/1.0.1.RELEASE/spring-cloud-scheduler-spi-1.0.1.RELEASE.jar
08-Nov-2018 19:51:59 [INFO] Downloading: http://repo.spring.io/libs-milestone-local/com/vdurmont/semver4j/2.2.0/semver4j-2.2.0.jar
08-Nov-2018 19:51:59 [INFO] Downloading: http://repo.spring.io/libs-milestone-local/org/springframework/cloud/spring-cloud-deployer-spi/1.3.4.RELEASE/spring-cloud-deployer-spi-1.3.4.RELEASE.jar
08-Nov-2018 19:51:59 [INFO] Downloading: http://repo.spring.io/release/org/springframework/boot/spring-boot-starter-validation/1.4.1.RELEASE/spring-boot-starter-validation-1.4.1.RELEASE.jar
08-Nov-2018 19:51:59 [INFO] Downloading: http://repo.spring.io/release/org/springframework/cloud/stream/app/app-starters-test-support/1.3.3.RELEASE/app-starters-test-support-1.3.3.RELEASE.jar
08-Nov-2018 19:51:59 [INFO] Downloading: http://repo.spring.io/release/org/springframework/spring-messaging/4.3.3.RELEASE/spring-messaging-4.3.3.RELEASE.jar
08-Nov-2018 19:51:59 [INFO] Downloading: http://repo.spring.io/release/org/hamcrest/hamcrest-all/1.3/hamcrest-all-1.3.jar
08-Nov-2018 19:51:59 [INFO] Downloading: http://repo.spring.io/release/org/springframework/integration/spring-integration-test/4.3.2.RELEASE/spring-integration-test-4.3.2.RELEASE.jar
08-Nov-2018 19:52:00 [INFO] Downloading: http://repo.spring.io/release/org/springframework/cloud/spring-cloud-stream-test-support-internal/1.3.1.RELEASE/spring-cloud-stream-test-support-internal-1.3.1.RELEASE.jar
08-Nov-2018 19:52:00 [INFO] Downloaded: http://repo.spring.io/release/org/springframework/boot/spring-boot-starter-validation/1.4.1.RELEASE/spring-boot-starter-validation-1.4.1.RELEASE.jar (3 KB at 9.5 KB/sec)
08-Nov-2018 19:52:00 [INFO] Downloading: http://repo.spring.io/release/org/springframework/cloud/spring-cloud-stream/1.3.1.RELEASE/spring-cloud-stream-1.3.1.RELEASE.jar
08-Nov-2018 19:52:00 [INFO] Downloaded: http://repo.spring.io/release/org/springframework/integration/spring-integration-test/4.3.2.RELEASE/spring-integration-test-4.3.2.RELEASE.jar (38 KB at 131.5 KB/sec)
08-Nov-2018 19:52:00 [INFO] Downloading: http://repo.spring.io/release/org/springframework/boot/spring-boot-starter-actuator/1.4.1.RELEASE/spring-boot-starter-actuator-1.4.1.RELEASE.jar
08-Nov-2018 19:52:00 [INFO] Downloaded: http://repo.spring.io/release/org/springframework/cloud/stream/app/app-starters-test-support/1.3.3.RELEASE/app-starters-test-support-1.3.3.RELEASE.jar (11 KB at 32.0 KB/sec)
08-Nov-2018 19:52:00 [INFO] Downloading: http://repo.spring.io/release/org/springframework/boot/spring-boot-actuator/1.4.1.RELEASE/spring-boot-actuator-1.4.1.RELEASE.jar
08-Nov-2018 19:52:00 [INFO] Downloaded: http://repo.spring.io/release/org/springframework/cloud/spring-cloud-stream-test-support-internal/1.3.1.RELEASE/spring-cloud-stream-test-support-internal-1.3.1.RELEASE.jar (7 KB at 19.4 KB/sec)
08-Nov-2018 19:52:00 [INFO] Downloading: http://repo.spring.io/release/org/springframework/integration/spring-integration-core/4.3.2.RELEASE/spring-integration-core-4.3.2.RELEASE.jar
08-Nov-2018 19:52:00 [INFO] Downloaded: http://repo.spring.io/release/org/springframework/boot/spring-boot-starter-actuator/1.4.1.RELEASE/spring-boot-starter-actuator-1.4.1.RELEASE.jar (3 KB at 5.1 KB/sec)
08-Nov-2018 19:52:00 [INFO] Downloading: http://repo.spring.io/release/org/springframework/integration/spring-integration-jmx/4.3.2.RELEASE/spring-integration-jmx-4.3.2.RELEASE.jar
08-Nov-2018 19:52:00 [INFO] Downloaded: http://repo.spring.io/release/org/springframework/integration/spring-integration-jmx/4.3.2.RELEASE/spring-integration-jmx-4.3.2.RELEASE.jar (61 KB at 87.3 KB/sec)
08-Nov-2018 19:52:00 [INFO] Downloading: http://repo.spring.io/release/org/springframework/retry/spring-retry/1.1.4.RELEASE/spring-retry-1.1.4.RELEASE.jar
08-Nov-2018 19:52:00 [INFO] Downloaded: http://repo.spring.io/release/org/springframework/spring-messaging/4.3.3.RELEASE/spring-messaging-4.3.3.RELEASE.jar (373 KB at 487.9 KB/sec)
08-Nov-2018 19:52:00 [INFO] Downloading: http://repo.spring.io/release/org/springframework/cloud/spring-cloud-stream-metrics/1.3.1.RELEASE/spring-cloud-stream-metrics-1.3.1.RELEASE.jar
08-Nov-2018 19:52:00 [INFO] Downloaded: http://repo.spring.io/release/org/springframework/cloud/spring-cloud-stream/1.3.1.RELEASE/spring-cloud-stream-1.3.1.RELEASE.jar (196 KB at 253.2 KB/sec)
08-Nov-2018 19:52:00 [INFO] Downloading: http://repo.spring.io/release/org/springframework/integration/spring-integration-xml/4.3.2.RELEASE/spring-integration-xml-4.3.2.RELEASE.jar
08-Nov-2018 19:52:00 [INFO] Downloaded: http://repo.spring.io/release/org/springframework/retry/spring-retry/1.1.4.RELEASE/spring-retry-1.1.4.RELEASE.jar (110 KB at 109.5 KB/sec)
08-Nov-2018 19:52:00 [INFO] Downloading: http://repo.spring.io/release/org/springframework/spring-oxm/4.3.3.RELEASE/spring-oxm-4.3.3.RELEASE.jar
08-Nov-2018 19:52:01 [INFO] Downloaded: http://repo.spring.io/release/org/springframework/cloud/spring-cloud-stream-metrics/1.3.1.RELEASE/spring-cloud-stream-metrics-1.3.1.RELEASE.jar (20 KB at 19.6 KB/sec)
08-Nov-2018 19:52:01 [INFO] Downloading: http://repo.spring.io/release/org/springframework/ws/spring-xml/2.3.0.RELEASE/spring-xml-2.3.0.RELEASE.jar
08-Nov-2018 19:52:01 [INFO] Downloaded: http://repo.spring.io/release/org/springframework/integration/spring-integration-xml/4.3.2.RELEASE/spring-integration-xml-4.3.2.RELEASE.jar (78 KB at 69.0 KB/sec)
08-Nov-2018 19:52:01 [INFO] Downloading: http://repo.spring.io/release/org/springframework/boot/spring-boot-starter-security/1.4.1.RELEASE/spring-boot-starter-security-1.4.1.RELEASE.jar
08-Nov-2018 19:52:01 [INFO] Downloaded: http://repo.spring.io/release/org/springframework/boot/spring-boot-actuator/1.4.1.RELEASE/spring-boot-actuator-1.4.1.RELEASE.jar (467 KB at 395.1 KB/sec)
08-Nov-2018 19:52:01 [INFO] Downloading: http://repo.spring.io/release/org/springframework/security/spring-security-config/4.1.3.RELEASE/spring-security-config-4.1.3.RELEASE.jar
08-Nov-2018 19:52:01 [INFO] Downloaded: http://repo.spring.io/release/org/springframework/boot/spring-boot-starter-security/1.4.1.RELEASE/spring-boot-starter-security-1.4.1.RELEASE.jar (3 KB at 1.7 KB/sec)
08-Nov-2018 19:52:01 [INFO] Downloading: http://repo.spring.io/release/org/springframework/security/spring-security-core/4.1.3.RELEASE/spring-security-core-4.1.3.RELEASE.jar
08-Nov-2018 19:52:01 [INFO] Downloaded: http://repo.spring.io/release/org/springframework/ws/spring-xml/2.3.0.RELEASE/spring-xml-2.3.0.RELEASE.jar (66 KB at 49.8 KB/sec)
08-Nov-2018 19:52:01 [INFO] Downloading: http://repo.spring.io/release/org/springframework/security/spring-security-web/4.1.3.RELEASE/spring-security-web-4.1.3.RELEASE.jar
08-Nov-2018 19:52:01 [INFO] Downloaded: http://repo.spring.io/release/org/springframework/spring-oxm/4.3.3.RELEASE/spring-oxm-4.3.3.RELEASE.jar (84 KB at 61.8 KB/sec)
08-Nov-2018 19:52:01 [INFO] Downloading: http://repo.spring.io/release/io/pivotal/spring/cloud/spring-cloud-services-starter-config-client/1.5.0.RELEASE/spring-cloud-services-starter-config-client-1.5.0.RELEASE.jar
08-Nov-2018 19:52:01 [INFO] Downloaded: http://repo.spring.io/release/io/pivotal/spring/cloud/spring-cloud-services-starter-config-client/1.5.0.RELEASE/spring-cloud-services-starter-config-client-1.5.0.RELEASE.jar (3 KB at 1.3 KB/sec)
08-Nov-2018 19:52:01 [INFO] Downloading: http://repo.spring.io/release/org/springframework/cloud/spring-cloud-config-client/1.3.1.RELEASE/spring-cloud-config-client-1.3.1.RELEASE.jar
08-Nov-2018 19:52:01 [INFO] Downloaded: http://repo.spring.io/release/org/springframework/cloud/spring-cloud-config-client/1.3.1.RELEASE/spring-cloud-config-client-1.3.1.RELEASE.jar (33 KB at 17.8 KB/sec)
08-Nov-2018 19:52:01 [INFO] Downloading: http://repo.spring.io/release/org/springframework/cloud/spring-cloud-commons/1.2.2.RELEASE/spring-cloud-commons-1.2.2.RELEASE.jar
08-Nov-2018 19:52:01 [INFO] Downloaded: http://repo.spring.io/release/org/springframework/security/spring-security-core/4.1.3.RELEASE/spring-security-core-4.1.3.RELEASE.jar (368 KB at 187.0 KB/sec)
08-Nov-2018 19:52:01 [INFO] Downloading: http://repo.spring.io/release/org/springframework/security/spring-security-crypto/4.1.3.RELEASE/spring-security-crypto-4.1.3.RELEASE.jar
08-Nov-2018 19:52:02 [INFO] Downloaded: http://repo.spring.io/release/org/springframework/security/spring-security-web/4.1.3.RELEASE/spring-security-web-4.1.3.RELEASE.jar (352 KB at 171.4 KB/sec)
08-Nov-2018 19:52:02 [INFO] Downloading: http://repo.spring.io/release/org/springframework/cloud/spring-cloud-context/1.2.2.RELEASE/spring-cloud-context-1.2.2.RELEASE.jar
08-Nov-2018 19:52:02 [INFO] Downloaded: http://repo.spring.io/release/org/springframework/integration/spring-integration-core/4.3.2.RELEASE/spring-integration-core-4.3.2.RELEASE.jar (1035 KB at 498.9 KB/sec)
08-Nov-2018 19:52:02 [INFO] Downloading: http://repo.spring.io/release/org/springframework/security/oauth/spring-security-oauth2/2.0.11.RELEASE/spring-security-oauth2-2.0.11.RELEASE.jar
08-Nov-2018 19:52:02 [INFO] Downloaded: http://repo.spring.io/release/org/springframework/cloud/spring-cloud-commons/1.2.2.RELEASE/spring-cloud-commons-1.2.2.RELEASE.jar (108 KB at 50.5 KB/sec)
08-Nov-2018 19:52:02 [INFO] Downloading: http://repo.spring.io/release/org/codehaus/jackson/jackson-mapper-asl/1.9.13/jackson-mapper-asl-1.9.13.jar
08-Nov-2018 19:52:02 [INFO] Downloaded: http://repo.spring.io/release/org/springframework/security/spring-security-config/4.1.3.RELEASE/spring-security-config-4.1.3.RELEASE.jar (533 KB at 239.4 KB/sec)
08-Nov-2018 19:52:02 [INFO] Downloading: http://repo.spring.io/release/org/codehaus/jackson/jackson-core-asl/1.9.13/jackson-core-asl-1.9.13.jar
08-Nov-2018 19:52:02 [INFO] Downloading: http://repo.spring.io/release/io/pivotal/spring/cloud/spring-cloud-services-cloudfoundry-connector/1.5.0.RELEASE/spring-cloud-services-cloudfoundry-connector-1.5.0.RELEASE.jar
08-Nov-2018 19:52:02 [INFO] Downloaded: http://repo.spring.io/release/org/springframework/security/spring-security-crypto/4.1.3.RELEASE/spring-security-crypto-4.1.3.RELEASE.jar (54 KB at 23.5 KB/sec)
08-Nov-2018 19:52:02 [INFO] Downloading: http://repo.spring.io/release/io/pivotal/spring/cloud/spring-cloud-services-connector-core/1.5.0.RELEASE/spring-cloud-services-connector-core-1.5.0.RELEASE.jar
08-Nov-2018 19:52:02 [INFO] Downloading: http://repo.spring.io/release/org/springframework/cloud/spring-cloud-core/1.2.3.RELEASE/spring-cloud-core-1.2.3.RELEASE.jar
08-Nov-2018 19:52:02 [INFO] Downloaded: http://repo.spring.io/release/org/springframework/cloud/spring-cloud-context/1.2.2.RELEASE/spring-cloud-context-1.2.2.RELEASE.jar (96 KB at 40.4 KB/sec)
08-Nov-2018 19:52:02 [INFO] Downloading: http://repo.spring.io/release/org/springframework/cloud/spring-cloud-cloudfoundry-connector/1.2.3.RELEASE/spring-cloud-cloudfoundry-connector-1.2.3.RELEASE.jar
08-Nov-2018 19:52:02 [INFO] Downloaded: http://repo.spring.io/release/io/pivotal/spring/cloud/spring-cloud-services-cloudfoundry-connector/1.5.0.RELEASE/spring-cloud-services-cloudfoundry-connector-1.5.0.RELEASE.jar (10 KB at 3.8 KB/sec)
08-Nov-2018 19:52:02 [INFO] Downloading: http://repo.spring.io/release/io/pivotal/spring/cloud/spring-cloud-services-spring-connector/1.5.0.RELEASE/spring-cloud-services-spring-connector-1.5.0.RELEASE.jar
08-Nov-2018 19:52:02 [INFO] Downloaded: http://repo.spring.io/release/io/pivotal/spring/cloud/spring-cloud-services-connector-core/1.5.0.RELEASE/spring-cloud-services-connector-core-1.5.0.RELEASE.jar (9 KB at 3.4 KB/sec)
08-Nov-2018 19:52:02 [INFO] Downloading: http://repo.spring.io/release/org/projectlombok/lombok/1.16.10/lombok-1.16.10.jar
08-Nov-2018 19:52:02 [INFO] Downloaded: http://repo.spring.io/release/org/springframework/cloud/spring-cloud-core/1.2.3.RELEASE/spring-cloud-core-1.2.3.RELEASE.jar (41 KB at 15.1 KB/sec)
08-Nov-2018 19:52:02 [INFO] Downloading: http://repo.spring.io/release/org/springframework/cloud/spring-cloud-spring-service-connector/1.2.3.RELEASE/spring-cloud-spring-service-connector-1.2.3.RELEASE.jar
08-Nov-2018 19:52:02 [INFO] Downloading: http://repo.spring.io/release/io/pivotal/spring/cloud/cloudfoundry-certificate-truster/1.0.1.RELEASE/cloudfoundry-certificate-truster-1.0.1.RELEASE.jar
08-Nov-2018 19:52:02 [INFO] Downloaded: http://repo.spring.io/release/io/pivotal/spring/cloud/spring-cloud-services-spring-connector/1.5.0.RELEASE/spring-cloud-services-spring-connector-1.5.0.RELEASE.jar (33 KB at 12.1 KB/sec)
08-Nov-2018 19:52:02 [INFO] Downloading: http://repo.spring.io/release/io/micrometer/micrometer-spring-legacy/1.0.3/micrometer-spring-legacy-1.0.3.jar
08-Nov-2018 19:52:02 [INFO] Downloading: http://repo.spring.io/release/io/micrometer/micrometer-core/1.0.3/micrometer-core-1.0.3.jar
08-Nov-2018 19:52:02 [INFO] Downloading: http://repo.spring.io/release/org/springframework/boot/spring-boot-starter-data-redis/1.4.1.RELEASE/spring-boot-starter-data-redis-1.4.1.RELEASE.jar
08-Nov-2018 19:52:02 [INFO] Downloaded: http://repo.spring.io/release/io/pivotal/spring/cloud/cloudfoundry-certificate-truster/1.0.1.RELEASE/cloudfoundry-certificate-truster-1.0.1.RELEASE.jar (14 KB at 4.7 KB/sec)
08-Nov-2018 19:52:02 [INFO] Downloading: http://repo.spring.io/release/org/springframework/data/spring-data-redis/1.7.3.RELEASE/spring-data-redis-1.7.3.RELEASE.jar
08-Nov-2018 19:52:02 [INFO] Downloaded: http://repo.spring.io/release/org/springframework/security/oauth/spring-security-oauth2/2.0.11.RELEASE/spring-security-oauth2-2.0.11.RELEASE.jar (443 KB at 148.8 KB/sec)
08-Nov-2018 19:52:02 [INFO] Downloading: http://repo.spring.io/release/org/springframework/data/spring-data-keyvalue/1.1.3.RELEASE/spring-data-keyvalue-1.1.3.RELEASE.jar
08-Nov-2018 19:52:03 [INFO] Downloaded: http://repo.spring.io/release/org/springframework/boot/spring-boot-starter-data-redis/1.4.1.RELEASE/spring-boot-starter-data-redis-1.4.1.RELEASE.jar (3 KB at 0.8 KB/sec)
08-Nov-2018 19:52:03 [INFO] Downloading: http://repo.spring.io/release/org/springframework/spring-tx/4.3.3.RELEASE/spring-tx-4.3.3.RELEASE.jar
08-Nov-2018 19:52:03 [INFO] Downloaded: http://repo.spring.io/release/org/springframework/cloud/spring-cloud-spring-service-connector/1.2.3.RELEASE/spring-cloud-spring-service-connector-1.2.3.RELEASE.jar (73 KB at 23.3 KB/sec)
08-Nov-2018 19:52:03 [INFO] Downloading: http://repo.spring.io/release/org/springframework/spring-context-support/4.3.3.RELEASE/spring-context-support-4.3.3.RELEASE.jar
08-Nov-2018 19:52:03 [INFO] Downloaded: http://repo.spring.io/release/org/springframework/data/spring-data-keyvalue/1.1.3.RELEASE/spring-data-keyvalue-1.1.3.RELEASE.jar (102 KB at 30.8 KB/sec)
08-Nov-2018 19:52:03 [INFO] Downloading: http://repo.spring.io/release/redis/clients/jedis/2.8.1/jedis-2.8.1.jar
08-Nov-2018 19:52:03 [INFO] Downloading: http://repo.spring.io/release/org/apache/commons/commons-pool2/2.4.2/commons-pool2-2.4.2.jar
08-Nov-2018 19:52:03 [INFO] Downloading: http://repo.spring.io/release/org/springframework/spring-web/4.3.4.RELEASE/spring-web-4.3.4.RELEASE.jar
08-Nov-2018 19:52:03 [INFO] Downloaded: http://repo.spring.io/release/org/springframework/spring-context-support/4.3.3.RELEASE/spring-context-support-4.3.3.RELEASE.jar (183 KB at 51.4 KB/sec)
08-Nov-2018 19:52:03 [INFO] Downloading: http://repo.spring.io/release/org/springframework/plugin/spring-plugin-core/1.2.0.RELEASE/spring-plugin-core-1.2.0.RELEASE.jar
08-Nov-2018 19:52:03 [INFO] Downloaded: http://repo.spring.io/release/org/springframework/spring-tx/4.3.3.RELEASE/spring-tx-4.3.3.RELEASE.jar (261 KB at 72.1 KB/sec)
08-Nov-2018 19:52:03 [INFO] Downloading: http://repo.spring.io/release/joda-time/joda-time/2.9.4/joda-time-2.9.4.jar
08-Nov-2018 19:52:03 [INFO] Downloading: http://repo.spring.io/release/org/springframework/analytics/spring-analytics/1.1.3.RELEASE/spring-analytics-1.1.3.RELEASE.jar
08-Nov-2018 19:52:03 [INFO] Downloaded: http://repo.spring.io/release/org/springframework/plugin/spring-plugin-core/1.2.0.RELEASE/spring-plugin-core-1.2.0.RELEASE.jar (20 KB at 5.1 KB/sec)
08-Nov-2018 19:52:03 [INFO] Downloading: http://repo.spring.io/release/org/springframework/hateoas/spring-hateoas/0.20.0.RELEASE/spring-hateoas-0.20.0.RELEASE.jar
08-Nov-2018 19:52:04 [INFO] Downloaded: http://repo.spring.io/release/org/springframework/analytics/spring-analytics/1.1.3.RELEASE/spring-analytics-1.1.3.RELEASE.jar (53 KB at 13.2 KB/sec)
08-Nov-2018 19:52:04 [INFO] Downloading: http://repo.spring.io/release/org/springframework/data/spring-data-commons/1.12.3.RELEASE/spring-data-commons-1.12.3.RELEASE.jar
08-Nov-2018 19:52:04 [INFO] Downloaded: http://repo.spring.io/release/org/springframework/hateoas/spring-hateoas/0.20.0.RELEASE/spring-hateoas-0.20.0.RELEASE.jar (188 KB at 44.1 KB/sec)
08-Nov-2018 19:52:04 [INFO] Downloading: http://repo.spring.io/release/org/springframework/cloud/spring-cloud-skipper/1.1.0.RELEASE/spring-cloud-skipper-1.1.0.RELEASE.jar
08-Nov-2018 19:52:04 [INFO] Downloaded: http://repo.spring.io/release/org/springframework/cloud/spring-cloud-cloudfoundry-connector/1.2.3.RELEASE/spring-cloud-cloudfoundry-connector-1.2.3.RELEASE.jar (1223 KB at 268.7 KB/sec)
08-Nov-2018 19:52:04 [INFO] Downloading: http://repo.spring.io/release/com/fasterxml/jackson/dataformat/jackson-dataformat-yaml/2.8.3/jackson-dataformat-yaml-2.8.3.jar
08-Nov-2018 19:52:04 [INFO] Downloaded: http://repo.spring.io/release/org/springframework/cloud/spring-cloud-skipper/1.1.0.RELEASE/spring-cloud-skipper-1.1.0.RELEASE.jar (99 KB at 21.4 KB/sec)
08-Nov-2018 19:52:04 [INFO] Downloading: http://repo.spring.io/release/org/zeroturnaround/zt-zip/1.11/zt-zip-1.11.jar
08-Nov-2018 19:52:04 [INFO] Downloading: http://repo.spring.io/release/org/springframework/boot/spring-boot-configuration-metadata/1.4.1.RELEASE/spring-boot-configuration-metadata-1.4.1.RELEASE.jar
08-Nov-2018 19:52:04 [INFO] Downloading: http://repo.spring.io/release/org/springframework/batch/spring-batch-core/3.0.7.RELEASE/spring-batch-core-3.0.7.RELEASE.jar
08-Nov-2018 19:52:04 [INFO] Downloaded: http://repo.spring.io/release/org/springframework/spring-web/4.3.4.RELEASE/spring-web-4.3.4.RELEASE.jar (795 KB at 165.0 KB/sec)
08-Nov-2018 19:52:04 [INFO] Downloading: http://repo.spring.io/release/com/ibm/jbatch/com.ibm.jbatch-tck-spi/1.0/com.ibm.jbatch-tck-spi-1.0.jar
08-Nov-2018 19:52:04 [INFO] Downloaded: http://repo.spring.io/release/org/springframework/data/spring-data-redis/1.7.3.RELEASE/spring-data-redis-1.7.3.RELEASE.jar (1095 KB at 226.4 KB/sec)
08-Nov-2018 19:52:04 [INFO] Downloading: http://repo.spring.io/release/javax/batch/javax.batch-api/1.0/javax.batch-api-1.0.jar
08-Nov-2018 19:52:04 [INFO] Downloaded: http://repo.spring.io/release/org/springframework/boot/spring-boot-configuration-metadata/1.4.1.RELEASE/spring-boot-configuration-metadata-1.4.1.RELEASE.jar (23 KB at 4.6 KB/sec)
08-Nov-2018 19:52:04 [INFO] Downloading: http://repo.spring.io/release/com/thoughtworks/xstream/xstream/1.4.7/xstream-1.4.7.jar
08-Nov-2018 19:52:04 [INFO] Downloading: http://repo.spring.io/release/xmlpull/xmlpull/1.1.3.1/xmlpull-1.1.3.1.jar
08-Nov-2018 19:52:04 [INFO] Downloading: http://repo.spring.io/release/xpp3/xpp3_min/1.1.4c/xpp3_min-1.1.4c.jar
08-Nov-2018 19:52:04 [INFO] Downloading: http://repo.spring.io/release/org/codehaus/jettison/jettison/1.2/jettison-1.2.jar
08-Nov-2018 19:52:04 [INFO] Downloading: http://repo.spring.io/release/org/springframework/batch/spring-batch-infrastructure/3.0.7.RELEASE/spring-batch-infrastructure-3.0.7.RELEASE.jar
08-Nov-2018 19:52:04 [INFO] Downloading: http://repo.spring.io/release/org/springframework/cloud/spring-cloud-task-core/1.3.0.RELEASE/spring-cloud-task-core-1.3.0.RELEASE.jar
08-Nov-2018 19:52:05 [INFO] Downloading: http://repo.spring.io/release/org/springframework/cloud/spring-cloud-deployer-resource-support/1.2.1.RELEASE/spring-cloud-deployer-resource-support-1.2.1.RELEASE.jar
08-Nov-2018 19:52:05 [INFO] Downloaded: http://repo.spring.io/release/org/springframework/data/spring-data-commons/1.12.3.RELEASE/spring-data-commons-1.12.3.RELEASE.jar (677 KB at 129.3 KB/sec)
08-Nov-2018 19:52:05 [INFO] Downloading: http://repo.spring.io/release/org/springframework/spring-jdbc/4.3.3.RELEASE/spring-jdbc-4.3.3.RELEASE.jar
08-Nov-2018 19:52:05 [INFO] Downloaded: http://repo.spring.io/release/org/springframework/cloud/spring-cloud-deployer-resource-support/1.2.1.RELEASE/spring-cloud-deployer-resource-support-1.2.1.RELEASE.jar (12 KB at 2.2 KB/sec)
08-Nov-2018 19:52:05 [INFO] Downloading: http://repo.spring.io/release/com/fasterxml/jackson/datatype/jackson-datatype-jsr310/2.8.3/jackson-datatype-jsr310-2.8.3.jar
08-Nov-2018 19:52:05 [INFO] Downloading: http://repo.spring.io/release/org/springframework/cloud/spring-cloud-scheduler-spi/1.0.1.RELEASE/spring-cloud-scheduler-spi-1.0.1.RELEASE.jar
08-Nov-2018 19:52:05 [INFO] Downloaded: http://repo.spring.io/release/org/springframework/cloud/spring-cloud-task-core/1.3.0.RELEASE/spring-cloud-task-core-1.3.0.RELEASE.jar (86 KB at 15.7 KB/sec)
08-Nov-2018 19:52:05 [INFO] Downloading: http://repo.spring.io/release/com/vdurmont/semver4j/2.2.0/semver4j-2.2.0.jar
08-Nov-2018 19:52:05 [INFO] Downloading: http://repo.spring.io/release/org/springframework/cloud/spring-cloud-deployer-spi/1.3.4.RELEASE/spring-cloud-deployer-spi-1.3.4.RELEASE.jar
08-Nov-2018 19:52:05 [INFO] Downloaded: http://repo.spring.io/release/org/springframework/cloud/spring-cloud-scheduler-spi/1.0.1.RELEASE/spring-cloud-scheduler-spi-1.0.1.RELEASE.jar (12 KB at 2.1 KB/sec)
08-Nov-2018 19:52:05 [INFO] Downloaded: http://repo.spring.io/release/org/springframework/batch/spring-batch-infrastructure/3.0.7.RELEASE/spring-batch-infrastructure-3.0.7.RELEASE.jar (374 KB at 65.7 KB/sec)
08-Nov-2018 19:52:05 [INFO] Downloaded: http://repo.spring.io/release/org/springframework/cloud/spring-cloud-deployer-spi/1.3.4.RELEASE/spring-cloud-deployer-spi-1.3.4.RELEASE.jar (21 KB at 3.5 KB/sec)
08-Nov-2018 19:52:05 [INFO] Downloaded: http://repo.spring.io/release/org/springframework/batch/spring-batch-core/3.0.7.RELEASE/spring-batch-core-3.0.7.RELEASE.jar (773 KB at 128.9 KB/sec)
08-Nov-2018 19:52:06 [INFO] Downloaded: http://repo.spring.io/release/org/springframework/spring-jdbc/4.3.3.RELEASE/spring-jdbc-4.3.3.RELEASE.jar (417 KB at 69.0 KB/sec)
08-Nov-2018 19:52:06 [INFO] Downloading: https://repo.maven.apache.org/maven2/org/hamcrest/hamcrest-all/1.3/hamcrest-all-1.3.jar
08-Nov-2018 19:52:06 [INFO] Downloading: https://repo.maven.apache.org/maven2/org/codehaus/jackson/jackson-mapper-asl/1.9.13/jackson-mapper-asl-1.9.13.jar
08-Nov-2018 19:52:06 [INFO] Downloading: https://repo.maven.apache.org/maven2/org/projectlombok/lombok/1.16.10/lombok-1.16.10.jar
08-Nov-2018 19:52:06 [INFO] Downloading: https://repo.maven.apache.org/maven2/org/codehaus/jackson/jackson-core-asl/1.9.13/jackson-core-asl-1.9.13.jar
08-Nov-2018 19:52:06 [INFO] Downloading: https://repo.maven.apache.org/maven2/io/micrometer/micrometer-spring-legacy/1.0.3/micrometer-spring-legacy-1.0.3.jar
08-Nov-2018 19:52:06 [INFO] Downloaded: https://repo.maven.apache.org/maven2/org/hamcrest/hamcrest-all/1.3/hamcrest-all-1.3.jar (300 KB at 9356.0 KB/sec)
08-Nov-2018 19:52:06 [INFO] Downloading: https://repo.maven.apache.org/maven2/io/micrometer/micrometer-core/1.0.3/micrometer-core-1.0.3.jar
08-Nov-2018 19:52:06 [INFO] Downloaded: https://repo.maven.apache.org/maven2/org/codehaus/jackson/jackson-core-asl/1.9.13/jackson-core-asl-1.9.13.jar (227 KB at 5815.5 KB/sec)
08-Nov-2018 19:52:06 [INFO] Downloading: https://repo.maven.apache.org/maven2/redis/clients/jedis/2.8.1/jedis-2.8.1.jar
08-Nov-2018 19:52:06 [INFO] Downloaded: https://repo.maven.apache.org/maven2/io/micrometer/micrometer-core/1.0.3/micrometer-core-1.0.3.jar (296 KB at 5183.3 KB/sec)
08-Nov-2018 19:52:06 [INFO] Downloading: https://repo.maven.apache.org/maven2/org/apache/commons/commons-pool2/2.4.2/commons-pool2-2.4.2.jar
08-Nov-2018 19:52:06 [INFO] Downloaded: https://repo.maven.apache.org/maven2/org/apache/commons/commons-pool2/2.4.2/commons-pool2-2.4.2.jar (110 KB at 1104.5 KB/sec)
08-Nov-2018 19:52:06 [INFO] Downloading: https://repo.maven.apache.org/maven2/joda-time/joda-time/2.9.4/joda-time-2.9.4.jar
08-Nov-2018 19:52:06 [INFO] Downloaded: https://repo.maven.apache.org/maven2/io/micrometer/micrometer-spring-legacy/1.0.3/micrometer-spring-legacy-1.0.3.jar (134 KB at 1143.4 KB/sec)
08-Nov-2018 19:52:06 [INFO] Downloading: https://repo.maven.apache.org/maven2/com/fasterxml/jackson/dataformat/jackson-dataformat-yaml/2.8.3/jackson-dataformat-yaml-2.8.3.jar
08-Nov-2018 19:52:06 [INFO] Downloaded: https://repo.maven.apache.org/maven2/redis/clients/jedis/2.8.1/jedis-2.8.1.jar (527 KB at 4175.9 KB/sec)
08-Nov-2018 19:52:06 [INFO] Downloading: https://repo.maven.apache.org/maven2/org/zeroturnaround/zt-zip/1.11/zt-zip-1.11.jar
08-Nov-2018 19:52:06 [INFO] Downloaded: https://repo.maven.apache.org/maven2/com/fasterxml/jackson/dataformat/jackson-dataformat-yaml/2.8.3/jackson-dataformat-yaml-2.8.3.jar (40 KB at 309.0 KB/sec)
08-Nov-2018 19:52:06 [INFO] Downloading: https://repo.maven.apache.org/maven2/com/ibm/jbatch/com.ibm.jbatch-tck-spi/1.0/com.ibm.jbatch-tck-spi-1.0.jar
08-Nov-2018 19:52:06 [INFO] Downloaded: https://repo.maven.apache.org/maven2/org/codehaus/jackson/jackson-mapper-asl/1.9.13/jackson-mapper-asl-1.9.13.jar (763 KB at 5775.5 KB/sec)
08-Nov-2018 19:52:06 [INFO] Downloading: https://repo.maven.apache.org/maven2/javax/batch/javax.batch-api/1.0/javax.batch-api-1.0.jar
08-Nov-2018 19:52:06 [INFO] Downloaded: https://repo.maven.apache.org/maven2/com/ibm/jbatch/com.ibm.jbatch-tck-spi/1.0/com.ibm.jbatch-tck-spi-1.0.jar (4 KB at 27.2 KB/sec)
08-Nov-2018 19:52:06 [INFO] Downloading: https://repo.maven.apache.org/maven2/com/thoughtworks/xstream/xstream/1.4.7/xstream-1.4.7.jar
08-Nov-2018 19:52:06 [INFO] Downloaded: https://repo.maven.apache.org/maven2/javax/batch/javax.batch-api/1.0/javax.batch-api-1.0.jar (35 KB at 243.2 KB/sec)
08-Nov-2018 19:52:06 [INFO] Downloading: https://repo.maven.apache.org/maven2/xmlpull/xmlpull/1.1.3.1/xmlpull-1.1.3.1.jar
08-Nov-2018 19:52:06 [INFO] Downloaded: https://repo.maven.apache.org/maven2/joda-time/joda-time/2.9.4/joda-time-2.9.4.jar (615 KB at 4182.0 KB/sec)
08-Nov-2018 19:52:06 [INFO] Downloading: https://repo.maven.apache.org/maven2/xpp3/xpp3_min/1.1.4c/xpp3_min-1.1.4c.jar
08-Nov-2018 19:52:06 [INFO] Downloaded: https://repo.maven.apache.org/maven2/xmlpull/xmlpull/1.1.3.1/xmlpull-1.1.3.1.jar (8 KB at 47.1 KB/sec)
08-Nov-2018 19:52:06 [INFO] Downloading: https://repo.maven.apache.org/maven2/org/codehaus/jettison/jettison/1.2/jettison-1.2.jar
08-Nov-2018 19:52:06 [INFO] Downloaded: https://repo.maven.apache.org/maven2/org/zeroturnaround/zt-zip/1.11/zt-zip-1.11.jar (103 KB at 674.6 KB/sec)
08-Nov-2018 19:52:06 [INFO] Downloading: https://repo.maven.apache.org/maven2/com/fasterxml/jackson/datatype/jackson-datatype-jsr310/2.8.3/jackson-datatype-jsr310-2.8.3.jar
08-Nov-2018 19:52:06 [INFO] Downloaded: https://repo.maven.apache.org/maven2/org/projectlombok/lombok/1.16.10/lombok-1.16.10.jar (1368 KB at 8936.1 KB/sec)
08-Nov-2018 19:52:06 [INFO] Downloading: https://repo.maven.apache.org/maven2/com/vdurmont/semver4j/2.2.0/semver4j-2.2.0.jar
08-Nov-2018 19:52:06 [INFO] Downloaded: https://repo.maven.apache.org/maven2/org/codehaus/jettison/jettison/1.2/jettison-1.2.jar (71 KB at 436.9 KB/sec)
08-Nov-2018 19:52:06 [INFO] Downloaded: https://repo.maven.apache.org/maven2/xpp3/xpp3_min/1.1.4c/xpp3_min-1.1.4c.jar (25 KB at 149.5 KB/sec)
08-Nov-2018 19:52:06 [INFO] Downloaded: https://repo.maven.apache.org/maven2/com/vdurmont/semver4j/2.2.0/semver4j-2.2.0.jar (26 KB at 156.1 KB/sec)
08-Nov-2018 19:52:06 [INFO] Downloaded: https://repo.maven.apache.org/maven2/com/fasterxml/jackson/datatype/jackson-datatype-jsr310/2.8.3/jackson-datatype-jsr310-2.8.3.jar (89 KB at 509.6 KB/sec)
08-Nov-2018 19:52:06 [INFO] Downloaded: https://repo.maven.apache.org/maven2/com/thoughtworks/xstream/xstream/1.4.7/xstream-1.4.7.jar (520 KB at 2806.0 KB/sec)
08-Nov-2018 19:52:06 [INFO]
08-Nov-2018 19:52:06 [INFO] --- maven-checkstyle-plugin:2.17:check (checkstyle-validation) @ spring-cloud-dataflow-acceptance-tests ---
08-Nov-2018 19:52:06 [INFO] Downloading: http://repo.spring.io/libs-snapshot-local/org/apache/maven/reporting/maven-reporting-impl/2.3/maven-reporting-impl-2.3.pom
08-Nov-2018 19:52:06 [INFO] Downloading: http://repo.spring.io/libs-milestone-local/org/apache/maven/reporting/maven-reporting-impl/2.3/maven-reporting-impl-2.3.pom
08-Nov-2018 19:52:06 [INFO] Downloading: https://repo.maven.apache.org/maven2/org/apache/maven/reporting/maven-reporting-impl/2.3/maven-reporting-impl-2.3.pom
08-Nov-2018 19:52:06 [INFO] Downloaded: https://repo.maven.apache.org/maven2/org/apache/maven/reporting/maven-reporting-impl/2.3/maven-reporting-impl-2.3.pom (5 KB at 610.4 KB/sec)
08-Nov-2018 19:52:06 [INFO] Downloading: http://repo.spring.io/libs-snapshot-local/org/apache/maven/shared/maven-shared-utils/0.6/maven-shared-utils-0.6.pom
08-Nov-2018 19:52:06 [INFO] Downloading: http://repo.spring.io/libs-milestone-local/org/apache/maven/shared/maven-shared-utils/0.6/maven-shared-utils-0.6.pom
08-Nov-2018 19:52:06 [INFO] Downloading: https://repo.maven.apache.org/maven2/org/apache/maven/shared/maven-shared-utils/0.6/maven-shared-utils-0.6.pom
08-Nov-2018 19:52:06 [INFO] Downloaded: https://repo.maven.apache.org/maven2/org/apache/maven/shared/maven-shared-utils/0.6/maven-shared-utils-0.6.pom (5 KB at 680.7 KB/sec)
08-Nov-2018 19:52:06 [INFO] Downloading: http://repo.spring.io/libs-snapshot-local/org/apache/maven/doxia/doxia-integration-tools/1.6/doxia-integration-tools-1.6.pom
08-Nov-2018 19:52:06 [INFO] Downloading: http://repo.spring.io/libs-milestone-local/org/apache/maven/doxia/doxia-integration-tools/1.6/doxia-integration-tools-1.6.pom
08-Nov-2018 19:52:06 [INFO] Downloading: https://repo.maven.apache.org/maven2/org/apache/maven/doxia/doxia-integration-tools/1.6/doxia-integration-tools-1.6.pom
08-Nov-2018 19:52:06 [INFO] Downloaded: https://repo.maven.apache.org/maven2/org/apache/maven/doxia/doxia-integration-tools/1.6/doxia-integration-tools-1.6.pom (7 KB at 849.2 KB/sec)
08-Nov-2018 19:52:06 [INFO] Downloading: http://repo.spring.io/libs-snapshot-local/org/apache/maven/doxia/doxia-tools/3/doxia-tools-3.pom
08-Nov-2018 19:52:06 [INFO] Downloading: http://repo.spring.io/libs-milestone-local/org/apache/maven/doxia/doxia-tools/3/doxia-tools-3.pom
08-Nov-2018 19:52:06 [INFO] Downloading: https://repo.maven.apache.org/maven2/org/apache/maven/doxia/doxia-tools/3/doxia-tools-3.pom
08-Nov-2018 19:52:06 [INFO] Downloaded: https://repo.maven.apache.org/maven2/org/apache/maven/doxia/doxia-tools/3/doxia-tools-3.pom (10 KB at 1211.9 KB/sec)
08-Nov-2018 19:52:07 [INFO] Downloading: http://repo.spring.io/libs-snapshot-local/org/apache/maven/doxia/doxia-logging-api/1.6/doxia-logging-api-1.6.pom
08-Nov-2018 19:52:07 [INFO] Downloading: http://repo.spring.io/libs-milestone-local/org/apache/maven/doxia/doxia-logging-api/1.6/doxia-logging-api-1.6.pom
08-Nov-2018 19:52:07 [INFO] Downloading: https://repo.maven.apache.org/maven2/org/apache/maven/doxia/doxia-logging-api/1.6/doxia-logging-api-1.6.pom
08-Nov-2018 19:52:07 [INFO] Downloaded: https://repo.maven.apache.org/maven2/org/apache/maven/doxia/doxia-logging-api/1.6/doxia-logging-api-1.6.pom (2 KB at 214.3 KB/sec)
08-Nov-2018 19:52:07 [INFO] Downloading: http://repo.spring.io/libs-snapshot-local/org/apache/maven/doxia/doxia/1.6/doxia-1.6.pom
08-Nov-2018 19:52:07 [INFO] Downloading: http://repo.spring.io/libs-milestone-local/org/apache/maven/doxia/doxia/1.6/doxia-1.6.pom
08-Nov-2018 19:52:07 [INFO] Downloading: https://repo.maven.apache.org/maven2/org/apache/maven/doxia/doxia/1.6/doxia-1.6.pom
08-Nov-2018 19:52:07 [INFO] Downloaded: https://repo.maven.apache.org/maven2/org/apache/maven/doxia/doxia/1.6/doxia-1.6.pom (19 KB at 2059.9 KB/sec)
08-Nov-2018 19:52:07 [INFO] Downloading: http://repo.spring.io/libs-snapshot-local/org/apache/maven/doxia/doxia-decoration-model/1.6/doxia-decoration-model-1.6.pom
08-Nov-2018 19:52:07 [INFO] Downloading: http://repo.spring.io/libs-milestone-local/org/apache/maven/doxia/doxia-decoration-model/1.6/doxia-decoration-model-1.6.pom
08-Nov-2018 19:52:07 [INFO] Downloading: https://repo.maven.apache.org/maven2/org/apache/maven/doxia/doxia-decoration-model/1.6/doxia-decoration-model-1.6.pom
08-Nov-2018 19:52:07 [INFO] Downloaded: https://repo.maven.apache.org/maven2/org/apache/maven/doxia/doxia-decoration-model/1.6/doxia-decoration-model-1.6.pom (3 KB at 417.7 KB/sec)
08-Nov-2018 19:52:07 [INFO] Downloading: http://repo.spring.io/libs-snapshot-local/org/apache/maven/doxia/doxia-sitetools/1.6/doxia-sitetools-1.6.pom
08-Nov-2018 19:52:07 [INFO] Downloading: http://repo.spring.io/libs-milestone-local/org/apache/maven/doxia/doxia-sitetools/1.6/doxia-sitetools-1.6.pom
08-Nov-2018 19:52:07 [INFO] Downloading: https://repo.maven.apache.org/maven2/org/apache/maven/doxia/doxia-sitetools/1.6/doxia-sitetools-1.6.pom
08-Nov-2018 19:52:07 [INFO] Downloaded: https://repo.maven.apache.org/maven2/org/apache/maven/doxia/doxia-sitetools/1.6/doxia-sitetools-1.6.pom (18 KB at 2183.5 KB/sec)
08-Nov-2018 19:52:07 [INFO] Downloading: http://repo.spring.io/libs-snapshot-local/org/codehaus/plexus/plexus-resources/1.0.1/plexus-resources-1.0.1.pom
08-Nov-2018 19:52:07 [INFO] Downloading: http://repo.spring.io/libs-milestone-local/org/codehaus/plexus/plexus-resources/1.0.1/plexus-resources-1.0.1.pom
08-Nov-2018 19:52:07 [INFO] Downloading: https://repo.maven.apache.org/maven2/org/codehaus/plexus/plexus-resources/1.0.1/plexus-resources-1.0.1.pom
08-Nov-2018 19:52:07 [INFO] Downloaded: https://repo.maven.apache.org/maven2/org/codehaus/plexus/plexus-resources/1.0.1/plexus-resources-1.0.1.pom (2 KB at 183.9 KB/sec)
08-Nov-2018 19:52:07 [INFO] Downloading: http://repo.spring.io/libs-snapshot-local/org/codehaus/plexus/plexus-velocity/1.1.8/plexus-velocity-1.1.8.pom
08-Nov-2018 19:52:08 [INFO] Downloading: http://repo.spring.io/libs-milestone-local/org/codehaus/plexus/plexus-velocity/1.1.8/plexus-velocity-1.1.8.pom
08-Nov-2018 19:52:08 [INFO] Downloading: https://repo.maven.apache.org/maven2/org/codehaus/plexus/plexus-velocity/1.1.8/plexus-velocity-1.1.8.pom
08-Nov-2018 19:52:08 [INFO] Downloaded: https://repo.maven.apache.org/maven2/org/codehaus/plexus/plexus-velocity/1.1.8/plexus-velocity-1.1.8.pom (2 KB at 268.0 KB/sec)
08-Nov-2018 19:52:08 [INFO] Downloading: http://repo.spring.io/libs-snapshot-local/com/puppycrawl/tools/checkstyle/6.11.2/checkstyle-6.11.2.pom
08-Nov-2018 19:52:08 [INFO] Downloading: http://repo.spring.io/libs-milestone-local/com/puppycrawl/tools/checkstyle/6.11.2/checkstyle-6.11.2.pom
08-Nov-2018 19:52:08 [INFO] Downloading: https://repo.maven.apache.org/maven2/com/puppycrawl/tools/checkstyle/6.11.2/checkstyle-6.11.2.pom
08-Nov-2018 19:52:08 [INFO] Downloaded: https://repo.maven.apache.org/maven2/com/puppycrawl/tools/checkstyle/6.11.2/checkstyle-6.11.2.pom (62 KB at 5156.2 KB/sec)
08-Nov-2018 19:52:08 [INFO] Downloading: http://repo.spring.io/libs-snapshot-local/org/antlr/antlr4-runtime/4.5.1-1/antlr4-runtime-4.5.1-1.pom
08-Nov-2018 19:52:08 [INFO] Downloading: http://repo.spring.io/libs-milestone-local/org/antlr/antlr4-runtime/4.5.1-1/antlr4-runtime-4.5.1-1.pom
08-Nov-2018 19:52:08 [INFO] Downloading: https://repo.maven.apache.org/maven2/org/antlr/antlr4-runtime/4.5.1-1/antlr4-runtime-4.5.1-1.pom
08-Nov-2018 19:52:08 [INFO] Downloaded: https://repo.maven.apache.org/maven2/org/antlr/antlr4-runtime/4.5.1-1/antlr4-runtime-4.5.1-1.pom (3 KB at 322.5 KB/sec)
08-Nov-2018 19:52:08 [INFO] Downloading: http://repo.spring.io/libs-snapshot-local/org/antlr/antlr4-master/4.5.1-1/antlr4-master-4.5.1-1.pom
08-Nov-2018 19:52:08 [INFO] Downloading: http://repo.spring.io/libs-milestone-local/org/antlr/antlr4-master/4.5.1-1/antlr4-master-4.5.1-1.pom
08-Nov-2018 19:52:08 [INFO] Downloading: https://repo.maven.apache.org/maven2/org/antlr/antlr4-master/4.5.1-1/antlr4-master-4.5.1-1.pom
08-Nov-2018 19:52:08 [INFO] Downloaded: https://repo.maven.apache.org/maven2/org/antlr/antlr4-master/4.5.1-1/antlr4-master-4.5.1-1.pom (4 KB at 530.1 KB/sec)
08-Nov-2018 19:52:08 [INFO] Downloading: http://repo.spring.io/libs-snapshot-local/commons-beanutils/commons-beanutils/1.9.2/commons-beanutils-1.9.2.pom
08-Nov-2018 19:52:08 [INFO] Downloading: http://repo.spring.io/libs-milestone-local/commons-beanutils/commons-beanutils/1.9.2/commons-beanutils-1.9.2.pom
08-Nov-2018 19:52:08 [INFO] Downloading: https://repo.maven.apache.org/maven2/commons-beanutils/commons-beanutils/1.9.2/commons-beanutils-1.9.2.pom
08-Nov-2018 19:52:08 [INFO] Downloaded: https://repo.maven.apache.org/maven2/commons-beanutils/commons-beanutils/1.9.2/commons-beanutils-1.9.2.pom (14 KB at 1746.2 KB/sec)
08-Nov-2018 19:52:08 [INFO] Downloading: http://repo.spring.io/libs-snapshot-local/commons-cli/commons-cli/1.3.1/commons-cli-1.3.1.pom
08-Nov-2018 19:52:08 [INFO] Downloading: http://repo.spring.io/libs-milestone-local/commons-cli/commons-cli/1.3.1/commons-cli-1.3.1.pom
08-Nov-2018 19:52:08 [INFO] Downloading: https://repo.maven.apache.org/maven2/commons-cli/commons-cli/1.3.1/commons-cli-1.3.1.pom
08-Nov-2018 19:52:08 [INFO] Downloaded: https://repo.maven.apache.org/maven2/commons-cli/commons-cli/1.3.1/commons-cli-1.3.1.pom (11 KB at 1268.7 KB/sec)
08-Nov-2018 19:52:08 [INFO] Downloading: http://repo.spring.io/libs-snapshot-local/org/apache/maven/reporting/maven-reporting-impl/2.3/maven-reporting-impl-2.3.jar
08-Nov-2018 19:52:08 [INFO] Downloading: http://repo.spring.io/libs-snapshot-local/org/apache/maven/shared/maven-shared-utils/0.6/maven-shared-utils-0.6.jar
08-Nov-2018 19:52:08 [INFO] Downloading: http://repo.spring.io/libs-snapshot-local/org/codehaus/plexus/plexus-resources/1.0.1/plexus-resources-1.0.1.jar
08-Nov-2018 19:52:08 [INFO] Downloading: http://repo.spring.io/libs-snapshot-local/org/apache/maven/doxia/doxia-integration-tools/1.6/doxia-integration-tools-1.6.jar
08-Nov-2018 19:52:08 [INFO] Downloading: http://repo.spring.io/libs-snapshot-local/org/codehaus/plexus/plexus-velocity/1.1.8/plexus-velocity-1.1.8.jar
08-Nov-2018 19:52:09 [INFO] Downloading: http://repo.spring.io/libs-snapshot-local/com/puppycrawl/tools/checkstyle/6.11.2/checkstyle-6.11.2.jar
08-Nov-2018 19:52:09 [INFO] Downloading: http://repo.spring.io/libs-snapshot-local/org/antlr/antlr4-runtime/4.5.1-1/antlr4-runtime-4.5.1-1.jar
08-Nov-2018 19:52:09 [INFO] Downloading: http://repo.spring.io/libs-snapshot-local/commons-beanutils/commons-beanutils/1.9.2/commons-beanutils-1.9.2.jar
08-Nov-2018 19:52:09 [INFO] Downloading: http://repo.spring.io/libs-snapshot-local/commons-lang/commons-lang/2.1/commons-lang-2.1.jar
08-Nov-2018 19:52:09 [INFO] Downloading: http://repo.spring.io/libs-milestone-local/org/apache/maven/reporting/maven-reporting-impl/2.3/maven-reporting-impl-2.3.jar
08-Nov-2018 19:52:09 [INFO] Downloading: http://repo.spring.io/libs-milestone-local/org/apache/maven/shared/maven-shared-utils/0.6/maven-shared-utils-0.6.jar
08-Nov-2018 19:52:09 [INFO] Downloading: http://repo.spring.io/libs-milestone-local/org/apache/maven/doxia/doxia-integration-tools/1.6/doxia-integration-tools-1.6.jar
08-Nov-2018 19:52:09 [INFO] Downloading: http://repo.spring.io/libs-milestone-local/org/codehaus/plexus/plexus-resources/1.0.1/plexus-resources-1.0.1.jar
08-Nov-2018 19:52:09 [INFO] Downloading: http://repo.spring.io/libs-milestone-local/org/codehaus/plexus/plexus-velocity/1.1.8/plexus-velocity-1.1.8.jar
08-Nov-2018 19:52:09 [INFO] Downloading: http://repo.spring.io/libs-milestone-local/com/puppycrawl/tools/checkstyle/6.11.2/checkstyle-6.11.2.jar
08-Nov-2018 19:52:09 [INFO] Downloading: http://repo.spring.io/libs-milestone-local/org/antlr/antlr4-runtime/4.5.1-1/antlr4-runtime-4.5.1-1.jar
08-Nov-2018 19:52:09 [INFO] Downloading: http://repo.spring.io/libs-milestone-local/commons-beanutils/commons-beanutils/1.9.2/commons-beanutils-1.9.2.jar
08-Nov-2018 19:52:09 [INFO] Downloading: http://repo.spring.io/libs-milestone-local/commons-lang/commons-lang/2.1/commons-lang-2.1.jar
08-Nov-2018 19:52:09 [INFO] Downloading: https://repo.maven.apache.org/maven2/org/apache/maven/reporting/maven-reporting-impl/2.3/maven-reporting-impl-2.3.jar
08-Nov-2018 19:52:09 [INFO] Downloading: https://repo.maven.apache.org/maven2/org/apache/maven/shared/maven-shared-utils/0.6/maven-shared-utils-0.6.jar
08-Nov-2018 19:52:09 [INFO] Downloading: https://repo.maven.apache.org/maven2/org/codehaus/plexus/plexus-resources/1.0.1/plexus-resources-1.0.1.jar
08-Nov-2018 19:52:09 [INFO] Downloading: https://repo.maven.apache.org/maven2/org/codehaus/plexus/plexus-velocity/1.1.8/plexus-velocity-1.1.8.jar
08-Nov-2018 19:52:09 [INFO] Downloading: https://repo.maven.apache.org/maven2/org/apache/maven/doxia/doxia-integration-tools/1.6/doxia-integration-tools-1.6.jar
08-Nov-2018 19:52:09 [INFO] Downloaded: https://repo.maven.apache.org/maven2/org/apache/maven/reporting/maven-reporting-impl/2.3/maven-reporting-impl-2.3.jar (18 KB at 1463.1 KB/sec)
08-Nov-2018 19:52:09 [INFO] Downloading: https://repo.maven.apache.org/maven2/com/puppycrawl/tools/checkstyle/6.11.2/checkstyle-6.11.2.jar
08-Nov-2018 19:52:09 [INFO] Downloaded: https://repo.maven.apache.org/maven2/org/codehaus/plexus/plexus-velocity/1.1.8/plexus-velocity-1.1.8.jar (8 KB at 700.0 KB/sec)
08-Nov-2018 19:52:09 [INFO] Downloading: https://repo.maven.apache.org/maven2/org/antlr/antlr4-runtime/4.5.1-1/antlr4-runtime-4.5.1-1.jar
08-Nov-2018 19:52:09 [INFO] Downloaded: https://repo.maven.apache.org/maven2/org/codehaus/plexus/plexus-resources/1.0.1/plexus-resources-1.0.1.jar (22 KB at 1187.0 KB/sec)
08-Nov-2018 19:52:09 [INFO] Downloading: https://repo.maven.apache.org/maven2/commons-beanutils/commons-beanutils/1.9.2/commons-beanutils-1.9.2.jar
08-Nov-2018 19:52:09 [INFO] Downloaded: https://repo.maven.apache.org/maven2/org/apache/maven/doxia/doxia-integration-tools/1.6/doxia-integration-tools-1.6.jar (44 KB at 2293.9 KB/sec)
08-Nov-2018 19:52:09 [INFO] Downloading: https://repo.maven.apache.org/maven2/commons-lang/commons-lang/2.1/commons-lang-2.1.jar
08-Nov-2018 19:52:09 [INFO] Downloaded: https://repo.maven.apache.org/maven2/org/apache/maven/shared/maven-shared-utils/0.6/maven-shared-utils-0.6.jar (161 KB at 5741.9 KB/sec)
08-Nov-2018 19:52:09 [INFO] Downloaded: https://repo.maven.apache.org/maven2/commons-lang/commons-lang/2.1/commons-lang-2.1.jar (203 KB at 5338.3 KB/sec)
08-Nov-2018 19:52:09 [INFO] Downloaded: https://repo.maven.apache.org/maven2/commons-beanutils/commons-beanutils/1.9.2/commons-beanutils-1.9.2.jar (229 KB at 6009.9 KB/sec)
08-Nov-2018 19:52:09 [INFO] Downloaded: https://repo.maven.apache.org/maven2/org/antlr/antlr4-runtime/4.5.1-1/antlr4-runtime-4.5.1-1.jar (295 KB at 6275.6 KB/sec)
08-Nov-2018 19:52:09 [INFO] Downloaded: https://repo.maven.apache.org/maven2/com/puppycrawl/tools/checkstyle/6.11.2/checkstyle-6.11.2.jar (1070 KB at 11254.3 KB/sec)
08-Nov-2018 19:52:09 [INFO]
08-Nov-2018 19:52:09 [INFO] --- maven-resources-plugin:2.6:resources (default-resources) @ spring-cloud-dataflow-acceptance-tests ---
08-Nov-2018 19:52:10 [INFO] Using 'UTF-8' encoding to copy filtered resources.
08-Nov-2018 19:52:10 [INFO] skip non existing resourceDirectory /opt/bamboo-home/xml-data/build-dir/SCDT-LOCAL20XSKIPPER20X-KAFKA/src/main/resources
08-Nov-2018 19:52:10 [INFO] skip non existing resourceDirectory /opt/bamboo-home/xml-data/build-dir/SCDT-LOCAL20XSKIPPER20X-KAFKA/src/main/resources
08-Nov-2018 19:52:10 [INFO]
08-Nov-2018 19:52:10 [INFO] --- maven-compiler-plugin:3.1:compile (default-compile) @ spring-cloud-dataflow-acceptance-tests ---
08-Nov-2018 19:52:10 [INFO] Changes detected - recompiling the module!
08-Nov-2018 19:52:10 [INFO] Compiling 8 source files to /opt/bamboo-home/xml-data/build-dir/SCDT-LOCAL20XSKIPPER20X-KAFKA/target/classes
08-Nov-2018 19:52:10 [INFO]
08-Nov-2018 19:52:10 [INFO] --- maven-resources-plugin:2.6:testResources (default-testResources) @ spring-cloud-dataflow-acceptance-tests ---
08-Nov-2018 19:52:10 [INFO] Using 'UTF-8' encoding to copy filtered resources.
08-Nov-2018 19:52:10 [INFO] Copying 1 resource
08-Nov-2018 19:52:10 [INFO]
08-Nov-2018 19:52:10 [INFO] --- maven-compiler-plugin:3.1:testCompile (default-testCompile) @ spring-cloud-dataflow-acceptance-tests ---
08-Nov-2018 19:52:10 [INFO] Changes detected - recompiling the module!
08-Nov-2018 19:52:10 [INFO] Compiling 15 source files to /opt/bamboo-home/xml-data/build-dir/SCDT-LOCAL20XSKIPPER20X-KAFKA/target/test-classes
08-Nov-2018 19:52:10 [WARNING] /opt/bamboo-home/xml-data/build-dir/SCDT-LOCAL20XSKIPPER20X-KAFKA/src/test/java/org/springframework/cloud/dataflow/acceptance/test/AbstractTaskTests.java: Some input files use unchecked or unsafe operations.
08-Nov-2018 19:52:10 [WARNING] /opt/bamboo-home/xml-data/build-dir/SCDT-LOCAL20XSKIPPER20X-KAFKA/src/test/java/org/springframework/cloud/dataflow/acceptance/test/AbstractTaskTests.java: Recompile with -Xlint:unchecked for details.
08-Nov-2018 19:52:10 [INFO]
08-Nov-2018 19:52:10 [INFO] --- maven-surefire-plugin:2.18.1:test (default-test) @ spring-cloud-dataflow-acceptance-tests ---
08-Nov-2018 19:52:11 [INFO] Surefire report directory: /opt/bamboo-home/xml-data/build-dir/SCDT-LOCAL20XSKIPPER20X-KAFKA/target/surefire-reports
08-Nov-2018 19:52:11 [INFO] Downloading: http://repo.spring.io/libs-snapshot-local/org/apache/maven/surefire/surefire-junit4/2.18.1/surefire-junit4-2.18.1.pom
08-Nov-2018 19:52:11 [INFO] Downloading: http://repo.spring.io/libs-milestone-local/org/apache/maven/surefire/surefire-junit4/2.18.1/surefire-junit4-2.18.1.pom
08-Nov-2018 19:52:11 [INFO] Downloading: https://repo.maven.apache.org/maven2/org/apache/maven/surefire/surefire-junit4/2.18.1/surefire-junit4-2.18.1.pom
08-Nov-2018 19:52:11 [INFO] Downloaded: https://repo.maven.apache.org/maven2/org/apache/maven/surefire/surefire-junit4/2.18.1/surefire-junit4-2.18.1.pom (3 KB at 348.1 KB/sec)
08-Nov-2018 19:52:11 [INFO] Downloading: http://repo.spring.io/libs-snapshot-local/org/apache/maven/surefire/surefire-providers/2.18.1/surefire-providers-2.18.1.pom
08-Nov-2018 19:52:11 [INFO] Downloading: http://repo.spring.io/libs-milestone-local/org/apache/maven/surefire/surefire-providers/2.18.1/surefire-providers-2.18.1.pom
08-Nov-2018 19:52:11 [INFO] Downloading: https://repo.maven.apache.org/maven2/org/apache/maven/surefire/surefire-providers/2.18.1/surefire-providers-2.18.1.pom
08-Nov-2018 19:52:11 [INFO] Downloaded: https://repo.maven.apache.org/maven2/org/apache/maven/surefire/surefire-providers/2.18.1/surefire-providers-2.18.1.pom (3 KB at 354.9 KB/sec)
08-Nov-2018 19:52:11 [INFO] Downloading: http://repo.spring.io/libs-snapshot-local/org/apache/maven/surefire/surefire-junit4/2.18.1/surefire-junit4-2.18.1.jar
08-Nov-2018 19:52:11 [INFO] Downloading: http://repo.spring.io/libs-milestone-local/org/apache/maven/surefire/surefire-junit4/2.18.1/surefire-junit4-2.18.1.jar
08-Nov-2018 19:52:11 [INFO] Downloading: https://repo.maven.apache.org/maven2/org/apache/maven/surefire/surefire-junit4/2.18.1/surefire-junit4-2.18.1.jar
08-Nov-2018 19:52:11 [INFO] Downloaded: https://repo.maven.apache.org/maven2/org/apache/maven/surefire/surefire-junit4/2.18.1/surefire-junit4-2.18.1.jar (67 KB at 5532.8 KB/sec)
08-Nov-2018 19:52:11
08-Nov-2018 19:52:11 -------------------------------------------------------
08-Nov-2018 19:52:11 T E S T S
08-Nov-2018 19:52:11 -------------------------------------------------------
08-Nov-2018 19:52:12 2018-11-08 19:52:12.061  INFO   --- [           main] .b.t.c.SpringBootTestContextBootstrapper : Neither @ContextConfiguration nor @ContextHierarchy found for test class [org.springframework.cloud.dataflow.acceptance.test.AnalyticsTests], using SpringBootContextLoader
08-Nov-2018 19:52:12 2018-11-08 19:52:12.104  INFO   --- [           main] .b.t.c.SpringBootTestContextBootstrapper : Loaded default TestExecutionListener class names from location [META-INF/spring.factories]: [org.springframework.boot.test.mock.mockito.MockitoTestExecutionListener, org.springframework.boot.test.mock.mockito.ResetMocksTestExecutionListener, org.springframework.boot.test.autoconfigure.restdocs.RestDocsTestExecutionListener, org.springframework.boot.test.autoconfigure.web.client.MockRestServiceServerResetTestExecutionListener, org.springframework.boot.test.autoconfigure.web.servlet.MockMvcPrintOnlyOnFailureTestExecutionListener, org.springframework.boot.test.autoconfigure.web.servlet.WebDriverTestExecutionListener, org.springframework.test.context.web.ServletTestExecutionListener, org.springframework.test.context.support.DirtiesContextBeforeModesTestExecutionListener, org.springframework.test.context.support.DependencyInjectionTestExecutionListener, org.springframework.test.context.support.DirtiesContextTestExecutionListener, org.springframework.test.context.transaction.TransactionalTestExecutionListener, org.springframework.test.context.jdbc.SqlScriptsTestExecutionListener]
08-Nov-2018 19:52:12 2018-11-08 19:52:12.119  INFO   --- [           main] .b.t.c.SpringBootTestContextBootstrapper : Using TestExecutionListeners: [org.springframework.test.context.web.ServletTestExecutionListener@63355449, org.springframework.test.context.support.DirtiesContextBeforeModesTestExecutionListener@9353778, org.springframework.boot.test.autoconfigure.SpringBootDependencyInjectionTestExecutionListener@6a28ffa4, org.springframework.test.context.support.DirtiesContextTestExecutionListener@48ae9b55, org.springframework.test.context.transaction.TransactionalTestExecutionListener@1700915, org.springframework.test.context.jdbc.SqlScriptsTestExecutionListener@21de60b4, org.springframework.boot.test.autoconfigure.restdocs.RestDocsTestExecutionListener@c267ef4, org.springframework.boot.test.autoconfigure.web.servlet.MockMvcPrintOnlyOnFailureTestExecutionListener@30ee2816, org.springframework.boot.test.mock.mockito.ResetMocksTestExecutionListener@31d7b7bf, org.springframework.boot.test.autoconfigure.web.client.MockRestServiceServerResetTestExecutionListener@635eaaf1, org.springframework.boot.test.autoconfigure.web.servlet.WebDriverTestExecutionListener@5c30a9b0, org.springframework.boot.test.mock.mockito.MockitoTestExecutionListener@1ddf84b8]
08-Nov-2018 19:52:12 2018-11-08 19:52:12.121  INFO   --- [           main] .b.t.c.SpringBootTestContextBootstrapper : Neither @ContextConfiguration nor @ContextHierarchy found for test class [org.springframework.cloud.dataflow.acceptance.test.WoodChuckTests], using SpringBootContextLoader
08-Nov-2018 19:52:12 2018-11-08 19:52:12.131  INFO   --- [           main] .b.t.c.SpringBootTestContextBootstrapper : Loaded default TestExecutionListener class names from location [META-INF/spring.factories]: [org.springframework.boot.test.mock.mockito.MockitoTestExecutionListener, org.springframework.boot.test.mock.mockito.ResetMocksTestExecutionListener, org.springframework.boot.test.autoconfigure.restdocs.RestDocsTestExecutionListener, org.springframework.boot.test.autoconfigure.web.client.MockRestServiceServerResetTestExecutionListener, org.springframework.boot.test.autoconfigure.web.servlet.MockMvcPrintOnlyOnFailureTestExecutionListener, org.springframework.boot.test.autoconfigure.web.servlet.WebDriverTestExecutionListener, org.springframework.test.context.web.ServletTestExecutionListener, org.springframework.test.context.support.DirtiesContextBeforeModesTestExecutionListener, org.springframework.test.context.support.DependencyInjectionTestExecutionListener, org.springframework.test.context.support.DirtiesContextTestExecutionListener, org.springframework.test.context.transaction.TransactionalTestExecutionListener, org.springframework.test.context.jdbc.SqlScriptsTestExecutionListener]
08-Nov-2018 19:52:12 2018-11-08 19:52:12.134  INFO   --- [           main] .b.t.c.SpringBootTestContextBootstrapper : Using TestExecutionListeners: [org.springframework.test.context.web.ServletTestExecutionListener@3febb011, org.springframework.test.context.support.DirtiesContextBeforeModesTestExecutionListener@10e31a9a, org.springframework.boot.test.autoconfigure.SpringBootDependencyInjectionTestExecutionListener@131774fe, org.springframework.test.context.support.DirtiesContextTestExecutionListener@158d2680, org.springframework.test.context.transaction.TransactionalTestExecutionListener@77847718, org.springframework.test.context.jdbc.SqlScriptsTestExecutionListener@7f3b84b8, org.springframework.boot.test.autoconfigure.restdocs.RestDocsTestExecutionListener@57a3af25, org.springframework.boot.test.autoconfigure.web.servlet.MockMvcPrintOnlyOnFailureTestExecutionListener@2b662a77, org.springframework.boot.test.mock.mockito.ResetMocksTestExecutionListener@7f0eb4b4, org.springframework.boot.test.autoconfigure.web.client.MockRestServiceServerResetTestExecutionListener@5c33f1a9, org.springframework.boot.test.autoconfigure.web.servlet.WebDriverTestExecutionListener@1623b78d, org.springframework.boot.test.mock.mockito.MockitoTestExecutionListener@c8c12ac]
08-Nov-2018 19:52:12 2018-11-08 19:52:12.135  INFO   --- [           main] .b.t.c.SpringBootTestContextBootstrapper : Neither @ContextConfiguration nor @ContextHierarchy found for test class [org.springframework.cloud.dataflow.acceptance.test.HttpSourceTests], using SpringBootContextLoader
08-Nov-2018 19:52:12 2018-11-08 19:52:12.144  INFO   --- [           main] .b.t.c.SpringBootTestContextBootstrapper : Loaded default TestExecutionListener class names from location [META-INF/spring.factories]: [org.springframework.boot.test.mock.mockito.MockitoTestExecutionListener, org.springframework.boot.test.mock.mockito.ResetMocksTestExecutionListener, org.springframework.boot.test.autoconfigure.restdocs.RestDocsTestExecutionListener, org.springframework.boot.test.autoconfigure.web.client.MockRestServiceServerResetTestExecutionListener, org.springframework.boot.test.autoconfigure.web.servlet.MockMvcPrintOnlyOnFailureTestExecutionListener, org.springframework.boot.test.autoconfigure.web.servlet.WebDriverTestExecutionListener, org.springframework.test.context.web.ServletTestExecutionListener, org.springframework.test.context.support.DirtiesContextBeforeModesTestExecutionListener, org.springframework.test.context.support.DependencyInjectionTestExecutionListener, org.springframework.test.context.support.DirtiesContextTestExecutionListener, org.springframework.test.context.transaction.TransactionalTestExecutionListener, org.springframework.test.context.jdbc.SqlScriptsTestExecutionListener]
08-Nov-2018 19:52:12 2018-11-08 19:52:12.147  INFO   --- [           main] .b.t.c.SpringBootTestContextBootstrapper : Using TestExecutionListeners: [org.springframework.test.context.web.ServletTestExecutionListener@233795b6, org.springframework.test.context.support.DirtiesContextBeforeModesTestExecutionListener@3eb738bb, org.springframework.boot.test.autoconfigure.SpringBootDependencyInjectionTestExecutionListener@5bda8e08, org.springframework.test.context.support.DirtiesContextTestExecutionListener@1e800aaa, org.springframework.test.context.transaction.TransactionalTestExecutionListener@185a6e9, org.springframework.test.context.jdbc.SqlScriptsTestExecutionListener@6f03482, org.springframework.boot.test.autoconfigure.restdocs.RestDocsTestExecutionListener@9d5509a, org.springframework.boot.test.autoconfigure.web.servlet.MockMvcPrintOnlyOnFailureTestExecutionListener@179ece50, org.springframework.boot.test.mock.mockito.ResetMocksTestExecutionListener@3b0090a4, org.springframework.boot.test.autoconfigure.web.client.MockRestServiceServerResetTestExecutionListener@3cd3e762, org.springframework.boot.test.autoconfigure.web.servlet.WebDriverTestExecutionListener@1fa121e2, org.springframework.boot.test.mock.mockito.MockitoTestExecutionListener@7eac9008]
08-Nov-2018 19:52:12 2018-11-08 19:52:12.162  INFO   --- [           main] .b.t.c.SpringBootTestContextBootstrapper : Neither @ContextConfiguration nor @ContextHierarchy found for test class [org.springframework.cloud.dataflow.acceptance.test.TickTockTests], using SpringBootContextLoader
08-Nov-2018 19:52:12 2018-11-08 19:52:12.170  INFO   --- [           main] .b.t.c.SpringBootTestContextBootstrapper : Loaded default TestExecutionListener class names from location [META-INF/spring.factories]: [org.springframework.boot.test.mock.mockito.MockitoTestExecutionListener, org.springframework.boot.test.mock.mockito.ResetMocksTestExecutionListener, org.springframework.boot.test.autoconfigure.restdocs.RestDocsTestExecutionListener, org.springframework.boot.test.autoconfigure.web.client.MockRestServiceServerResetTestExecutionListener, org.springframework.boot.test.autoconfigure.web.servlet.MockMvcPrintOnlyOnFailureTestExecutionListener, org.springframework.boot.test.autoconfigure.web.servlet.WebDriverTestExecutionListener, org.springframework.test.context.web.ServletTestExecutionListener, org.springframework.test.context.support.DirtiesContextBeforeModesTestExecutionListener, org.springframework.test.context.support.DependencyInjectionTestExecutionListener, org.springframework.test.context.support.DirtiesContextTestExecutionListener, org.springframework.test.context.transaction.TransactionalTestExecutionListener, org.springframework.test.context.jdbc.SqlScriptsTestExecutionListener]
08-Nov-2018 19:52:12 2018-11-08 19:52:12.173  INFO   --- [           main] .b.t.c.SpringBootTestContextBootstrapper : Using TestExecutionListeners: [org.springframework.test.context.web.ServletTestExecutionListener@79da8dc5, org.springframework.test.context.support.DirtiesContextBeforeModesTestExecutionListener@1eb5174b, org.springframework.boot.test.autoconfigure.SpringBootDependencyInjectionTestExecutionListener@67080771, org.springframework.test.context.support.DirtiesContextTestExecutionListener@72cde7cc, org.springframework.test.context.transaction.TransactionalTestExecutionListener@5fd4f8f5, org.springframework.test.context.jdbc.SqlScriptsTestExecutionListener@696da30b, org.springframework.boot.test.autoconfigure.restdocs.RestDocsTestExecutionListener@4e7912d8, org.springframework.boot.test.autoconfigure.web.servlet.MockMvcPrintOnlyOnFailureTestExecutionListener@53976f5c, org.springframework.boot.test.mock.mockito.ResetMocksTestExecutionListener@2bfc268b, org.springframework.boot.test.autoconfigure.web.client.MockRestServiceServerResetTestExecutionListener@2f8dad04, org.springframework.boot.test.autoconfigure.web.servlet.WebDriverTestExecutionListener@29e495ff, org.springframework.boot.test.mock.mockito.MockitoTestExecutionListener@41e1e210]
08-Nov-2018 19:52:12 2018-11-08 19:52:12.174  INFO   --- [           main] .b.t.c.SpringBootTestContextBootstrapper : Neither @ContextConfiguration nor @ContextHierarchy found for test class [org.springframework.cloud.dataflow.acceptance.test.TransformTests], using SpringBootContextLoader
08-Nov-2018 19:52:12 2018-11-08 19:52:12.182  INFO   --- [           main] .b.t.c.SpringBootTestContextBootstrapper : Loaded default TestExecutionListener class names from location [META-INF/spring.factories]: [org.springframework.boot.test.mock.mockito.MockitoTestExecutionListener, org.springframework.boot.test.mock.mockito.ResetMocksTestExecutionListener, org.springframework.boot.test.autoconfigure.restdocs.RestDocsTestExecutionListener, org.springframework.boot.test.autoconfigure.web.client.MockRestServiceServerResetTestExecutionListener, org.springframework.boot.test.autoconfigure.web.servlet.MockMvcPrintOnlyOnFailureTestExecutionListener, org.springframework.boot.test.autoconfigure.web.servlet.WebDriverTestExecutionListener, org.springframework.test.context.web.ServletTestExecutionListener, org.springframework.test.context.support.DirtiesContextBeforeModesTestExecutionListener, org.springframework.test.context.support.DependencyInjectionTestExecutionListener, org.springframework.test.context.support.DirtiesContextTestExecutionListener, org.springframework.test.context.transaction.TransactionalTestExecutionListener, org.springframework.test.context.jdbc.SqlScriptsTestExecutionListener]
08-Nov-2018 19:52:12 2018-11-08 19:52:12.185  INFO   --- [           main] .b.t.c.SpringBootTestContextBootstrapper : Using TestExecutionListeners: [org.springframework.test.context.web.ServletTestExecutionListener@74751b3, org.springframework.test.context.support.DirtiesContextBeforeModesTestExecutionListener@741a8937, org.springframework.boot.test.autoconfigure.SpringBootDependencyInjectionTestExecutionListener@306e95ec, org.springframework.test.context.support.DirtiesContextTestExecutionListener@52af26ee, org.springframework.test.context.transaction.TransactionalTestExecutionListener@6fd83fc1, org.springframework.test.context.jdbc.SqlScriptsTestExecutionListener@4f2b503c, org.springframework.boot.test.autoconfigure.restdocs.RestDocsTestExecutionListener@bae7dc0, org.springframework.boot.test.autoconfigure.web.servlet.MockMvcPrintOnlyOnFailureTestExecutionListener@209da20d, org.springframework.boot.test.mock.mockito.ResetMocksTestExecutionListener@e15b7e8, org.springframework.boot.test.autoconfigure.web.client.MockRestServiceServerResetTestExecutionListener@1b2abca6, org.springframework.boot.test.autoconfigure.web.servlet.WebDriverTestExecutionListener@6392827e, org.springframework.boot.test.mock.mockito.MockitoTestExecutionListener@2ed2d9cb]
08-Nov-2018 19:52:12 2018-11-08 19:52:12.195  INFO   --- [           main] .b.t.c.SpringBootTestContextBootstrapper : Neither @ContextConfiguration nor @ContextHierarchy found for test class [org.springframework.cloud.dataflow.acceptance.test.NamedChannelTests], using SpringBootContextLoader
08-Nov-2018 19:52:12 2018-11-08 19:52:12.203  INFO   --- [           main] .b.t.c.SpringBootTestContextBootstrapper : Loaded default TestExecutionListener class names from location [META-INF/spring.factories]: [org.springframework.boot.test.mock.mockito.MockitoTestExecutionListener, org.springframework.boot.test.mock.mockito.ResetMocksTestExecutionListener, org.springframework.boot.test.autoconfigure.restdocs.RestDocsTestExecutionListener, org.springframework.boot.test.autoconfigure.web.client.MockRestServiceServerResetTestExecutionListener, org.springframework.boot.test.autoconfigure.web.servlet.MockMvcPrintOnlyOnFailureTestExecutionListener, org.springframework.boot.test.autoconfigure.web.servlet.WebDriverTestExecutionListener, org.springframework.test.context.web.ServletTestExecutionListener, org.springframework.test.context.support.DirtiesContextBeforeModesTestExecutionListener, org.springframework.test.context.support.DependencyInjectionTestExecutionListener, org.springframework.test.context.support.DirtiesContextTestExecutionListener, org.springframework.test.context.transaction.TransactionalTestExecutionListener, org.springframework.test.context.jdbc.SqlScriptsTestExecutionListener]
08-Nov-2018 19:52:12 2018-11-08 19:52:12.206  INFO   --- [           main] .b.t.c.SpringBootTestContextBootstrapper : Using TestExecutionListeners: [org.springframework.test.context.web.ServletTestExecutionListener@5890e879, org.springframework.test.context.support.DirtiesContextBeforeModesTestExecutionListener@6440112d, org.springframework.boot.test.autoconfigure.SpringBootDependencyInjectionTestExecutionListener@31ea9581, org.springframework.test.context.support.DirtiesContextTestExecutionListener@231f98ef, org.springframework.test.context.transaction.TransactionalTestExecutionListener@7c137fd5, org.springframework.test.context.jdbc.SqlScriptsTestExecutionListener@183ec003, org.springframework.boot.test.autoconfigure.restdocs.RestDocsTestExecutionListener@7d9d0818, org.springframework.boot.test.autoconfigure.web.servlet.MockMvcPrintOnlyOnFailureTestExecutionListener@221a3fa4, org.springframework.boot.test.mock.mockito.ResetMocksTestExecutionListener@451001e5, org.springframework.boot.test.autoconfigure.web.client.MockRestServiceServerResetTestExecutionListener@2b40ff9c, org.springframework.boot.test.autoconfigure.web.servlet.WebDriverTestExecutionListener@3e08ff24, org.springframework.boot.test.mock.mockito.MockitoTestExecutionListener@4d1c005e]
08-Nov-2018 19:52:12 Running org.springframework.cloud.dataflow.acceptance.test.AnalyticsTests
08-Nov-2018 19:52:12 2018-11-08 19:52:12.227  INFO   --- [           main] .b.t.c.SpringBootTestContextBootstrapper : Neither @ContextConfiguration nor @ContextHierarchy found for test class [org.springframework.cloud.dataflow.acceptance.test.AnalyticsTests], using SpringBootContextLoader
08-Nov-2018 19:52:12 2018-11-08 19:52:12.234  INFO   --- [           main] .b.t.c.SpringBootTestContextBootstrapper : Loaded default TestExecutionListener class names from location [META-INF/spring.factories]: [org.springframework.boot.test.mock.mockito.MockitoTestExecutionListener, org.springframework.boot.test.mock.mockito.ResetMocksTestExecutionListener, org.springframework.boot.test.autoconfigure.restdocs.RestDocsTestExecutionListener, org.springframework.boot.test.autoconfigure.web.client.MockRestServiceServerResetTestExecutionListener, org.springframework.boot.test.autoconfigure.web.servlet.MockMvcPrintOnlyOnFailureTestExecutionListener, org.springframework.boot.test.autoconfigure.web.servlet.WebDriverTestExecutionListener, org.springframework.test.context.web.ServletTestExecutionListener, org.springframework.test.context.support.DirtiesContextBeforeModesTestExecutionListener, org.springframework.test.context.support.DependencyInjectionTestExecutionListener, org.springframework.test.context.support.DirtiesContextTestExecutionListener, org.springframework.test.context.transaction.TransactionalTestExecutionListener, org.springframework.test.context.jdbc.SqlScriptsTestExecutionListener]
08-Nov-2018 19:52:12 2018-11-08 19:52:12.248  INFO   --- [           main] .b.t.c.SpringBootTestContextBootstrapper : Using TestExecutionListeners: [org.springframework.test.context.web.ServletTestExecutionListener@4e0ae11f, org.springframework.test.context.support.DirtiesContextBeforeModesTestExecutionListener@238d68ff, org.springframework.boot.test.autoconfigure.SpringBootDependencyInjectionTestExecutionListener@4b86805d, org.springframework.test.context.support.DirtiesContextTestExecutionListener@5852c06f, org.springframework.test.context.transaction.TransactionalTestExecutionListener@4149c063, org.springframework.test.context.jdbc.SqlScriptsTestExecutionListener@9cb8225, org.springframework.boot.test.autoconfigure.restdocs.RestDocsTestExecutionListener@76b07f29, org.springframework.boot.test.autoconfigure.web.servlet.MockMvcPrintOnlyOnFailureTestExecutionListener@38af9828, org.springframework.boot.test.mock.mockito.ResetMocksTestExecutionListener@376a0d86, org.springframework.boot.test.autoconfigure.web.client.MockRestServiceServerResetTestExecutionListener@62656be4, org.springframework.boot.test.autoconfigure.web.servlet.WebDriverTestExecutionListener@17d919b6, org.springframework.boot.test.mock.mockito.MockitoTestExecutionListener@53f3bdbd]
08-Nov-2018 19:52:12 2018-11-08 19:52:12.811  INFO 5597 --- [           main] s.c.a.AnnotationConfigApplicationContext : Refreshing org.springframework.context.annotation.AnnotationConfigApplicationContext@68ed96ca: startup date [Thu Nov 08 19:52:12 UTC 2018]; root of context hierarchy
08-Nov-2018 19:52:13 2018-11-08 19:52:13.035  INFO 5597 --- [           main] trationDelegate$BeanPostProcessorChecker : Bean 'configurationPropertiesRebinderAutoConfiguration' of type [class org.springframework.cloud.autoconfigure.ConfigurationPropertiesRebinderAutoConfiguration$$EnhancerBySpringCGLIB$$70cac85b] is not eligible for getting processed by all BeanPostProcessors (for example: not eligible for auto-proxying)
08-Nov-2018 19:52:13
08-Nov-2018 19:52:13   .   ____          _            __ _ _
08-Nov-2018 19:52:13 /\\ / ___'_ __ _ _(_)_ __  __ _ \ \ \ \
08-Nov-2018 19:52:13 ( ( )\___ | '_ | '_| | '_ \/ _` | \ \ \ \
08-Nov-2018 19:52:13 \\/  ___)| |_)| | | | | || (_| |  ) ) ) )
08-Nov-2018 19:52:13   '  |____| .__|_| |_|_| |_\__, | / / / /
08-Nov-2018 19:52:13 =========|_|==============|___/=/_/_/_/
08-Nov-2018 19:52:13 :: Spring Boot ::        (v1.4.1.RELEASE)
08-Nov-2018 19:52:13
08-Nov-2018 19:52:13 2018-11-08 19:52:13.359  INFO 5597 --- [           main] c.c.c.ConfigServicePropertySourceLocator : Fetching config from server at: http://localhost:8888
08-Nov-2018 19:52:13 2018-11-08 19:52:13.439  WARN 5597 --- [           main] c.c.c.ConfigServicePropertySourceLocator : Could not locate PropertySource: I/O error on GET request for "http://localhost:8888//blah": Connection refused (Connection refused); nested exception is java.net.ConnectException: Connection refused (Connection refused)
08-Nov-2018 19:52:13 2018-11-08 19:52:13.446  INFO 5597 --- [           main] o.s.c.d.acceptance.test.AnalyticsTests   : The following profiles are active: blah
08-Nov-2018 19:52:13 2018-11-08 19:52:13.641  INFO 5597 --- [           main] o.s.c.d.acceptance.test.AnalyticsTests   : Started AnalyticsTests in 1.327 seconds (JVM running for 1.977)
08-Nov-2018 19:52:13 2018-11-08 19:52:13.951  INFO 5597 --- [           main] junit.logTestName                        : Starting Test analyticsTest(org.springframework.cloud.dataflow.acceptance.test.AnalyticsTests)
08-Nov-2018 19:52:13 2018-11-08 19:52:13.958  INFO 5597 --- [           main] o.s.c.d.acceptance.test.AnalyticsTests   : Importing stream apps from uri resource: http://repo.spring.io/libs-release/org/springframework/cloud/stream/app/spring-cloud-stream-app-descriptor/Celsius.SR3/spring-cloud-stream-app-descriptor-Celsius.SR3.stream-apps-kafka-10-maven
08-Nov-2018 19:52:14 2018-11-08 19:52:14.976  INFO 5597 --- [           main] o.s.c.d.acceptance.test.AnalyticsTests   : Creating stream 'httpCounter'
08-Nov-2018 19:52:15 2018-11-08 19:52:15.161  INFO 5597 --- [           main] o.s.c.d.acceptance.test.AnalyticsTests   : Deploying stream 'httpCounter' with properties: {app.*.logging.file=${PID}-test.log, app.*.endpoints.logfile.sensitive=false, app.*.management.endpoints.web.exposure.include=*}
08-Nov-2018 19:52:27 2018-11-08 19:52:27.281  INFO 5597 --- [           main] o.s.c.d.acceptance.test.AnalyticsTests   : Checking: Stream=httpCounter, status = deploying, status description = The stream is being deployed.
08-Nov-2018 19:52:27 2018-11-08 19:52:27.281  INFO 5597 --- [           main] o.s.c.d.acceptance.test.AnalyticsTests   : Sleeping to check status of Stream=httpCounter
08-Nov-2018 19:52:37 2018-11-08 19:52:37.354  INFO 5597 --- [           main] o.s.c.d.acceptance.test.AnalyticsTests   : Checking: Stream=httpCounter, status = deploying, status description = The stream is being deployed.
08-Nov-2018 19:52:37 2018-11-08 19:52:37.354  INFO 5597 --- [           main] o.s.c.d.acceptance.test.AnalyticsTests   : Sleeping to check status of Stream=httpCounter
08-Nov-2018 19:52:47 2018-11-08 19:52:47.419  INFO 5597 --- [           main] o.s.c.d.acceptance.test.AnalyticsTests   : Checking: Stream=httpCounter, status = deployed, status description = The stream has been successfully deployed
08-Nov-2018 19:52:47 2018-11-08 19:52:47.487  INFO 5597 --- [           main] o.s.c.d.acceptance.test.AnalyticsTests   : Sleeping to check status of Stream=httpCounter
08-Nov-2018 19:52:57 2018-11-08 19:52:57.487  INFO 5597 --- [           main] o.s.c.d.acceptance.test.AnalyticsTests   : Stream 'httpCounter' started with status: deployed
08-Nov-2018 19:52:57 2018-11-08 19:52:57.487  INFO 5597 --- [           main] o.s.c.d.acceptance.test.AnalyticsTests   : App 'http' has instances: {httpCounter.http-v1-0=http://10.194.6.23:51729}
08-Nov-2018 19:52:57 2018-11-08 19:52:57.488  INFO 5597 --- [           main] o.s.c.d.acceptance.test.AnalyticsTests   : App 'counter' has instances: {httpCounter.counter-v1-0=http://10.194.6.23:57630}
08-Nov-2018 19:52:57 2018-11-08 19:52:57.488  INFO 5597 --- [           main] o.s.c.d.acceptance.test.AnalyticsTests   : Looking for 'Started HttpSource' in logfile for http
08-Nov-2018 19:53:07 2018-11-08 19:53:07.488  INFO 5597 --- [           main] o.s.c.d.acceptance.test.AnalyticsTests   : Requesting log for app httpCounter.http-v1-0
08-Nov-2018 19:53:07 2018-11-08 19:53:07.631  INFO 5597 --- [           main] o.s.c.d.acceptance.test.AnalyticsTests   : Retrieved logfile from 'http://10.194.6.23:51729/logfile
08-Nov-2018 19:53:07 2018-11-08 19:53:07.635  INFO 5597 --- [           main] o.s.c.d.acceptance.test.AnalyticsTests   : Matched all 'Started HttpSource' in logfile for instance httpCounter.http-v1-0 of app http
08-Nov-2018 19:53:07 2018-11-08 19:53:07.635  INFO 5597 --- [           main] o.s.c.d.acceptance.test.AnalyticsTests   : Looking for 'Started CounterSink' in logfile for counter
08-Nov-2018 19:53:17 2018-11-08 19:53:17.635  INFO 5597 --- [           main] o.s.c.d.acceptance.test.AnalyticsTests   : Requesting log for app httpCounter.counter-v1-0
08-Nov-2018 19:53:17 2018-11-08 19:53:17.776  INFO 5597 --- [           main] o.s.c.d.acceptance.test.AnalyticsTests   : Retrieved logfile from 'http://10.194.6.23:57630/logfile
08-Nov-2018 19:53:17 2018-11-08 19:53:17.776  INFO 5597 --- [           main] o.s.c.d.acceptance.test.AnalyticsTests   : Matched all 'Started CounterSink' in logfile for instance httpCounter.counter-v1-0 of app counter
08-Nov-2018 19:53:28 2018-11-08 19:53:28.188  INFO 5597 --- [           main] junit.logTestName                        : Test analyticsTest(org.springframework.cloud.dataflow.acceptance.test.AnalyticsTests) Succeeded
08-Nov-2018 19:53:28 2018-11-08 19:53:28.189  INFO 5597 --- [           main] junit.logTestName                        : Finished Test analyticsTest(org.springframework.cloud.dataflow.acceptance.test.AnalyticsTests)
08-Nov-2018 19:53:28 2018-11-08 19:53:28.189  INFO 5597 --- [           main] o.s.c.d.acceptance.test.AnalyticsTests   : Destroy all streams
08-Nov-2018 19:53:31 Tests run: 1, Failures: 0, Errors: 0, Skipped: 0, Time elapsed: 79.47 sec - in org.springframework.cloud.dataflow.acceptance.test.AnalyticsTests
08-Nov-2018 19:53:31 Running org.springframework.cloud.dataflow.acceptance.test.WoodChuckTests
08-Nov-2018 19:53:31 2018-11-08 19:53:31.699  INFO 5597 --- [           main] .b.t.c.SpringBootTestContextBootstrapper : Neither @ContextConfiguration nor @ContextHierarchy found for test class [org.springframework.cloud.dataflow.acceptance.test.WoodChuckTests], using SpringBootContextLoader
08-Nov-2018 19:53:31 2018-11-08 19:53:31.728  INFO 5597 --- [           main] .b.t.c.SpringBootTestContextBootstrapper : Loaded default TestExecutionListener class names from location [META-INF/spring.factories]: [org.springframework.boot.test.mock.mockito.MockitoTestExecutionListener, org.springframework.boot.test.mock.mockito.ResetMocksTestExecutionListener, org.springframework.boot.test.autoconfigure.restdocs.RestDocsTestExecutionListener, org.springframework.boot.test.autoconfigure.web.client.MockRestServiceServerResetTestExecutionListener, org.springframework.boot.test.autoconfigure.web.servlet.MockMvcPrintOnlyOnFailureTestExecutionListener, org.springframework.boot.test.autoconfigure.web.servlet.WebDriverTestExecutionListener, org.springframework.test.context.web.ServletTestExecutionListener, org.springframework.test.context.support.DirtiesContextBeforeModesTestExecutionListener, org.springframework.test.context.support.DependencyInjectionTestExecutionListener, org.springframework.test.context.support.DirtiesContextTestExecutionListener, org.springframework.test.context.transaction.TransactionalTestExecutionListener, org.springframework.test.context.jdbc.SqlScriptsTestExecutionListener]
08-Nov-2018 19:53:31 2018-11-08 19:53:31.731  INFO 5597 --- [           main] .b.t.c.SpringBootTestContextBootstrapper : Using TestExecutionListeners: [org.springframework.test.context.web.ServletTestExecutionListener@3aa41da1, org.springframework.test.context.support.DirtiesContextBeforeModesTestExecutionListener@74fab04a, org.springframework.boot.test.autoconfigure.SpringBootDependencyInjectionTestExecutionListener@3c83468e, org.springframework.test.context.support.DirtiesContextTestExecutionListener@272ce069, org.springframework.test.context.transaction.TransactionalTestExecutionListener@3d7fb838, org.springframework.test.context.jdbc.SqlScriptsTestExecutionListener@1c26273d, org.springframework.boot.test.autoconfigure.restdocs.RestDocsTestExecutionListener@3a37a501, org.springframework.boot.test.autoconfigure.web.servlet.MockMvcPrintOnlyOnFailureTestExecutionListener@7a583586, org.springframework.boot.test.mock.mockito.ResetMocksTestExecutionListener@3a26ec8d, org.springframework.boot.test.autoconfigure.web.client.MockRestServiceServerResetTestExecutionListener@17143b3b, org.springframework.boot.test.autoconfigure.web.servlet.WebDriverTestExecutionListener@100c8b75, org.springframework.boot.test.mock.mockito.MockitoTestExecutionListener@2bc378f7]
08-Nov-2018 19:53:31 2018-11-08 19:53:31.815  INFO 5597 --- [           main] junit.logTestName                        : Starting Test testPartitioning(org.springframework.cloud.dataflow.acceptance.test.WoodChuckTests)
08-Nov-2018 19:53:31 2018-11-08 19:53:31.816  INFO 5597 --- [           main] o.s.c.d.acceptance.test.WoodChuckTests   : Creating stream 'WOODCHUCK-TEST'
08-Nov-2018 19:53:31 2018-11-08 19:53:31.846  INFO 5597 --- [           main] o.s.c.d.acceptance.test.WoodChuckTests   : Deploying stream 'WOODCHUCK-TEST' with properties: {app.log.logging.pattern.level=WOODCHUCK-${INSTANCE_INDEX:${CF_INSTANCE_INDEX:${spring.cloud.stream.instanceIndex:0}}} %5p, app.*.logging.file=${PID}-test.log, app.splitter.producer.partitionKeyExpression=payload, app.*.endpoints.logfile.sensitive=false, app.log.spring.cloud.stream.kafka.bindings.input.consumer.autoRebalanceEnabled=false, app.*.management.endpoints.web.exposure.include=*, deployer.log.count=2}
08-Nov-2018 19:53:42 2018-11-08 19:53:42.542  INFO 5597 --- [           main] o.s.c.d.acceptance.test.WoodChuckTests   : Checking: Stream=WOODCHUCK-TEST, status = deploying, status description = The stream is being deployed.
08-Nov-2018 19:53:42 2018-11-08 19:53:42.542  INFO 5597 --- [           main] o.s.c.d.acceptance.test.WoodChuckTests   : Sleeping to check status of Stream=WOODCHUCK-TEST
08-Nov-2018 19:53:52 2018-11-08 19:53:52.621  INFO 5597 --- [           main] o.s.c.d.acceptance.test.WoodChuckTests   : Checking: Stream=WOODCHUCK-TEST, status = deploying, status description = The stream is being deployed.
08-Nov-2018 19:53:52 2018-11-08 19:53:52.621  INFO 5597 --- [           main] o.s.c.d.acceptance.test.WoodChuckTests   : Sleeping to check status of Stream=WOODCHUCK-TEST
08-Nov-2018 19:54:02 2018-11-08 19:54:02.697  INFO 5597 --- [           main] o.s.c.d.acceptance.test.WoodChuckTests   : Checking: Stream=WOODCHUCK-TEST, status = deploying, status description = The stream is being deployed.
08-Nov-2018 19:54:02 2018-11-08 19:54:02.697  INFO 5597 --- [           main] o.s.c.d.acceptance.test.WoodChuckTests   : Sleeping to check status of Stream=WOODCHUCK-TEST
08-Nov-2018 19:54:12 2018-11-08 19:54:12.755  INFO 5597 --- [           main] o.s.c.d.acceptance.test.WoodChuckTests   : Checking: Stream=WOODCHUCK-TEST, status = deployed, status description = The stream has been successfully deployed
08-Nov-2018 19:54:12 2018-11-08 19:54:12.819  INFO 5597 --- [           main] o.s.c.d.acceptance.test.WoodChuckTests   : Sleeping to check status of Stream=WOODCHUCK-TEST
08-Nov-2018 19:54:22 2018-11-08 19:54:22.819  INFO 5597 --- [           main] o.s.c.d.acceptance.test.WoodChuckTests   : Stream 'WOODCHUCK-TEST' started with status: deployed
08-Nov-2018 19:54:22 2018-11-08 19:54:22.820  INFO 5597 --- [           main] o.s.c.d.acceptance.test.WoodChuckTests   : App 'log' has instances: {WOODCHUCK-TEST.log-v1-0=http://10.194.6.23:51002, WOODCHUCK-TEST.log-v1-1=http://10.194.6.23:51715}
08-Nov-2018 19:54:22 2018-11-08 19:54:22.820  INFO 5597 --- [           main] o.s.c.d.acceptance.test.WoodChuckTests   : App 'http' has instances: {WOODCHUCK-TEST.http-v1-0=http://10.194.6.23:53086}
08-Nov-2018 19:54:22 2018-11-08 19:54:22.820  INFO 5597 --- [           main] o.s.c.d.acceptance.test.WoodChuckTests   : App 'splitter' has instances: {WOODCHUCK-TEST.splitter-v1-0=http://10.194.6.23:55837}
08-Nov-2018 19:54:22 2018-11-08 19:54:22.820  INFO 5597 --- [           main] o.s.c.d.acceptance.test.WoodChuckTests   : Looking for 'Started HttpSource' in logfile for http
08-Nov-2018 19:54:32 2018-11-08 19:54:32.820  INFO 5597 --- [           main] o.s.c.d.acceptance.test.WoodChuckTests   : Requesting log for app WOODCHUCK-TEST.http-v1-0
08-Nov-2018 19:54:32 2018-11-08 19:54:32.978  INFO 5597 --- [           main] o.s.c.d.acceptance.test.WoodChuckTests   : Retrieved logfile from 'http://10.194.6.23:53086/logfile
08-Nov-2018 19:54:32 2018-11-08 19:54:32.978  INFO 5597 --- [           main] o.s.c.d.acceptance.test.WoodChuckTests   : Matched all 'Started HttpSource' in logfile for instance WOODCHUCK-TEST.http-v1-0 of app http
08-Nov-2018 19:54:32 2018-11-08 19:54:32.978  INFO 5597 --- [           main] o.s.c.d.acceptance.test.WoodChuckTests   : Looking for 'Started SplitterProcessor' in logfile for splitter
08-Nov-2018 19:54:42 2018-11-08 19:54:42.978  INFO 5597 --- [           main] o.s.c.d.acceptance.test.WoodChuckTests   : Requesting log for app WOODCHUCK-TEST.splitter-v1-0
08-Nov-2018 19:54:43 2018-11-08 19:54:43.129  INFO 5597 --- [           main] o.s.c.d.acceptance.test.WoodChuckTests   : Retrieved logfile from 'http://10.194.6.23:55837/logfile
08-Nov-2018 19:54:43 2018-11-08 19:54:43.129  INFO 5597 --- [           main] o.s.c.d.acceptance.test.WoodChuckTests   : Matched all 'Started SplitterProcessor' in logfile for instance WOODCHUCK-TEST.splitter-v1-0 of app splitter
08-Nov-2018 19:54:43 2018-11-08 19:54:43.130  INFO 5597 --- [           main] o.s.c.d.acceptance.test.WoodChuckTests   : Looking for 'Started LogSink' in logfile for log
08-Nov-2018 19:54:53 2018-11-08 19:54:53.130  INFO 5597 --- [           main] o.s.c.d.acceptance.test.WoodChuckTests   : Requesting log for app WOODCHUCK-TEST.log-v1-0
08-Nov-2018 19:54:53 2018-11-08 19:54:53.283  INFO 5597 --- [           main] o.s.c.d.acceptance.test.WoodChuckTests   : Retrieved logfile from 'http://10.194.6.23:51002/logfile
08-Nov-2018 19:54:53 2018-11-08 19:54:53.283  INFO 5597 --- [           main] o.s.c.d.acceptance.test.WoodChuckTests   : Matched all 'Started LogSink' in logfile for instance WOODCHUCK-TEST.log-v1-0 of app log
08-Nov-2018 19:54:53 2018-11-08 19:54:53.425  INFO 5597 --- [           main] o.s.c.d.acceptance.test.WoodChuckTests   : Looking for 'WOODCHUCK-0,How,chuck' in logfile for log
08-Nov-2018 19:55:03 2018-11-08 19:55:03.431  INFO 5597 --- [           main] o.s.c.d.acceptance.test.WoodChuckTests   : Requesting log for app WOODCHUCK-TEST.log-v1-0
08-Nov-2018 19:55:03 2018-11-08 19:55:03.449  INFO 5597 --- [           main] o.s.c.d.acceptance.test.WoodChuckTests   : Retrieved logfile from 'http://10.194.6.23:51002/logfile
08-Nov-2018 19:55:03 2018-11-08 19:55:03.449  INFO 5597 --- [           main] o.s.c.d.acceptance.test.WoodChuckTests   : Matched all 'WOODCHUCK-0,How,chuck' in logfile for instance WOODCHUCK-TEST.log-v1-0 of app log
08-Nov-2018 19:55:03 2018-11-08 19:55:03.449  INFO 5597 --- [           main] o.s.c.d.acceptance.test.WoodChuckTests   : Looking for 'WOODCHUCK-1,much,wood,would,if,a,woodchuck,could' in logfile for log
08-Nov-2018 19:55:13 2018-11-08 19:55:13.450  INFO 5597 --- [           main] o.s.c.d.acceptance.test.WoodChuckTests   : Requesting log for app WOODCHUCK-TEST.log-v1-0
08-Nov-2018 19:55:13 2018-11-08 19:55:13.460  INFO 5597 --- [           main] o.s.c.d.acceptance.test.WoodChuckTests   : Retrieved logfile from 'http://10.194.6.23:51002/logfile
08-Nov-2018 19:55:13 2018-11-08 19:55:13.461  INFO 5597 --- [           main] o.s.c.d.acceptance.test.WoodChuckTests   : Requesting log for app WOODCHUCK-TEST.log-v1-1
08-Nov-2018 19:55:13 2018-11-08 19:55:13.612  INFO 5597 --- [           main] o.s.c.d.acceptance.test.WoodChuckTests   : Retrieved logfile from 'http://10.194.6.23:51715/logfile
08-Nov-2018 19:55:13 2018-11-08 19:55:13.612  INFO 5597 --- [           main] o.s.c.d.acceptance.test.WoodChuckTests   : Matched all 'WOODCHUCK-1,much,wood,would,if,a,woodchuck,could' in logfile for instance WOODCHUCK-TEST.log-v1-1 of app log
08-Nov-2018 19:55:13 2018-11-08 19:55:13.614  INFO 5597 --- [           main] junit.logTestName                        : Test testPartitioning(org.springframework.cloud.dataflow.acceptance.test.WoodChuckTests) Succeeded
08-Nov-2018 19:55:13 2018-11-08 19:55:13.614  INFO 5597 --- [           main] junit.logTestName                        : Finished Test testPartitioning(org.springframework.cloud.dataflow.acceptance.test.WoodChuckTests)
08-Nov-2018 19:55:13 2018-11-08 19:55:13.614  INFO 5597 --- [           main] o.s.c.d.acceptance.test.WoodChuckTests   : Destroy all streams
08-Nov-2018 19:55:13 Tests run: 1, Failures: 0, Errors: 0, Skipped: 0, Time elapsed: 102.086 sec - in org.springframework.cloud.dataflow.acceptance.test.WoodChuckTests
08-Nov-2018 19:55:13 Running org.springframework.cloud.dataflow.acceptance.test.HttpSourceTests
08-Nov-2018 19:55:13 2018-11-08 19:55:13.789  INFO 5597 --- [           main] .b.t.c.SpringBootTestContextBootstrapper : Neither @ContextConfiguration nor @ContextHierarchy found for test class [org.springframework.cloud.dataflow.acceptance.test.HttpSourceTests], using SpringBootContextLoader
08-Nov-2018 19:55:13 2018-11-08 19:55:13.807  INFO 5597 --- [           main] .b.t.c.SpringBootTestContextBootstrapper : Loaded default TestExecutionListener class names from location [META-INF/spring.factories]: [org.springframework.boot.test.mock.mockito.MockitoTestExecutionListener, org.springframework.boot.test.mock.mockito.ResetMocksTestExecutionListener, org.springframework.boot.test.autoconfigure.restdocs.RestDocsTestExecutionListener, org.springframework.boot.test.autoconfigure.web.client.MockRestServiceServerResetTestExecutionListener, org.springframework.boot.test.autoconfigure.web.servlet.MockMvcPrintOnlyOnFailureTestExecutionListener, org.springframework.boot.test.autoconfigure.web.servlet.WebDriverTestExecutionListener, org.springframework.test.context.web.ServletTestExecutionListener, org.springframework.test.context.support.DirtiesContextBeforeModesTestExecutionListener, org.springframework.test.context.support.DependencyInjectionTestExecutionListener, org.springframework.test.context.support.DirtiesContextTestExecutionListener, org.springframework.test.context.transaction.TransactionalTestExecutionListener, org.springframework.test.context.jdbc.SqlScriptsTestExecutionListener]
08-Nov-2018 19:55:13 2018-11-08 19:55:13.810  INFO 5597 --- [           main] .b.t.c.SpringBootTestContextBootstrapper : Using TestExecutionListeners: [org.springframework.test.context.web.ServletTestExecutionListener@714f3da4, org.springframework.test.context.support.DirtiesContextBeforeModesTestExecutionListener@1caa9eb6, org.springframework.boot.test.autoconfigure.SpringBootDependencyInjectionTestExecutionListener@1f53481b, org.springframework.test.context.support.DirtiesContextTestExecutionListener@2fcd7d3f, org.springframework.test.context.transaction.TransactionalTestExecutionListener@27e7c77f, org.springframework.test.context.jdbc.SqlScriptsTestExecutionListener@6f70a21b, org.springframework.boot.test.autoconfigure.restdocs.RestDocsTestExecutionListener@6ae62c7e, org.springframework.boot.test.autoconfigure.web.servlet.MockMvcPrintOnlyOnFailureTestExecutionListener@2e869098, org.springframework.boot.test.mock.mockito.ResetMocksTestExecutionListener@37c36608, org.springframework.boot.test.autoconfigure.web.client.MockRestServiceServerResetTestExecutionListener@5d497a91, org.springframework.boot.test.autoconfigure.web.servlet.WebDriverTestExecutionListener@617389a, org.springframework.boot.test.mock.mockito.MockitoTestExecutionListener@1c8f6a90]
08-Nov-2018 19:55:13 2018-11-08 19:55:13.933  INFO 5597 --- [           main] junit.logTestName                        : Starting Test httpSourceTests(org.springframework.cloud.dataflow.acceptance.test.HttpSourceTests)
08-Nov-2018 19:55:13 2018-11-08 19:55:13.934  INFO 5597 --- [           main] o.s.c.d.acceptance.test.HttpSourceTests  : Creating stream 'HTTP-TEST'
08-Nov-2018 19:55:13 2018-11-08 19:55:13.982  INFO 5597 --- [           main] o.s.c.d.acceptance.test.HttpSourceTests  : Deploying stream 'HTTP-TEST' with properties: {app.*.logging.file=${PID}-test.log, app.*.endpoints.logfile.sensitive=false, app.*.management.endpoints.web.exposure.include=*}
08-Nov-2018 19:55:14 2018-11-08 19:55:14.346  INFO 5597 --- [           main] o.s.c.d.acceptance.test.HttpSourceTests  : Checking: Stream=HTTP-TEST, status = deploying, status description = The stream is being deployed.
08-Nov-2018 19:55:14 2018-11-08 19:55:14.346  INFO 5597 --- [           main] o.s.c.d.acceptance.test.HttpSourceTests  : Sleeping to check status of Stream=HTTP-TEST
08-Nov-2018 19:55:24 2018-11-08 19:55:24.434  INFO 5597 --- [           main] o.s.c.d.acceptance.test.HttpSourceTests  : Checking: Stream=HTTP-TEST, status = deploying, status description = The stream is being deployed.
08-Nov-2018 19:55:24 2018-11-08 19:55:24.434  INFO 5597 --- [           main] o.s.c.d.acceptance.test.HttpSourceTests  : Sleeping to check status of Stream=HTTP-TEST
08-Nov-2018 19:55:34 2018-11-08 19:55:34.481  INFO 5597 --- [           main] o.s.c.d.acceptance.test.HttpSourceTests  : Checking: Stream=HTTP-TEST, status = deployed, status description = The stream has been successfully deployed
08-Nov-2018 19:55:34 2018-11-08 19:55:34.529  INFO 5597 --- [           main] o.s.c.d.acceptance.test.HttpSourceTests  : Sleeping to check status of Stream=HTTP-TEST
08-Nov-2018 19:55:44 2018-11-08 19:55:44.530  INFO 5597 --- [           main] o.s.c.d.acceptance.test.HttpSourceTests  : Stream 'HTTP-TEST' started with status: deployed
08-Nov-2018 19:55:44 2018-11-08 19:55:44.530  INFO 5597 --- [           main] o.s.c.d.acceptance.test.HttpSourceTests  : App 'log' has instances: {HTTP-TEST.log-v1-0=http://10.194.6.23:55898}
08-Nov-2018 19:55:44 2018-11-08 19:55:44.530  INFO 5597 --- [           main] o.s.c.d.acceptance.test.HttpSourceTests  : App 'http' has instances: {HTTP-TEST.http-v1-0=http://10.194.6.23:57002}
08-Nov-2018 19:55:44 2018-11-08 19:55:44.536  INFO 5597 --- [           main] o.s.c.d.acceptance.test.HttpSourceTests  : Looking for 'Started HttpSource' in logfile for http
08-Nov-2018 19:55:54 2018-11-08 19:55:54.536  INFO 5597 --- [           main] o.s.c.d.acceptance.test.HttpSourceTests  : Requesting log for app HTTP-TEST.http-v1-0
08-Nov-2018 19:55:54 2018-11-08 19:55:54.714  INFO 5597 --- [           main] o.s.c.d.acceptance.test.HttpSourceTests  : Retrieved logfile from 'http://10.194.6.23:57002/logfile
08-Nov-2018 19:55:54 2018-11-08 19:55:54.714  INFO 5597 --- [           main] o.s.c.d.acceptance.test.HttpSourceTests  : Matched all 'Started HttpSource' in logfile for instance HTTP-TEST.http-v1-0 of app http
08-Nov-2018 19:55:54 2018-11-08 19:55:54.714  INFO 5597 --- [           main] o.s.c.d.acceptance.test.HttpSourceTests  : Looking for 'Started LogSink' in logfile for log
08-Nov-2018 19:56:04 2018-11-08 19:56:04.714  INFO 5597 --- [           main] o.s.c.d.acceptance.test.HttpSourceTests  : Requesting log for app HTTP-TEST.log-v1-0
08-Nov-2018 19:56:04 2018-11-08 19:56:04.868  INFO 5597 --- [           main] o.s.c.d.acceptance.test.HttpSourceTests  : Retrieved logfile from 'http://10.194.6.23:55898/logfile
08-Nov-2018 19:56:04 2018-11-08 19:56:04.868  INFO 5597 --- [           main] o.s.c.d.acceptance.test.HttpSourceTests  : Matched all 'Started LogSink' in logfile for instance HTTP-TEST.log-v1-0 of app log
08-Nov-2018 19:56:05 2018-11-08 19:56:05.009  INFO 5597 --- [           main] o.s.c.d.acceptance.test.HttpSourceTests  : Looking for 'f7256a99-e2cc-4219-b23e-9e46157ae34d' in logfile for log
08-Nov-2018 19:56:15 2018-11-08 19:56:15.009  INFO 5597 --- [           main] o.s.c.d.acceptance.test.HttpSourceTests  : Requesting log for app HTTP-TEST.log-v1-0
08-Nov-2018 19:56:15 2018-11-08 19:56:15.029  INFO 5597 --- [           main] o.s.c.d.acceptance.test.HttpSourceTests  : Retrieved logfile from 'http://10.194.6.23:55898/logfile
08-Nov-2018 19:56:15 2018-11-08 19:56:15.029  INFO 5597 --- [           main] o.s.c.d.acceptance.test.HttpSourceTests  : Matched all 'f7256a99-e2cc-4219-b23e-9e46157ae34d' in logfile for instance HTTP-TEST.log-v1-0 of app log
08-Nov-2018 19:56:15 2018-11-08 19:56:15.031  INFO 5597 --- [           main] junit.logTestName                        : Test httpSourceTests(org.springframework.cloud.dataflow.acceptance.test.HttpSourceTests) Succeeded
08-Nov-2018 19:56:15 2018-11-08 19:56:15.031  INFO 5597 --- [           main] junit.logTestName                        : Finished Test httpSourceTests(org.springframework.cloud.dataflow.acceptance.test.HttpSourceTests)
08-Nov-2018 19:56:15 2018-11-08 19:56:15.031  INFO 5597 --- [           main] o.s.c.d.acceptance.test.HttpSourceTests  : Destroy all streams
08-Nov-2018 19:56:15 Tests run: 1, Failures: 0, Errors: 0, Skipped: 0, Time elapsed: 61.379 sec - in org.springframework.cloud.dataflow.acceptance.test.HttpSourceTests
08-Nov-2018 19:56:15 Running org.springframework.cloud.dataflow.acceptance.test.TimestampTaskTests
08-Nov-2018 19:56:15 2018-11-08 19:56:15.177  INFO 5597 --- [           main] o.s.c.support.GenericApplicationContext  : Refreshing org.springframework.context.support.GenericApplicationContext@32177fa5: startup date [Thu Nov 08 19:56:15 UTC 2018]; root of context hierarchy
08-Nov-2018 19:56:15 2018-11-08 19:56:15.307  INFO 5597 --- [           main] junit.logTestName                        : Starting Test timeStampTests(org.springframework.cloud.dataflow.acceptance.test.TimestampTaskTests)
08-Nov-2018 19:56:15 2018-11-08 19:56:15.308  INFO 5597 --- [           main] o.s.c.d.a.test.AbstractTaskTests         : Importing task apps from uri resource: http://repo.spring.io/libs-release/org/springframework/cloud/task/app/spring-cloud-task-app-descriptor/Clark.RELEASE/spring-cloud-task-app-descriptor-Clark.RELEASE.task-apps-maven
08-Nov-2018 19:56:15 2018-11-08 19:56:15.465  INFO 5597 --- [           main] o.s.c.d.a.test.AbstractTaskTests         : Done importing task apps.
08-Nov-2018 19:56:27 2018-11-08 19:56:27.235  INFO 5597 --- [           main] junit.logTestName                        : Test timeStampTests(org.springframework.cloud.dataflow.acceptance.test.TimestampTaskTests) Succeeded
08-Nov-2018 19:56:27 2018-11-08 19:56:27.235  INFO 5597 --- [           main] junit.logTestName                        : Finished Test timeStampTests(org.springframework.cloud.dataflow.acceptance.test.TimestampTaskTests)
08-Nov-2018 19:56:27 2018-11-08 19:56:27.311  INFO 5597 --- [           main] junit.logTestName                        : Starting Test timeStampTestsMultipleLaunch(org.springframework.cloud.dataflow.acceptance.test.TimestampTaskTests)
08-Nov-2018 19:56:47 2018-11-08 19:56:47.460  INFO 5597 --- [           main] junit.logTestName                        : Test timeStampTestsMultipleLaunch(org.springframework.cloud.dataflow.acceptance.test.TimestampTaskTests) Succeeded
08-Nov-2018 19:56:47 2018-11-08 19:56:47.460  INFO 5597 --- [           main] junit.logTestName                        : Finished Test timeStampTestsMultipleLaunch(org.springframework.cloud.dataflow.acceptance.test.TimestampTaskTests)
08-Nov-2018 19:56:47 Tests run: 2, Failures: 0, Errors: 0, Skipped: 0, Time elapsed: 32.291 sec - in org.springframework.cloud.dataflow.acceptance.test.TimestampTaskTests
08-Nov-2018 19:56:47 Running org.springframework.cloud.dataflow.acceptance.test.TickTockTests
08-Nov-2018 19:56:47 2018-11-08 19:56:47.461  INFO 5597 --- [           main] .b.t.c.SpringBootTestContextBootstrapper : Neither @ContextConfiguration nor @ContextHierarchy found for test class [org.springframework.cloud.dataflow.acceptance.test.TickTockTests], using SpringBootContextLoader
08-Nov-2018 19:56:47 2018-11-08 19:56:47.467  INFO 5597 --- [           main] .b.t.c.SpringBootTestContextBootstrapper : Loaded default TestExecutionListener class names from location [META-INF/spring.factories]: [org.springframework.boot.test.mock.mockito.MockitoTestExecutionListener, org.springframework.boot.test.mock.mockito.ResetMocksTestExecutionListener, org.springframework.boot.test.autoconfigure.restdocs.RestDocsTestExecutionListener, org.springframework.boot.test.autoconfigure.web.client.MockRestServiceServerResetTestExecutionListener, org.springframework.boot.test.autoconfigure.web.servlet.MockMvcPrintOnlyOnFailureTestExecutionListener, org.springframework.boot.test.autoconfigure.web.servlet.WebDriverTestExecutionListener, org.springframework.test.context.web.ServletTestExecutionListener, org.springframework.test.context.support.DirtiesContextBeforeModesTestExecutionListener, org.springframework.test.context.support.DependencyInjectionTestExecutionListener, org.springframework.test.context.support.DirtiesContextTestExecutionListener, org.springframework.test.context.transaction.TransactionalTestExecutionListener, org.springframework.test.context.jdbc.SqlScriptsTestExecutionListener]
08-Nov-2018 19:56:47 2018-11-08 19:56:47.469  INFO 5597 --- [           main] .b.t.c.SpringBootTestContextBootstrapper : Using TestExecutionListeners: [org.springframework.test.context.web.ServletTestExecutionListener@6504a875, org.springframework.test.context.support.DirtiesContextBeforeModesTestExecutionListener@35e26d05, org.springframework.boot.test.autoconfigure.SpringBootDependencyInjectionTestExecutionListener@29fa6b65, org.springframework.test.context.support.DirtiesContextTestExecutionListener@7c72ecc, org.springframework.test.context.transaction.TransactionalTestExecutionListener@47406941, org.springframework.test.context.jdbc.SqlScriptsTestExecutionListener@61ecbee9, org.springframework.boot.test.autoconfigure.restdocs.RestDocsTestExecutionListener@1bb740f2, org.springframework.boot.test.autoconfigure.web.servlet.MockMvcPrintOnlyOnFailureTestExecutionListener@2538bc06, org.springframework.boot.test.mock.mockito.ResetMocksTestExecutionListener@61f6d381, org.springframework.boot.test.autoconfigure.web.client.MockRestServiceServerResetTestExecutionListener@656922a0, org.springframework.boot.test.autoconfigure.web.servlet.WebDriverTestExecutionListener@44784e2f, org.springframework.boot.test.mock.mockito.MockitoTestExecutionListener@2440022a]
08-Nov-2018 19:56:47 2018-11-08 19:56:47.547  INFO 5597 --- [           main] junit.logTestName                        : Starting Test tickTockTests(org.springframework.cloud.dataflow.acceptance.test.TickTockTests)
08-Nov-2018 19:56:47 2018-11-08 19:56:47.549  INFO 5597 --- [           main] o.s.c.d.acceptance.test.TickTockTests    : Creating stream 'TICKTOCK'
08-Nov-2018 19:56:47 2018-11-08 19:56:47.580  INFO 5597 --- [           main] o.s.c.d.acceptance.test.TickTockTests    : Deploying stream 'TICKTOCK' with properties: {app.*.logging.file=${PID}-test.log, app.*.endpoints.logfile.sensitive=false, app.log.log.expression='TICKTOCK - TIMESTAMP: '.concat(payload), app.*.management.endpoints.web.exposure.include=*}
08-Nov-2018 19:56:50 2018-11-08 19:56:50.228  INFO 5597 --- [           main] o.s.c.d.acceptance.test.TickTockTests    : Checking: Stream=TICKTOCK, status = deploying, status description = The stream is being deployed.
08-Nov-2018 19:56:50 2018-11-08 19:56:50.228  INFO 5597 --- [           main] o.s.c.d.acceptance.test.TickTockTests    : Sleeping to check status of Stream=TICKTOCK
08-Nov-2018 19:57:00 2018-11-08 19:57:00.275  INFO 5597 --- [           main] o.s.c.d.acceptance.test.TickTockTests    : Checking: Stream=TICKTOCK, status = deploying, status description = The stream is being deployed.
08-Nov-2018 19:57:00 2018-11-08 19:57:00.276  INFO 5597 --- [           main] o.s.c.d.acceptance.test.TickTockTests    : Sleeping to check status of Stream=TICKTOCK
08-Nov-2018 19:57:10 2018-11-08 19:57:10.324  INFO 5597 --- [           main] o.s.c.d.acceptance.test.TickTockTests    : Checking: Stream=TICKTOCK, status = deployed, status description = The stream has been successfully deployed
08-Nov-2018 19:57:10 2018-11-08 19:57:10.370  INFO 5597 --- [           main] o.s.c.d.acceptance.test.TickTockTests    : Sleeping to check status of Stream=TICKTOCK
08-Nov-2018 19:57:20 2018-11-08 19:57:20.370  INFO 5597 --- [           main] o.s.c.d.acceptance.test.TickTockTests    : Stream 'TICKTOCK' started with status: deployed
08-Nov-2018 19:57:20 2018-11-08 19:57:20.371  INFO 5597 --- [           main] o.s.c.d.acceptance.test.TickTockTests    : App 'log' has instances: {TICKTOCK.log-v1-0=http://10.194.6.23:53392}
08-Nov-2018 19:57:20 2018-11-08 19:57:20.371  INFO 5597 --- [           main] o.s.c.d.acceptance.test.TickTockTests    : App 'time' has instances: {TICKTOCK.time-v1-0=http://10.194.6.23:54937}
08-Nov-2018 19:57:20 2018-11-08 19:57:20.371  INFO 5597 --- [           main] o.s.c.d.acceptance.test.TickTockTests    : Looking for 'Started TimeSource' in logfile for time
08-Nov-2018 19:57:30 2018-11-08 19:57:30.371  INFO 5597 --- [           main] o.s.c.d.acceptance.test.TickTockTests    : Requesting log for app TICKTOCK.time-v1-0
08-Nov-2018 19:57:30 2018-11-08 19:57:30.545  INFO 5597 --- [           main] o.s.c.d.acceptance.test.TickTockTests    : Retrieved logfile from 'http://10.194.6.23:54937/logfile
08-Nov-2018 19:57:30 2018-11-08 19:57:30.545  INFO 5597 --- [           main] o.s.c.d.acceptance.test.TickTockTests    : Matched all 'Started TimeSource' in logfile for instance TICKTOCK.time-v1-0 of app time
08-Nov-2018 19:57:30 2018-11-08 19:57:30.545  INFO 5597 --- [           main] o.s.c.d.acceptance.test.TickTockTests    : Looking for 'Started LogSink' in logfile for log
08-Nov-2018 19:57:40 2018-11-08 19:57:40.545  INFO 5597 --- [           main] o.s.c.d.acceptance.test.TickTockTests    : Requesting log for app TICKTOCK.log-v1-0
08-Nov-2018 19:57:40 2018-11-08 19:57:40.711  INFO 5597 --- [           main] o.s.c.d.acceptance.test.TickTockTests    : Retrieved logfile from 'http://10.194.6.23:53392/logfile
08-Nov-2018 19:57:40 2018-11-08 19:57:40.711  INFO 5597 --- [           main] o.s.c.d.acceptance.test.TickTockTests    : Matched all 'Started LogSink' in logfile for instance TICKTOCK.log-v1-0 of app log
08-Nov-2018 19:57:40 2018-11-08 19:57:40.711  INFO 5597 --- [           main] o.s.c.d.acceptance.test.TickTockTests    : Looking for 'TICKTOCK - TIMESTAMP:' in logfile for log
08-Nov-2018 19:57:50 2018-11-08 19:57:50.711  INFO 5597 --- [           main] o.s.c.d.acceptance.test.TickTockTests    : Requesting log for app TICKTOCK.log-v1-0
08-Nov-2018 19:57:50 2018-11-08 19:57:50.728  INFO 5597 --- [           main] o.s.c.d.acceptance.test.TickTockTests    : Retrieved logfile from 'http://10.194.6.23:53392/logfile
08-Nov-2018 19:57:50 2018-11-08 19:57:50.728  INFO 5597 --- [           main] o.s.c.d.acceptance.test.TickTockTests    : Matched all 'TICKTOCK - TIMESTAMP:' in logfile for instance TICKTOCK.log-v1-0 of app log
08-Nov-2018 19:57:50 2018-11-08 19:57:50.729  INFO 5597 --- [           main] junit.logTestName                        : Test tickTockTests(org.springframework.cloud.dataflow.acceptance.test.TickTockTests) Succeeded
08-Nov-2018 19:57:50 2018-11-08 19:57:50.730  INFO 5597 --- [           main] junit.logTestName                        : Finished Test tickTockTests(org.springframework.cloud.dataflow.acceptance.test.TickTockTests)
08-Nov-2018 19:57:50 2018-11-08 19:57:50.730  INFO 5597 --- [           main] o.s.c.d.acceptance.test.TickTockTests    : Destroy all streams
08-Nov-2018 19:57:50 2018-11-08 19:57:50.918  INFO 5597 --- [           main] junit.logTestName                        : Starting Test tickTockTestsFromConfigServer(org.springframework.cloud.dataflow.acceptance.test.TickTockTests)
08-Nov-2018 19:57:50 2018-11-08 19:57:50.924  INFO 5597 --- [           main] junit.logTestName                        : Finished Test tickTockTestsFromConfigServer(org.springframework.cloud.dataflow.acceptance.test.TickTockTests)
08-Nov-2018 19:57:50 2018-11-08 19:57:50.924  INFO 5597 --- [           main] o.s.c.d.acceptance.test.TickTockTests    : Destroy all streams
08-Nov-2018 19:57:50 Tests run: 2, Failures: 0, Errors: 0, Skipped: 1, Time elapsed: 63.467 sec - in org.springframework.cloud.dataflow.acceptance.test.TickTockTests
08-Nov-2018 19:57:50 Running org.springframework.cloud.dataflow.acceptance.test.TransformTests
08-Nov-2018 19:57:50 2018-11-08 19:57:50.930  INFO 5597 --- [           main] .b.t.c.SpringBootTestContextBootstrapper : Neither @ContextConfiguration nor @ContextHierarchy found for test class [org.springframework.cloud.dataflow.acceptance.test.TransformTests], using SpringBootContextLoader
08-Nov-2018 19:57:50 2018-11-08 19:57:50.938  INFO 5597 --- [           main] .b.t.c.SpringBootTestContextBootstrapper : Loaded default TestExecutionListener class names from location [META-INF/spring.factories]: [org.springframework.boot.test.mock.mockito.MockitoTestExecutionListener, org.springframework.boot.test.mock.mockito.ResetMocksTestExecutionListener, org.springframework.boot.test.autoconfigure.restdocs.RestDocsTestExecutionListener, org.springframework.boot.test.autoconfigure.web.client.MockRestServiceServerResetTestExecutionListener, org.springframework.boot.test.autoconfigure.web.servlet.MockMvcPrintOnlyOnFailureTestExecutionListener, org.springframework.boot.test.autoconfigure.web.servlet.WebDriverTestExecutionListener, org.springframework.test.context.web.ServletTestExecutionListener, org.springframework.test.context.support.DirtiesContextBeforeModesTestExecutionListener, org.springframework.test.context.support.DependencyInjectionTestExecutionListener, org.springframework.test.context.support.DirtiesContextTestExecutionListener, org.springframework.test.context.transaction.TransactionalTestExecutionListener, org.springframework.test.context.jdbc.SqlScriptsTestExecutionListener]
08-Nov-2018 19:57:50 2018-11-08 19:57:50.940  INFO 5597 --- [           main] .b.t.c.SpringBootTestContextBootstrapper : Using TestExecutionListeners: [org.springframework.test.context.web.ServletTestExecutionListener@2ae62bb6, org.springframework.test.context.support.DirtiesContextBeforeModesTestExecutionListener@68ed3f30, org.springframework.boot.test.autoconfigure.SpringBootDependencyInjectionTestExecutionListener@56b859a6, org.springframework.test.context.support.DirtiesContextTestExecutionListener@590adb41, org.springframework.test.context.transaction.TransactionalTestExecutionListener@42aae04d, org.springframework.test.context.jdbc.SqlScriptsTestExecutionListener@43bf5397, org.springframework.boot.test.autoconfigure.restdocs.RestDocsTestExecutionListener@575e572f, org.springframework.boot.test.autoconfigure.web.servlet.MockMvcPrintOnlyOnFailureTestExecutionListener@58015e56, org.springframework.boot.test.mock.mockito.ResetMocksTestExecutionListener@4d3c6593, org.springframework.boot.test.autoconfigure.web.client.MockRestServiceServerResetTestExecutionListener@7426a448, org.springframework.boot.test.autoconfigure.web.servlet.WebDriverTestExecutionListener@516462cc, org.springframework.boot.test.mock.mockito.MockitoTestExecutionListener@3456558]
08-Nov-2018 19:57:51 2018-11-08 19:57:51.046  INFO 5597 --- [           main] junit.logTestName                        : Starting Test transformTests(org.springframework.cloud.dataflow.acceptance.test.TransformTests)
08-Nov-2018 19:57:51 2018-11-08 19:57:51.048  INFO 5597 --- [           main] o.s.c.d.acceptance.test.TransformTests   : Creating stream 'TRANSFORM-TEST'
08-Nov-2018 19:57:51 2018-11-08 19:57:51.070  INFO 5597 --- [           main] o.s.c.d.acceptance.test.TransformTests   : Deploying stream 'TRANSFORM-TEST' with properties: {app.*.logging.file=${PID}-test.log, app.*.endpoints.logfile.sensitive=false, app.*.management.endpoints.web.exposure.include=*}
08-Nov-2018 19:57:53 2018-11-08 19:57:53.738  INFO 5597 --- [           main] o.s.c.d.acceptance.test.TransformTests   : Checking: Stream=TRANSFORM-TEST, status = deploying, status description = The stream is being deployed.
08-Nov-2018 19:57:53 2018-11-08 19:57:53.738  INFO 5597 --- [           main] o.s.c.d.acceptance.test.TransformTests   : Sleeping to check status of Stream=TRANSFORM-TEST
08-Nov-2018 19:58:03 2018-11-08 19:58:03.795  INFO 5597 --- [           main] o.s.c.d.acceptance.test.TransformTests   : Checking: Stream=TRANSFORM-TEST, status = deploying, status description = The stream is being deployed.
08-Nov-2018 19:58:03 2018-11-08 19:58:03.795  INFO 5597 --- [           main] o.s.c.d.acceptance.test.TransformTests   : Sleeping to check status of Stream=TRANSFORM-TEST
08-Nov-2018 19:58:13 2018-11-08 19:58:13.860  INFO 5597 --- [           main] o.s.c.d.acceptance.test.TransformTests   : Checking: Stream=TRANSFORM-TEST, status = deploying, status description = The stream is being deployed.
08-Nov-2018 19:58:13 2018-11-08 19:58:13.860  INFO 5597 --- [           main] o.s.c.d.acceptance.test.TransformTests   : Sleeping to check status of Stream=TRANSFORM-TEST
08-Nov-2018 19:58:23 2018-11-08 19:58:23.900  INFO 5597 --- [           main] o.s.c.d.acceptance.test.TransformTests   : Checking: Stream=TRANSFORM-TEST, status = deployed, status description = The stream has been successfully deployed
08-Nov-2018 19:58:23 2018-11-08 19:58:23.983  INFO 5597 --- [           main] o.s.c.d.acceptance.test.TransformTests   : Sleeping to check status of Stream=TRANSFORM-TEST
08-Nov-2018 19:58:33 2018-11-08 19:58:33.984  INFO 5597 --- [           main] o.s.c.d.acceptance.test.TransformTests   : Stream 'TRANSFORM-TEST' started with status: deployed
08-Nov-2018 19:58:33 2018-11-08 19:58:33.984  INFO 5597 --- [           main] o.s.c.d.acceptance.test.TransformTests   : App 'transform' has instances: {TRANSFORM-TEST.transform-v1-0=http://10.194.6.23:54738}
08-Nov-2018 19:58:33 2018-11-08 19:58:33.984  INFO 5597 --- [           main] o.s.c.d.acceptance.test.TransformTests   : App 'log' has instances: {TRANSFORM-TEST.log-v1-0=http://10.194.6.23:55380}
08-Nov-2018 19:58:33 2018-11-08 19:58:33.984  INFO 5597 --- [           main] o.s.c.d.acceptance.test.TransformTests   : App 'http' has instances: {TRANSFORM-TEST.http-v1-0=http://10.194.6.23:59811}
08-Nov-2018 19:58:33 2018-11-08 19:58:33.984  INFO 5597 --- [           main] o.s.c.d.acceptance.test.TransformTests   : Looking for 'Started HttpSource' in logfile for http
08-Nov-2018 19:58:43 2018-11-08 19:58:43.984  INFO 5597 --- [           main] o.s.c.d.acceptance.test.TransformTests   : Requesting log for app TRANSFORM-TEST.http-v1-0
08-Nov-2018 19:58:44 2018-11-08 19:58:44.146  INFO 5597 --- [           main] o.s.c.d.acceptance.test.TransformTests   : Retrieved logfile from 'http://10.194.6.23:59811/logfile
08-Nov-2018 19:58:44 2018-11-08 19:58:44.146  INFO 5597 --- [           main] o.s.c.d.acceptance.test.TransformTests   : Matched all 'Started HttpSource' in logfile for instance TRANSFORM-TEST.http-v1-0 of app http
08-Nov-2018 19:58:44 2018-11-08 19:58:44.282  INFO 5597 --- [           main] o.s.c.d.acceptance.test.TransformTests   : Looking for 'Started LogSink' in logfile for log
08-Nov-2018 19:58:54 2018-11-08 19:58:54.283  INFO 5597 --- [           main] o.s.c.d.acceptance.test.TransformTests   : Requesting log for app TRANSFORM-TEST.log-v1-0
08-Nov-2018 19:58:54 2018-11-08 19:58:54.471  INFO 5597 --- [           main] o.s.c.d.acceptance.test.TransformTests   : Retrieved logfile from 'http://10.194.6.23:55380/logfile
08-Nov-2018 19:58:54 2018-11-08 19:58:54.471  INFO 5597 --- [           main] o.s.c.d.acceptance.test.TransformTests   : Matched all 'Started LogSink' in logfile for instance TRANSFORM-TEST.log-v1-0 of app log
08-Nov-2018 19:58:54 2018-11-08 19:58:54.471  INFO 5597 --- [           main] o.s.c.d.acceptance.test.TransformTests   : Looking for 'ABCDEFG' in logfile for log
08-Nov-2018 19:59:04 2018-11-08 19:59:04.471  INFO 5597 --- [           main] o.s.c.d.acceptance.test.TransformTests   : Requesting log for app TRANSFORM-TEST.log-v1-0
08-Nov-2018 19:59:04 2018-11-08 19:59:04.487  INFO 5597 --- [           main] o.s.c.d.acceptance.test.TransformTests   : Retrieved logfile from 'http://10.194.6.23:55380/logfile
08-Nov-2018 19:59:04 2018-11-08 19:59:04.487  INFO 5597 --- [           main] o.s.c.d.acceptance.test.TransformTests   : Matched all 'ABCDEFG' in logfile for instance TRANSFORM-TEST.log-v1-0 of app log
08-Nov-2018 19:59:04 2018-11-08 19:59:04.490  INFO 5597 --- [           main] junit.logTestName                        : Test transformTests(org.springframework.cloud.dataflow.acceptance.test.TransformTests) Succeeded
08-Nov-2018 19:59:04 2018-11-08 19:59:04.491  INFO 5597 --- [           main] junit.logTestName                        : Finished Test transformTests(org.springframework.cloud.dataflow.acceptance.test.TransformTests)
08-Nov-2018 19:59:04 2018-11-08 19:59:04.491  INFO 5597 --- [           main] o.s.c.d.acceptance.test.TransformTests   : Destroy all streams
08-Nov-2018 19:59:04 Tests run: 1, Failures: 0, Errors: 0, Skipped: 0, Time elapsed: 73.837 sec - in org.springframework.cloud.dataflow.acceptance.test.TransformTests
08-Nov-2018 19:59:04 Running org.springframework.cloud.dataflow.acceptance.test.SchedulerTests
08-Nov-2018 19:59:05 2018-11-08 19:59:04.999  INFO 5597 --- [           main] s.c.a.AnnotationConfigApplicationContext : Refreshing org.springframework.context.annotation.AnnotationConfigApplicationContext@17e9bc9e: startup date [Thu Nov 08 19:59:04 UTC 2018]; root of context hierarchy
08-Nov-2018 19:59:05 2018-11-08 19:59:05.051  INFO 5597 --- [           main] trationDelegate$BeanPostProcessorChecker : Bean 'configurationPropertiesRebinderAutoConfiguration' of type [class org.springframework.cloud.autoconfigure.ConfigurationPropertiesRebinderAutoConfiguration$$EnhancerBySpringCGLIB$$70cac85b] is not eligible for getting processed by all BeanPostProcessors (for example: not eligible for auto-proxying)
08-Nov-2018 19:59:05
08-Nov-2018 19:59:05   .   ____          _            __ _ _
08-Nov-2018 19:59:05 /\\ / ___'_ __ _ _(_)_ __  __ _ \ \ \ \
08-Nov-2018 19:59:05 ( ( )\___ | '_ | '_| | '_ \/ _` | \ \ \ \
08-Nov-2018 19:59:05 \\/  ___)| |_)| | | | | || (_| |  ) ) ) )
08-Nov-2018 19:59:05   '  |____| .__|_| |_|_| |_\__, | / / / /
08-Nov-2018 19:59:05 =========|_|==============|___/=/_/_/_/
08-Nov-2018 19:59:05 :: Spring Boot ::        (v1.4.1.RELEASE)
08-Nov-2018 19:59:05
08-Nov-2018 19:59:05 2018-11-08 19:59:05.197  INFO 5597 --- [           main] c.c.c.ConfigServicePropertySourceLocator : Fetching config from server at: http://localhost:8888
08-Nov-2018 19:59:05 2018-11-08 19:59:05.200  WARN 5597 --- [           main] c.c.c.ConfigServicePropertySourceLocator : Could not locate PropertySource: I/O error on GET request for "http://localhost:8888//blah": Connection refused (Connection refused); nested exception is java.net.ConnectException: Connection refused (Connection refused)
08-Nov-2018 19:59:05 2018-11-08 19:59:05.205  INFO 5597 --- [           main] o.a.maven.surefire.booter.ForkedBooter   : The following profiles are active: blah
08-Nov-2018 19:59:05 2018-11-08 19:59:05.212  INFO 5597 --- [           main] s.c.a.AnnotationConfigApplicationContext : Refreshing org.springframework.context.annotation.AnnotationConfigApplicationContext@7e62cfa3: startup date [Thu Nov 08 19:59:05 UTC 2018]; parent: org.springframework.context.annotation.AnnotationConfigApplicationContext@17e9bc9e
08-Nov-2018 19:59:05 2018-11-08 19:59:05.338  INFO 5597 --- [           main] o.a.maven.surefire.booter.ForkedBooter   : Started ForkedBooter in 0.556 seconds (JVM running for 413.674)
08-Nov-2018 19:59:05 2018-11-08 19:59:05.339  INFO 5597 --- [           main] s.c.a.AnnotationConfigApplicationContext : Closing org.springframework.context.annotation.AnnotationConfigApplicationContext@7e62cfa3: startup date [Thu Nov 08 19:59:05 UTC 2018]; parent: org.springframework.context.annotation.AnnotationConfigApplicationContext@17e9bc9e
08-Nov-2018 19:59:05 2018-11-08 19:59:05.341 ERROR 5597 --- [           main] o.s.c.d.a.test.util.SchedulerRule        : SCHEDULER IS NOT AVAILABLE, SKIPPING TESTS
08-Nov-2018 19:59:05
08-Nov-2018 19:59:05 java.lang.IllegalArgumentException: no SchedulerOperations bean is available.  Skipping test.
08-Nov-2018 19:59:05         at org.springframework.util.Assert.notNull(Assert.java:115)
08-Nov-2018 19:59:05         at org.springframework.cloud.dataflow.acceptance.test.util.SchedulerRule.obtainResource(SchedulerRule.java:57)
08-Nov-2018 19:59:05         at org.springframework.cloud.scheduler.spi.junit.AbstractExternalResourceTestSupport.apply(AbstractExternalResourceTestSupport.java:58)
08-Nov-2018 19:59:05         at org.junit.rules.RunRules.applyAll(RunRules.java:26)
08-Nov-2018 19:59:05         at org.junit.rules.RunRules.<init>(RunRules.java:15)
08-Nov-2018 19:59:05         at org.junit.runners.ParentRunner.withClassRules(ParentRunner.java:245)
08-Nov-2018 19:59:05         at org.junit.runners.ParentRunner.classBlock(ParentRunner.java:194)
08-Nov-2018 19:59:05         at org.junit.runners.ParentRunner.run(ParentRunner.java:362)
08-Nov-2018 19:59:05         at org.springframework.test.context.junit4.SpringJUnit4ClassRunner.run(SpringJUnit4ClassRunner.java:191)
08-Nov-2018 19:59:05         at org.apache.maven.surefire.junit4.JUnit4Provider.execute(JUnit4Provider.java:283)
08-Nov-2018 19:59:05         at org.apache.maven.surefire.junit4.JUnit4Provider.executeWithRerun(JUnit4Provider.java:173)
08-Nov-2018 19:59:05         at org.apache.maven.surefire.junit4.JUnit4Provider.executeTestSet(JUnit4Provider.java:153)
08-Nov-2018 19:59:05         at org.apache.maven.surefire.junit4.JUnit4Provider.invoke(JUnit4Provider.java:128)
08-Nov-2018 19:59:05         at org.apache.maven.surefire.booter.ForkedBooter.invokeProviderInSameClassLoader(ForkedBooter.java:203)
08-Nov-2018 19:59:05         at org.apache.maven.surefire.booter.ForkedBooter.runSuitesInProcess(ForkedBooter.java:155)
08-Nov-2018 19:59:05         at org.apache.maven.surefire.booter.ForkedBooter.main(ForkedBooter.java:103)
08-Nov-2018 19:59:05
08-Nov-2018 19:59:05 Tests run: 1, Failures: 0, Errors: 0, Skipped: 1, Time elapsed: 0.582 sec - in org.springframework.cloud.dataflow.acceptance.test.SchedulerTests
08-Nov-2018 19:59:05 Running org.springframework.cloud.dataflow.acceptance.test.NamedChannelTests
08-Nov-2018 19:59:05 2018-11-08 19:59:05.358  INFO 5597 --- [           main] .b.t.c.SpringBootTestContextBootstrapper : Neither @ContextConfiguration nor @ContextHierarchy found for test class [org.springframework.cloud.dataflow.acceptance.test.NamedChannelTests], using SpringBootContextLoader
08-Nov-2018 19:59:05 2018-11-08 19:59:05.371  INFO 5597 --- [           main] .b.t.c.SpringBootTestContextBootstrapper : Loaded default TestExecutionListener class names from location [META-INF/spring.factories]: [org.springframework.boot.test.mock.mockito.MockitoTestExecutionListener, org.springframework.boot.test.mock.mockito.ResetMocksTestExecutionListener, org.springframework.boot.test.autoconfigure.restdocs.RestDocsTestExecutionListener, org.springframework.boot.test.autoconfigure.web.client.MockRestServiceServerResetTestExecutionListener, org.springframework.boot.test.autoconfigure.web.servlet.MockMvcPrintOnlyOnFailureTestExecutionListener, org.springframework.boot.test.autoconfigure.web.servlet.WebDriverTestExecutionListener, org.springframework.test.context.web.ServletTestExecutionListener, org.springframework.test.context.support.DirtiesContextBeforeModesTestExecutionListener, org.springframework.test.context.support.DependencyInjectionTestExecutionListener, org.springframework.test.context.support.DirtiesContextTestExecutionListener, org.springframework.test.context.transaction.TransactionalTestExecutionListener, org.springframework.test.context.jdbc.SqlScriptsTestExecutionListener]
08-Nov-2018 19:59:05 2018-11-08 19:59:05.374  INFO 5597 --- [           main] .b.t.c.SpringBootTestContextBootstrapper : Using TestExecutionListeners: [org.springframework.test.context.web.ServletTestExecutionListener@20d33ea, org.springframework.test.context.support.DirtiesContextBeforeModesTestExecutionListener@73613ae5, org.springframework.boot.test.autoconfigure.SpringBootDependencyInjectionTestExecutionListener@5a13fcf3, org.springframework.test.context.support.DirtiesContextTestExecutionListener@250b5e5b, org.springframework.test.context.transaction.TransactionalTestExecutionListener@4ef2ab73, org.springframework.test.context.jdbc.SqlScriptsTestExecutionListener@34be065a, org.springframework.boot.test.autoconfigure.restdocs.RestDocsTestExecutionListener@718f805a, org.springframework.boot.test.autoconfigure.web.servlet.MockMvcPrintOnlyOnFailureTestExecutionListener@e09f1b6, org.springframework.boot.test.mock.mockito.ResetMocksTestExecutionListener@557b6a37, org.springframework.boot.test.autoconfigure.web.client.MockRestServiceServerResetTestExecutionListener@11b32a14, org.springframework.boot.test.autoconfigure.web.servlet.WebDriverTestExecutionListener@1c33e528, org.springframework.boot.test.mock.mockito.MockitoTestExecutionListener@5df63359]
08-Nov-2018 19:59:05 2018-11-08 19:59:05.456  INFO 5597 --- [           main] junit.logTestName                        : Starting Test testDestination(org.springframework.cloud.dataflow.acceptance.test.NamedChannelTests)
08-Nov-2018 19:59:05 2018-11-08 19:59:05.469  INFO 5597 --- [           main] o.s.c.d.a.test.NamedChannelTests         : Creating stream 'LOG-DESTINATION-SINK'
08-Nov-2018 19:59:05 2018-11-08 19:59:05.498  INFO 5597 --- [           main] o.s.c.d.a.test.NamedChannelTests         : Deploying stream 'LOG-DESTINATION-SINK' with properties: {app.*.logging.file=${PID}-test.log, app.*.endpoints.logfile.sensitive=false, app.*.management.endpoints.web.exposure.include=*}
08-Nov-2018 19:59:05 2018-11-08 19:59:05.776  INFO 5597 --- [           main] o.s.c.d.a.test.NamedChannelTests         : Checking: Stream=LOG-DESTINATION-SINK, status = deploying, status description = The stream is being deployed.
08-Nov-2018 19:59:05 2018-11-08 19:59:05.776  INFO 5597 --- [           main] o.s.c.d.a.test.NamedChannelTests         : Sleeping to check status of Stream=LOG-DESTINATION-SINK
08-Nov-2018 19:59:15 2018-11-08 19:59:15.811  INFO 5597 --- [           main] o.s.c.d.a.test.NamedChannelTests         : Checking: Stream=LOG-DESTINATION-SINK, status = deployed, status description = The stream has been successfully deployed
08-Nov-2018 19:59:15 2018-11-08 19:59:15.860  INFO 5597 --- [           main] o.s.c.d.a.test.NamedChannelTests         : Sleeping to check status of Stream=LOG-DESTINATION-SINK
08-Nov-2018 19:59:25 2018-11-08 19:59:25.860  INFO 5597 --- [           main] o.s.c.d.a.test.NamedChannelTests         : Stream 'LOG-DESTINATION-SINK' started with status: deployed
08-Nov-2018 19:59:25 2018-11-08 19:59:25.860  INFO 5597 --- [           main] o.s.c.d.a.test.NamedChannelTests         : App 'log' has instances: {LOG-DESTINATION-SINK.log-v1-0=http://10.194.6.23:53278}
08-Nov-2018 19:59:25 2018-11-08 19:59:25.860  INFO 5597 --- [           main] o.s.c.d.a.test.NamedChannelTests         : Looking for 'Started LogSink' in logfile for log
08-Nov-2018 19:59:35 2018-11-08 19:59:35.861  INFO 5597 --- [           main] o.s.c.d.a.test.NamedChannelTests         : Requesting log for app LOG-DESTINATION-SINK.log-v1-0
08-Nov-2018 19:59:36 2018-11-08 19:59:36.027  INFO 5597 --- [           main] o.s.c.d.a.test.NamedChannelTests         : Retrieved logfile from 'http://10.194.6.23:53278/logfile
08-Nov-2018 19:59:36 2018-11-08 19:59:36.027  INFO 5597 --- [           main] o.s.c.d.a.test.NamedChannelTests         : Matched all 'Started LogSink' in logfile for instance LOG-DESTINATION-SINK.log-v1-0 of app log
08-Nov-2018 19:59:36 2018-11-08 19:59:36.028  INFO 5597 --- [           main] o.s.c.d.a.test.NamedChannelTests         : Creating stream 'HTTP-DESTINATION-SOURCE'
08-Nov-2018 19:59:36 2018-11-08 19:59:36.057  INFO 5597 --- [           main] o.s.c.d.a.test.NamedChannelTests         : Deploying stream 'HTTP-DESTINATION-SOURCE' with properties: {app.*.logging.file=${PID}-test.log, app.*.endpoints.logfile.sensitive=false, app.*.management.endpoints.web.exposure.include=*}
08-Nov-2018 19:59:36 2018-11-08 19:59:36.279  INFO 5597 --- [           main] o.s.c.d.a.test.NamedChannelTests         : Checking: Stream=HTTP-DESTINATION-SOURCE, status = deploying, status description = The stream is being deployed.
08-Nov-2018 19:59:36 2018-11-08 19:59:36.279  INFO 5597 --- [           main] o.s.c.d.a.test.NamedChannelTests         : Sleeping to check status of Stream=HTTP-DESTINATION-SOURCE
08-Nov-2018 19:59:46 2018-11-08 19:59:46.325  INFO 5597 --- [           main] o.s.c.d.a.test.NamedChannelTests         : Checking: Stream=HTTP-DESTINATION-SOURCE, status = deployed, status description = The stream has been successfully deployed
08-Nov-2018 19:59:46 2018-11-08 19:59:46.373  INFO 5597 --- [           main] o.s.c.d.a.test.NamedChannelTests         : Sleeping to check status of Stream=HTTP-DESTINATION-SOURCE
08-Nov-2018 19:59:56 2018-11-08 19:59:56.373  INFO 5597 --- [           main] o.s.c.d.a.test.NamedChannelTests         : Stream 'HTTP-DESTINATION-SOURCE' started with status: deployed
08-Nov-2018 19:59:56 2018-11-08 19:59:56.373  INFO 5597 --- [           main] o.s.c.d.a.test.NamedChannelTests         : App 'http' has instances: {HTTP-DESTINATION-SOURCE.http-v1-0=http://10.194.6.23:57279}
08-Nov-2018 19:59:56 2018-11-08 19:59:56.373  INFO 5597 --- [           main] o.s.c.d.a.test.NamedChannelTests         : Looking for 'Started HttpSource' in logfile for http
08-Nov-2018 20:00:06 2018-11-08 20:00:06.373  INFO 5597 --- [           main] o.s.c.d.a.test.NamedChannelTests         : Requesting log for app HTTP-DESTINATION-SOURCE.http-v1-0
08-Nov-2018 20:00:06 2018-11-08 20:00:06.567  INFO 5597 --- [           main] o.s.c.d.a.test.NamedChannelTests         : Retrieved logfile from 'http://10.194.6.23:57279/logfile
08-Nov-2018 20:00:06 2018-11-08 20:00:06.567  INFO 5597 --- [           main] o.s.c.d.a.test.NamedChannelTests         : Matched all 'Started HttpSource' in logfile for instance HTTP-DESTINATION-SOURCE.http-v1-0 of app http
08-Nov-2018 20:00:06 2018-11-08 20:00:06.709  INFO 5597 --- [           main] o.s.c.d.a.test.NamedChannelTests         : Looking for 'abcdefg' in logfile for log
08-Nov-2018 20:00:16 2018-11-08 20:00:16.709  INFO 5597 --- [           main] o.s.c.d.a.test.NamedChannelTests         : Requesting log for app LOG-DESTINATION-SINK.log-v1-0
08-Nov-2018 20:00:16 2018-11-08 20:00:16.728  INFO 5597 --- [           main] o.s.c.d.a.test.NamedChannelTests         : Retrieved logfile from 'http://10.194.6.23:53278/logfile
08-Nov-2018 20:00:16 2018-11-08 20:00:16.729  INFO 5597 --- [           main] o.s.c.d.a.test.NamedChannelTests         : Matched all 'abcdefg' in logfile for instance LOG-DESTINATION-SINK.log-v1-0 of app log
08-Nov-2018 20:00:16 2018-11-08 20:00:16.731  INFO 5597 --- [           main] junit.logTestName                        : Test testDestination(org.springframework.cloud.dataflow.acceptance.test.NamedChannelTests) Succeeded
08-Nov-2018 20:00:16 2018-11-08 20:00:16.731  INFO 5597 --- [           main] junit.logTestName                        : Finished Test testDestination(org.springframework.cloud.dataflow.acceptance.test.NamedChannelTests)
08-Nov-2018 20:00:16 2018-11-08 20:00:16.731  INFO 5597 --- [           main] o.s.c.d.a.test.NamedChannelTests         : Destroy all streams
08-Nov-2018 20:00:17 2018-11-08 20:00:17.014  INFO 5597 --- [           main] junit.logTestName                        : Starting Test testTap(org.springframework.cloud.dataflow.acceptance.test.NamedChannelTests)
08-Nov-2018 20:00:17 2018-11-08 20:00:17.015  INFO 5597 --- [           main] o.s.c.d.a.test.NamedChannelTests         : Creating stream 'TAPHTTP'
08-Nov-2018 20:00:17 2018-11-08 20:00:17.036  INFO 5597 --- [           main] o.s.c.d.a.test.NamedChannelTests         : Deploying stream 'TAPHTTP' with properties: {app.*.logging.file=${PID}-test.log, app.*.endpoints.logfile.sensitive=false, app.*.management.endpoints.web.exposure.include=*}
08-Nov-2018 20:00:17 2018-11-08 20:00:17.338  INFO 5597 --- [           main] o.s.c.d.a.test.NamedChannelTests         : Checking: Stream=TAPHTTP, status = deploying, status description = The stream is being deployed.
08-Nov-2018 20:00:17 2018-11-08 20:00:17.338  INFO 5597 --- [           main] o.s.c.d.a.test.NamedChannelTests         : Sleeping to check status of Stream=TAPHTTP
08-Nov-2018 20:00:27 2018-11-08 20:00:27.404  INFO 5597 --- [           main] o.s.c.d.a.test.NamedChannelTests         : Checking: Stream=TAPHTTP, status = deploying, status description = The stream is being deployed.
08-Nov-2018 20:00:27 2018-11-08 20:00:27.404  INFO 5597 --- [           main] o.s.c.d.a.test.NamedChannelTests         : Sleeping to check status of Stream=TAPHTTP
08-Nov-2018 20:00:37 2018-11-08 20:00:37.463  INFO 5597 --- [           main] o.s.c.d.a.test.NamedChannelTests         : Checking: Stream=TAPHTTP, status = deployed, status description = The stream has been successfully deployed
08-Nov-2018 20:00:37 2018-11-08 20:00:37.709  INFO 5597 --- [           main] o.s.c.d.a.test.NamedChannelTests         : Sleeping to check status of Stream=TAPHTTP
08-Nov-2018 20:00:47 2018-11-08 20:00:47.709  INFO 5597 --- [           main] o.s.c.d.a.test.NamedChannelTests         : Stream 'TAPHTTP' started with status: deployed
08-Nov-2018 20:00:47 2018-11-08 20:00:47.709  INFO 5597 --- [           main] o.s.c.d.a.test.NamedChannelTests         : App 'log' has instances: {TAPHTTP.log-v1-0=http://10.194.6.23:53128}
08-Nov-2018 20:00:47 2018-11-08 20:00:47.709  INFO 5597 --- [           main] o.s.c.d.a.test.NamedChannelTests         : App 'http' has instances: {TAPHTTP.http-v1-0=http://10.194.6.23:50180}
08-Nov-2018 20:00:47 2018-11-08 20:00:47.709  INFO 5597 --- [           main] o.s.c.d.a.test.NamedChannelTests         : Looking for 'Started HttpSource' in logfile for http
08-Nov-2018 20:00:57 2018-11-08 20:00:57.710  INFO 5597 --- [           main] o.s.c.d.a.test.NamedChannelTests         : Requesting log for app TAPHTTP.http-v1-0
08-Nov-2018 20:00:57 2018-11-08 20:00:57.914  INFO 5597 --- [           main] o.s.c.d.a.test.NamedChannelTests         : Retrieved logfile from 'http://10.194.6.23:50180/logfile
08-Nov-2018 20:00:57 2018-11-08 20:00:57.914  INFO 5597 --- [           main] o.s.c.d.a.test.NamedChannelTests         : Matched all 'Started HttpSource' in logfile for instance TAPHTTP.http-v1-0 of app http
08-Nov-2018 20:00:57 2018-11-08 20:00:57.914  INFO 5597 --- [           main] o.s.c.d.a.test.NamedChannelTests         : Looking for 'Started LogSink' in logfile for log
08-Nov-2018 20:01:07 2018-11-08 20:01:07.914  INFO 5597 --- [           main] o.s.c.d.a.test.NamedChannelTests         : Requesting log for app TAPHTTP.log-v1-0
08-Nov-2018 20:01:08 2018-11-08 20:01:08.081  INFO 5597 --- [           main] o.s.c.d.a.test.NamedChannelTests         : Retrieved logfile from 'http://10.194.6.23:53128/logfile
08-Nov-2018 20:01:08 2018-11-08 20:01:08.081  INFO 5597 --- [           main] o.s.c.d.a.test.NamedChannelTests         : Matched all 'Started LogSink' in logfile for instance TAPHTTP.log-v1-0 of app log
08-Nov-2018 20:01:08 2018-11-08 20:01:08.082  INFO 5597 --- [           main] o.s.c.d.a.test.NamedChannelTests         : Creating stream 'TAPSTREAM'
08-Nov-2018 20:01:08 2018-11-08 20:01:08.104  INFO 5597 --- [           main] o.s.c.d.a.test.NamedChannelTests         : Deploying stream 'TAPSTREAM' with properties: {app.*.logging.file=${PID}-test.log, app.*.endpoints.logfile.sensitive=false, app.*.management.endpoints.web.exposure.include=*}
08-Nov-2018 20:01:08 2018-11-08 20:01:08.369  INFO 5597 --- [           main] o.s.c.d.a.test.NamedChannelTests         : Checking: Stream=TAPSTREAM, status = deploying, status description = The stream is being deployed.
08-Nov-2018 20:01:08 2018-11-08 20:01:08.369  INFO 5597 --- [           main] o.s.c.d.a.test.NamedChannelTests         : Sleeping to check status of Stream=TAPSTREAM
08-Nov-2018 20:01:18 2018-11-08 20:01:18.439  INFO 5597 --- [           main] o.s.c.d.a.test.NamedChannelTests         : Checking: Stream=TAPSTREAM, status = deployed, status description = The stream has been successfully deployed
08-Nov-2018 20:01:18 2018-11-08 20:01:18.501  INFO 5597 --- [           main] o.s.c.d.a.test.NamedChannelTests         : Sleeping to check status of Stream=TAPSTREAM
08-Nov-2018 20:01:28 2018-11-08 20:01:28.501  INFO 5597 --- [           main] o.s.c.d.a.test.NamedChannelTests         : Stream 'TAPSTREAM' started with status: deployed
08-Nov-2018 20:01:28 2018-11-08 20:01:28.501  INFO 5597 --- [           main] o.s.c.d.a.test.NamedChannelTests         : App 'log' has instances: {TAPSTREAM.log-v1-0=http://10.194.6.23:57724}
08-Nov-2018 20:01:28 2018-11-08 20:01:28.501  INFO 5597 --- [           main] o.s.c.d.a.test.NamedChannelTests         : Looking for 'Started LogSink' in logfile for log
08-Nov-2018 20:01:38 2018-11-08 20:01:38.501  INFO 5597 --- [           main] o.s.c.d.a.test.NamedChannelTests         : Requesting log for app TAPSTREAM.log-v1-0
08-Nov-2018 20:01:38 2018-11-08 20:01:38.652  INFO 5597 --- [           main] o.s.c.d.a.test.NamedChannelTests         : Retrieved logfile from 'http://10.194.6.23:57724/logfile
08-Nov-2018 20:01:38 2018-11-08 20:01:38.653  INFO 5597 --- [           main] o.s.c.d.a.test.NamedChannelTests         : Matched all 'Started LogSink' in logfile for instance TAPSTREAM.log-v1-0 of app log
08-Nov-2018 20:01:38 2018-11-08 20:01:38.791  INFO 5597 --- [           main] o.s.c.d.a.test.NamedChannelTests         : Looking for 'abcdefg' in logfile for log
08-Nov-2018 20:01:48 2018-11-08 20:01:48.792  INFO 5597 --- [           main] o.s.c.d.a.test.NamedChannelTests         : Requesting log for app TAPSTREAM.log-v1-0
08-Nov-2018 20:01:48 2018-11-08 20:01:48.805  INFO 5597 --- [           main] o.s.c.d.a.test.NamedChannelTests         : Retrieved logfile from 'http://10.194.6.23:57724/logfile
08-Nov-2018 20:01:48 2018-11-08 20:01:48.805  INFO 5597 --- [           main] o.s.c.d.a.test.NamedChannelTests         : Matched all 'abcdefg' in logfile for instance TAPSTREAM.log-v1-0 of app log
08-Nov-2018 20:01:48 2018-11-08 20:01:48.807  INFO 5597 --- [           main] junit.logTestName                        : Test testTap(org.springframework.cloud.dataflow.acceptance.test.NamedChannelTests) Succeeded
08-Nov-2018 20:01:48 2018-11-08 20:01:48.807  INFO 5597 --- [           main] junit.logTestName                        : Finished Test testTap(org.springframework.cloud.dataflow.acceptance.test.NamedChannelTests)
08-Nov-2018 20:01:48 2018-11-08 20:01:48.807  INFO 5597 --- [           main] o.s.c.d.a.test.NamedChannelTests         : Destroy all streams
08-Nov-2018 20:01:49 2018-11-08 20:01:49.104  INFO 5597 --- [           main] junit.logTestName                        : Starting Test manyToOneTest(org.springframework.cloud.dataflow.acceptance.test.NamedChannelTests)
08-Nov-2018 20:01:49 2018-11-08 20:01:49.105  INFO 5597 --- [           main] o.s.c.d.a.test.NamedChannelTests         : Creating stream 'MANY-TO-ONE'
08-Nov-2018 20:01:49 2018-11-08 20:01:49.130  INFO 5597 --- [           main] o.s.c.d.a.test.NamedChannelTests         : Deploying stream 'MANY-TO-ONE' with properties: {app.*.logging.file=${PID}-test.log, app.*.endpoints.logfile.sensitive=false, app.*.management.endpoints.web.exposure.include=*}
08-Nov-2018 20:01:49 2018-11-08 20:01:49.318  INFO 5597 --- [           main] o.s.c.d.a.test.NamedChannelTests         : Checking: Stream=MANY-TO-ONE, status = deploying, status description = The stream is being deployed.
08-Nov-2018 20:01:49 2018-11-08 20:01:49.318  INFO 5597 --- [           main] o.s.c.d.a.test.NamedChannelTests         : Sleeping to check status of Stream=MANY-TO-ONE
08-Nov-2018 20:01:59 2018-11-08 20:01:59.346  INFO 5597 --- [           main] o.s.c.d.a.test.NamedChannelTests         : Checking: Stream=MANY-TO-ONE, status = deployed, status description = The stream has been successfully deployed
08-Nov-2018 20:01:59 2018-11-08 20:01:59.381  INFO 5597 --- [           main] o.s.c.d.a.test.NamedChannelTests         : Sleeping to check status of Stream=MANY-TO-ONE
08-Nov-2018 20:02:09 2018-11-08 20:02:09.382  INFO 5597 --- [           main] o.s.c.d.a.test.NamedChannelTests         : Stream 'MANY-TO-ONE' started with status: deployed
08-Nov-2018 20:02:09 2018-11-08 20:02:09.382  INFO 5597 --- [           main] o.s.c.d.a.test.NamedChannelTests         : App 'log' has instances: {MANY-TO-ONE.log-v1-0=http://10.194.6.23:54462}
08-Nov-2018 20:02:09 2018-11-08 20:02:09.382  INFO 5597 --- [           main] o.s.c.d.a.test.NamedChannelTests         : Looking for 'Started LogSink' in logfile for log
08-Nov-2018 20:02:19 2018-11-08 20:02:19.382  INFO 5597 --- [           main] o.s.c.d.a.test.NamedChannelTests         : Requesting log for app MANY-TO-ONE.log-v1-0
08-Nov-2018 20:02:19 2018-11-08 20:02:19.537  INFO 5597 --- [           main] o.s.c.d.a.test.NamedChannelTests         : Retrieved logfile from 'http://10.194.6.23:54462/logfile
08-Nov-2018 20:02:19 2018-11-08 20:02:19.537  INFO 5597 --- [           main] o.s.c.d.a.test.NamedChannelTests         : Matched all 'Started LogSink' in logfile for instance MANY-TO-ONE.log-v1-0 of app log
08-Nov-2018 20:02:19 2018-11-08 20:02:19.537  INFO 5597 --- [           main] o.s.c.d.a.test.NamedChannelTests         : Creating stream 'HTTP-SOURCE-1'
08-Nov-2018 20:02:19 2018-11-08 20:02:19.556  INFO 5597 --- [           main] o.s.c.d.a.test.NamedChannelTests         : Deploying stream 'HTTP-SOURCE-1' with properties: {app.*.logging.file=${PID}-test.log, app.*.endpoints.logfile.sensitive=false, app.*.management.endpoints.web.exposure.include=*}
08-Nov-2018 20:02:19 2018-11-08 20:02:19.727  INFO 5597 --- [           main] o.s.c.d.a.test.NamedChannelTests         : Checking: Stream=HTTP-SOURCE-1, status = deploying, status description = The stream is being deployed.
08-Nov-2018 20:02:19 2018-11-08 20:02:19.727  INFO 5597 --- [           main] o.s.c.d.a.test.NamedChannelTests         : Sleeping to check status of Stream=HTTP-SOURCE-1
08-Nov-2018 20:02:29 2018-11-08 20:02:29.770  INFO 5597 --- [           main] o.s.c.d.a.test.NamedChannelTests         : Checking: Stream=HTTP-SOURCE-1, status = deployed, status description = The stream has been successfully deployed
08-Nov-2018 20:02:29 2018-11-08 20:02:29.804  INFO 5597 --- [           main] o.s.c.d.a.test.NamedChannelTests         : Sleeping to check status of Stream=HTTP-SOURCE-1
08-Nov-2018 20:02:39 2018-11-08 20:02:39.804  INFO 5597 --- [           main] o.s.c.d.a.test.NamedChannelTests         : Stream 'HTTP-SOURCE-1' started with status: deployed
08-Nov-2018 20:02:39 2018-11-08 20:02:39.804  INFO 5597 --- [           main] o.s.c.d.a.test.NamedChannelTests         : App 'http' has instances: {HTTP-SOURCE-1.http-v1-0=http://10.194.6.23:55928}
08-Nov-2018 20:02:39 2018-11-08 20:02:39.804  INFO 5597 --- [           main] o.s.c.d.a.test.NamedChannelTests         : Looking for 'Started HttpSource' in logfile for http
08-Nov-2018 20:02:49 2018-11-08 20:02:49.804  INFO 5597 --- [           main] o.s.c.d.a.test.NamedChannelTests         : Requesting log for app HTTP-SOURCE-1.http-v1-0
08-Nov-2018 20:02:49 2018-11-08 20:02:49.945  INFO 5597 --- [           main] o.s.c.d.a.test.NamedChannelTests         : Retrieved logfile from 'http://10.194.6.23:55928/logfile
08-Nov-2018 20:02:49 2018-11-08 20:02:49.946  INFO 5597 --- [           main] o.s.c.d.a.test.NamedChannelTests         : Matched all 'Started HttpSource' in logfile for instance HTTP-SOURCE-1.http-v1-0 of app http
08-Nov-2018 20:02:49 2018-11-08 20:02:49.946  INFO 5597 --- [           main] o.s.c.d.a.test.NamedChannelTests         : Creating stream 'HTTP-SOURCE-2'
08-Nov-2018 20:02:49 2018-11-08 20:02:49.966  INFO 5597 --- [           main] o.s.c.d.a.test.NamedChannelTests         : Deploying stream 'HTTP-SOURCE-2' with properties: {app.*.logging.file=${PID}-test.log, app.*.endpoints.logfile.sensitive=false, app.*.management.endpoints.web.exposure.include=*}
08-Nov-2018 20:02:50 2018-11-08 20:02:50.186  INFO 5597 --- [           main] o.s.c.d.a.test.NamedChannelTests         : Checking: Stream=HTTP-SOURCE-2, status = deploying, status description = The stream is being deployed.
08-Nov-2018 20:02:50 2018-11-08 20:02:50.186  INFO 5597 --- [           main] o.s.c.d.a.test.NamedChannelTests         : Sleeping to check status of Stream=HTTP-SOURCE-2
08-Nov-2018 20:03:00 2018-11-08 20:03:00.248  INFO 5597 --- [           main] o.s.c.d.a.test.NamedChannelTests         : Checking: Stream=HTTP-SOURCE-2, status = deployed, status description = The stream has been successfully deployed
08-Nov-2018 20:03:00 2018-11-08 20:03:00.318  INFO 5597 --- [           main] o.s.c.d.a.test.NamedChannelTests         : Sleeping to check status of Stream=HTTP-SOURCE-2
08-Nov-2018 20:03:10 2018-11-08 20:03:10.318  INFO 5597 --- [           main] o.s.c.d.a.test.NamedChannelTests         : Stream 'HTTP-SOURCE-2' started with status: deployed
08-Nov-2018 20:03:10 2018-11-08 20:03:10.319  INFO 5597 --- [           main] o.s.c.d.a.test.NamedChannelTests         : App 'http' has instances: {HTTP-SOURCE-2.http-v1-0=http://10.194.6.23:55692}
08-Nov-2018 20:03:10 2018-11-08 20:03:10.319  INFO 5597 --- [           main] o.s.c.d.a.test.NamedChannelTests         : Looking for 'Started HttpSource' in logfile for http
08-Nov-2018 20:03:20 2018-11-08 20:03:20.319  INFO 5597 --- [           main] o.s.c.d.a.test.NamedChannelTests         : Requesting log for app HTTP-SOURCE-2.http-v1-0
08-Nov-2018 20:03:20 2018-11-08 20:03:20.502  INFO 5597 --- [           main] o.s.c.d.a.test.NamedChannelTests         : Retrieved logfile from 'http://10.194.6.23:55692/logfile
08-Nov-2018 20:03:20 2018-11-08 20:03:20.503  INFO 5597 --- [           main] o.s.c.d.a.test.NamedChannelTests         : Matched all 'Started HttpSource' in logfile for instance HTTP-SOURCE-2.http-v1-0 of app http
08-Nov-2018 20:03:20 2018-11-08 20:03:20.668  INFO 5597 --- [           main] o.s.c.d.a.test.NamedChannelTests         : Looking for 'abcdefg' in logfile for log
08-Nov-2018 20:03:30 2018-11-08 20:03:30.668  INFO 5597 --- [           main] o.s.c.d.a.test.NamedChannelTests         : Requesting log for app MANY-TO-ONE.log-v1-0
08-Nov-2018 20:03:30 2018-11-08 20:03:30.682  INFO 5597 --- [           main] o.s.c.d.a.test.NamedChannelTests         : Retrieved logfile from 'http://10.194.6.23:54462/logfile
08-Nov-2018 20:03:30 2018-11-08 20:03:30.682  INFO 5597 --- [           main] o.s.c.d.a.test.NamedChannelTests         : Matched all 'abcdefg' in logfile for instance MANY-TO-ONE.log-v1-0 of app log
08-Nov-2018 20:03:30 2018-11-08 20:03:30.827  INFO 5597 --- [           main] o.s.c.d.a.test.NamedChannelTests         : Looking for 'hijklmn' in logfile for log
08-Nov-2018 20:03:40 2018-11-08 20:03:40.827  INFO 5597 --- [           main] o.s.c.d.a.test.NamedChannelTests         : Requesting log for app MANY-TO-ONE.log-v1-0
08-Nov-2018 20:03:40 2018-11-08 20:03:40.837  INFO 5597 --- [           main] o.s.c.d.a.test.NamedChannelTests         : Retrieved logfile from 'http://10.194.6.23:54462/logfile
08-Nov-2018 20:03:40 2018-11-08 20:03:40.837  INFO 5597 --- [           main] o.s.c.d.a.test.NamedChannelTests         : Matched all 'hijklmn' in logfile for instance MANY-TO-ONE.log-v1-0 of app log
08-Nov-2018 20:03:40 2018-11-08 20:03:40.838  INFO 5597 --- [           main] junit.logTestName                        : Test manyToOneTest(org.springframework.cloud.dataflow.acceptance.test.NamedChannelTests) Succeeded
08-Nov-2018 20:03:40 2018-11-08 20:03:40.838  INFO 5597 --- [           main] junit.logTestName                        : Finished Test manyToOneTest(org.springframework.cloud.dataflow.acceptance.test.NamedChannelTests)
08-Nov-2018 20:03:40 2018-11-08 20:03:40.838  INFO 5597 --- [           main] o.s.c.d.a.test.NamedChannelTests         : Destroy all streams
08-Nov-2018 20:03:41 2018-11-08 20:03:41.157  INFO 5597 --- [           main] junit.logTestName                        : Starting Test directedGraphTest(org.springframework.cloud.dataflow.acceptance.test.NamedChannelTests)
08-Nov-2018 20:03:41 2018-11-08 20:03:41.158  INFO 5597 --- [           main] o.s.c.d.a.test.NamedChannelTests         : Creating stream 'DIRECTED-GRAPH-DESTINATION1'
08-Nov-2018 20:03:41 2018-11-08 20:03:41.178  INFO 5597 --- [           main] o.s.c.d.a.test.NamedChannelTests         : Deploying stream 'DIRECTED-GRAPH-DESTINATION1' with properties: {app.*.logging.file=${PID}-test.log, app.*.endpoints.logfile.sensitive=false, app.*.management.endpoints.web.exposure.include=*}
08-Nov-2018 20:03:41 2018-11-08 20:03:41.499  INFO 5597 --- [           main] o.s.c.d.a.test.NamedChannelTests         : Checking: Stream=DIRECTED-GRAPH-DESTINATION1, status = deploying, status description = The stream is being deployed.
08-Nov-2018 20:03:41 2018-11-08 20:03:41.500  INFO 5597 --- [           main] o.s.c.d.a.test.NamedChannelTests         : Sleeping to check status of Stream=DIRECTED-GRAPH-DESTINATION1
08-Nov-2018 20:03:51 2018-11-08 20:03:51.531  INFO 5597 --- [           main] o.s.c.d.a.test.NamedChannelTests         : Checking: Stream=DIRECTED-GRAPH-DESTINATION1, status = deploying, status description = The stream is being deployed.
08-Nov-2018 20:03:51 2018-11-08 20:03:51.531  INFO 5597 --- [           main] o.s.c.d.a.test.NamedChannelTests         : Sleeping to check status of Stream=DIRECTED-GRAPH-DESTINATION1
08-Nov-2018 20:04:01 2018-11-08 20:04:01.557  INFO 5597 --- [           main] o.s.c.d.a.test.NamedChannelTests         : Checking: Stream=DIRECTED-GRAPH-DESTINATION1, status = deployed, status description = The stream has been successfully deployed
08-Nov-2018 20:04:01 2018-11-08 20:04:01.607  INFO 5597 --- [           main] o.s.c.d.a.test.NamedChannelTests         : Sleeping to check status of Stream=DIRECTED-GRAPH-DESTINATION1
08-Nov-2018 20:04:11 2018-11-08 20:04:11.608  INFO 5597 --- [           main] o.s.c.d.a.test.NamedChannelTests         : Stream 'DIRECTED-GRAPH-DESTINATION1' started with status: deployed
08-Nov-2018 20:04:11 2018-11-08 20:04:11.608  INFO 5597 --- [           main] o.s.c.d.a.test.NamedChannelTests         : App 'transform' has instances: {DIRECTED-GRAPH-DESTINATION1.transform-v1-0=http://10.194.6.23:57779}
08-Nov-2018 20:04:11 2018-11-08 20:04:11.608  INFO 5597 --- [           main] o.s.c.d.a.test.NamedChannelTests         : App 'log' has instances: {DIRECTED-GRAPH-DESTINATION1.log-v1-0=http://10.194.6.23:58614}
08-Nov-2018 20:04:11 2018-11-08 20:04:11.608  INFO 5597 --- [           main] o.s.c.d.a.test.NamedChannelTests         : Looking for 'Started LogSink' in logfile for log
08-Nov-2018 20:04:21 2018-11-08 20:04:21.609  INFO 5597 --- [           main] o.s.c.d.a.test.NamedChannelTests         : Requesting log for app DIRECTED-GRAPH-DESTINATION1.log-v1-0
08-Nov-2018 20:04:21 2018-11-08 20:04:21.769  INFO 5597 --- [           main] o.s.c.d.a.test.NamedChannelTests         : Retrieved logfile from 'http://10.194.6.23:58614/logfile
08-Nov-2018 20:04:21 2018-11-08 20:04:21.769  INFO 5597 --- [           main] o.s.c.d.a.test.NamedChannelTests         : Matched all 'Started LogSink' in logfile for instance DIRECTED-GRAPH-DESTINATION1.log-v1-0 of app log
08-Nov-2018 20:04:21 2018-11-08 20:04:21.770  INFO 5597 --- [           main] o.s.c.d.a.test.NamedChannelTests         : Creating stream 'DIRECTED-GRAPH-DESTINATION2'
08-Nov-2018 20:04:21 2018-11-08 20:04:21.798  INFO 5597 --- [           main] o.s.c.d.a.test.NamedChannelTests         : Deploying stream 'DIRECTED-GRAPH-DESTINATION2' with properties: {app.*.logging.file=${PID}-test.log, app.*.endpoints.logfile.sensitive=false, app.*.management.endpoints.web.exposure.include=*}
08-Nov-2018 20:04:22 2018-11-08 20:04:22.039  INFO 5597 --- [           main] o.s.c.d.a.test.NamedChannelTests         : Checking: Stream=DIRECTED-GRAPH-DESTINATION2, status = deploying, status description = The stream is being deployed.
08-Nov-2018 20:04:22 2018-11-08 20:04:22.040  INFO 5597 --- [           main] o.s.c.d.a.test.NamedChannelTests         : Sleeping to check status of Stream=DIRECTED-GRAPH-DESTINATION2
08-Nov-2018 20:04:32 2018-11-08 20:04:32.108  INFO 5597 --- [           main] o.s.c.d.a.test.NamedChannelTests         : Checking: Stream=DIRECTED-GRAPH-DESTINATION2, status = deploying, status description = The stream is being deployed.
08-Nov-2018 20:04:32 2018-11-08 20:04:32.109  INFO 5597 --- [           main] o.s.c.d.a.test.NamedChannelTests         : Sleeping to check status of Stream=DIRECTED-GRAPH-DESTINATION2
08-Nov-2018 20:04:42 2018-11-08 20:04:42.149  INFO 5597 --- [           main] o.s.c.d.a.test.NamedChannelTests         : Checking: Stream=DIRECTED-GRAPH-DESTINATION2, status = deployed, status description = The stream has been successfully deployed
08-Nov-2018 20:04:42 2018-11-08 20:04:42.218  INFO 5597 --- [           main] o.s.c.d.a.test.NamedChannelTests         : Sleeping to check status of Stream=DIRECTED-GRAPH-DESTINATION2
08-Nov-2018 20:04:52 2018-11-08 20:04:52.218  INFO 5597 --- [           main] o.s.c.d.a.test.NamedChannelTests         : Stream 'DIRECTED-GRAPH-DESTINATION2' started with status: deployed
08-Nov-2018 20:04:52 2018-11-08 20:04:52.218  INFO 5597 --- [           main] o.s.c.d.a.test.NamedChannelTests         : App 'transform' has instances: {DIRECTED-GRAPH-DESTINATION2.transform-v1-0=http://10.194.6.23:56370}
08-Nov-2018 20:04:52 2018-11-08 20:04:52.218  INFO 5597 --- [           main] o.s.c.d.a.test.NamedChannelTests         : App 'log' has instances: {DIRECTED-GRAPH-DESTINATION2.log-v1-0=http://10.194.6.23:57727}
08-Nov-2018 20:04:52 2018-11-08 20:04:52.218  INFO 5597 --- [           main] o.s.c.d.a.test.NamedChannelTests         : Looking for 'Started LogSink' in logfile for log
08-Nov-2018 20:05:02 2018-11-08 20:05:02.218  INFO 5597 --- [           main] o.s.c.d.a.test.NamedChannelTests         : Requesting log for app DIRECTED-GRAPH-DESTINATION2.log-v1-0
08-Nov-2018 20:05:02 2018-11-08 20:05:02.366  INFO 5597 --- [           main] o.s.c.d.a.test.NamedChannelTests         : Retrieved logfile from 'http://10.194.6.23:57727/logfile
08-Nov-2018 20:05:02 2018-11-08 20:05:02.366  INFO 5597 --- [           main] o.s.c.d.a.test.NamedChannelTests         : Matched all 'Started LogSink' in logfile for instance DIRECTED-GRAPH-DESTINATION2.log-v1-0 of app log
08-Nov-2018 20:05:02 2018-11-08 20:05:02.366  INFO 5597 --- [           main] o.s.c.d.a.test.NamedChannelTests         : Creating stream 'DIRECTED-GRAPH-HTTP-SOURCE'
08-Nov-2018 20:05:02 2018-11-08 20:05:02.390  INFO 5597 --- [           main] o.s.c.d.a.test.NamedChannelTests         : Deploying stream 'DIRECTED-GRAPH-HTTP-SOURCE' with properties: {app.*.logging.file=${PID}-test.log, app.*.endpoints.logfile.sensitive=false, app.*.management.endpoints.web.exposure.include=*}
08-Nov-2018 20:05:10 2018-11-08 20:05:10.588  INFO 5597 --- [           main] o.s.c.d.a.test.NamedChannelTests         : Checking: Stream=DIRECTED-GRAPH-HTTP-SOURCE, status = deploying, status description = The stream is being deployed.
08-Nov-2018 20:05:10 2018-11-08 20:05:10.588  INFO 5597 --- [           main] o.s.c.d.a.test.NamedChannelTests         : Sleeping to check status of Stream=DIRECTED-GRAPH-HTTP-SOURCE
08-Nov-2018 20:05:20 2018-11-08 20:05:20.664  INFO 5597 --- [           main] o.s.c.d.a.test.NamedChannelTests         : Checking: Stream=DIRECTED-GRAPH-HTTP-SOURCE, status = deploying, status description = The stream is being deployed.
08-Nov-2018 20:05:20 2018-11-08 20:05:20.664  INFO 5597 --- [           main] o.s.c.d.a.test.NamedChannelTests         : Sleeping to check status of Stream=DIRECTED-GRAPH-HTTP-SOURCE
08-Nov-2018 20:05:30 2018-11-08 20:05:30.727  INFO 5597 --- [           main] o.s.c.d.a.test.NamedChannelTests         : Checking: Stream=DIRECTED-GRAPH-HTTP-SOURCE, status = deployed, status description = The stream has been successfully deployed
08-Nov-2018 20:05:30 2018-11-08 20:05:30.794  INFO 5597 --- [           main] o.s.c.d.a.test.NamedChannelTests         : Sleeping to check status of Stream=DIRECTED-GRAPH-HTTP-SOURCE
08-Nov-2018 20:05:40 2018-11-08 20:05:40.794  INFO 5597 --- [           main] o.s.c.d.a.test.NamedChannelTests         : Stream 'DIRECTED-GRAPH-HTTP-SOURCE' started with status: deployed
08-Nov-2018 20:05:40 2018-11-08 20:05:40.794  INFO 5597 --- [           main] o.s.c.d.a.test.NamedChannelTests         : App 'router' has instances: {DIRECTED-GRAPH-HTTP-SOURCE.router-v1-0=http://10.194.6.23:56877}
08-Nov-2018 20:05:40 2018-11-08 20:05:40.794  INFO 5597 --- [           main] o.s.c.d.a.test.NamedChannelTests         : App 'http' has instances: {DIRECTED-GRAPH-HTTP-SOURCE.http-v1-0=http://10.194.6.23:52918}
08-Nov-2018 20:05:40 2018-11-08 20:05:40.794  INFO 5597 --- [           main] o.s.c.d.a.test.NamedChannelTests         : Looking for 'Started HttpSource' in logfile for http
08-Nov-2018 20:05:50 2018-11-08 20:05:50.794  INFO 5597 --- [           main] o.s.c.d.a.test.NamedChannelTests         : Requesting log for app DIRECTED-GRAPH-HTTP-SOURCE.http-v1-0
08-Nov-2018 20:05:50 2018-11-08 20:05:50.938  INFO 5597 --- [           main] o.s.c.d.a.test.NamedChannelTests         : Retrieved logfile from 'http://10.194.6.23:52918/logfile
08-Nov-2018 20:05:50 2018-11-08 20:05:50.938  INFO 5597 --- [           main] o.s.c.d.a.test.NamedChannelTests         : Matched all 'Started HttpSource' in logfile for instance DIRECTED-GRAPH-HTTP-SOURCE.http-v1-0 of app http
08-Nov-2018 20:05:51 2018-11-08 20:05:51.102  INFO 5597 --- [           main] o.s.c.d.a.test.NamedChannelTests         : Looking for 'abcd-foo' in logfile for log
08-Nov-2018 20:06:01 2018-11-08 20:06:01.102  INFO 5597 --- [           main] o.s.c.d.a.test.NamedChannelTests         : Requesting log for app DIRECTED-GRAPH-DESTINATION1.log-v1-0
08-Nov-2018 20:06:01 2018-11-08 20:06:01.118  INFO 5597 --- [           main] o.s.c.d.a.test.NamedChannelTests         : Retrieved logfile from 'http://10.194.6.23:58614/logfile
08-Nov-2018 20:06:01 2018-11-08 20:06:01.119  INFO 5597 --- [           main] o.s.c.d.a.test.NamedChannelTests         : Matched all 'abcd-foo' in logfile for instance DIRECTED-GRAPH-DESTINATION1.log-v1-0 of app log
08-Nov-2018 20:06:01 2018-11-08 20:06:01.119  INFO 5597 --- [           main] o.s.c.d.a.test.NamedChannelTests         : Looking for 'defg-bar' in logfile for log
08-Nov-2018 20:06:11 2018-11-08 20:06:11.119  INFO 5597 --- [           main] o.s.c.d.a.test.NamedChannelTests         : Requesting log for app DIRECTED-GRAPH-DESTINATION2.log-v1-0
08-Nov-2018 20:06:11 2018-11-08 20:06:11.135  INFO 5597 --- [           main] o.s.c.d.a.test.NamedChannelTests         : Retrieved logfile from 'http://10.194.6.23:57727/logfile
08-Nov-2018 20:06:11 2018-11-08 20:06:11.136  INFO 5597 --- [           main] o.s.c.d.a.test.NamedChannelTests         : Matched all 'defg-bar' in logfile for instance DIRECTED-GRAPH-DESTINATION2.log-v1-0 of app log
08-Nov-2018 20:06:11 2018-11-08 20:06:11.140  INFO 5597 --- [           main] junit.logTestName                        : Test directedGraphTest(org.springframework.cloud.dataflow.acceptance.test.NamedChannelTests) Succeeded
08-Nov-2018 20:06:11 2018-11-08 20:06:11.140  INFO 5597 --- [           main] junit.logTestName                        : Finished Test directedGraphTest(org.springframework.cloud.dataflow.acceptance.test.NamedChannelTests)
08-Nov-2018 20:06:11 2018-11-08 20:06:11.140  INFO 5597 --- [           main] o.s.c.d.a.test.NamedChannelTests         : Destroy all streams
08-Nov-2018 20:06:11 Tests run: 4, Failures: 0, Errors: 0, Skipped: 0, Time elapsed: 426.638 sec - in org.springframework.cloud.dataflow.acceptance.test.NamedChannelTests
08-Nov-2018 20:06:11 Running org.springframework.cloud.dataflow.acceptance.test.util.PlatformHelperTests
08-Nov-2018 20:06:12 Tests run: 3, Failures: 0, Errors: 0, Skipped: 0, Time elapsed: 0.143 sec - in org.springframework.cloud.dataflow.acceptance.test.util.PlatformHelperTests
08-Nov-2018 20:06:12 Running org.springframework.cloud.dataflow.acceptance.test.util.ApplicationTests
08-Nov-2018 20:06:12 Tests run: 2, Failures: 0, Errors: 0, Skipped: 0, Time elapsed: 0.001 sec - in org.springframework.cloud.dataflow.acceptance.test.util.ApplicationTests
08-Nov-2018 20:06:12 2018-11-08 20:06:12.181  INFO 5597 --- [       Thread-6] o.s.c.support.GenericApplicationContext  : Closing org.springframework.context.support.GenericApplicationContext@32177fa5: startup date [Thu Nov 08 19:56:15 UTC 2018]; root of context hierarchy
08-Nov-2018 20:06:12
08-Nov-2018 20:06:12 Results :
08-Nov-2018 20:06:12
08-Nov-2018 20:06:12 Tests run: 18, Failures: 0, Errors: 0, Skipped: 2
08-Nov-2018 20:06:12
08-Nov-2018 20:06:12 [INFO]
08-Nov-2018 20:06:12 [INFO] >>> maven-surefire-report-plugin:3.0.0-M1:report (default-cli) > [surefire]test @ spring-cloud-dataflow-acceptance-tests >>>
08-Nov-2018 20:06:12 [INFO]
08-Nov-2018 20:06:12 [INFO] --- maven-checkstyle-plugin:2.17:check (checkstyle-validation) @ spring-cloud-dataflow-acceptance-tests ---
08-Nov-2018 20:06:12 [INFO]
08-Nov-2018 20:06:12 [INFO] --- maven-resources-plugin:2.6:resources (default-resources) @ spring-cloud-dataflow-acceptance-tests ---
08-Nov-2018 20:06:12 [INFO] Using 'UTF-8' encoding to copy filtered resources.
08-Nov-2018 20:06:12 [INFO] skip non existing resourceDirectory /opt/bamboo-home/xml-data/build-dir/SCDT-LOCAL20XSKIPPER20X-KAFKA/src/main/resources
08-Nov-2018 20:06:12 [INFO] skip non existing resourceDirectory /opt/bamboo-home/xml-data/build-dir/SCDT-LOCAL20XSKIPPER20X-KAFKA/src/main/resources
08-Nov-2018 20:06:12 [INFO]
08-Nov-2018 20:06:12 [INFO] --- maven-compiler-plugin:3.1:compile (default-compile) @ spring-cloud-dataflow-acceptance-tests ---
08-Nov-2018 20:06:12 [INFO] Nothing to compile - all classes are up to date
08-Nov-2018 20:06:12 [INFO]
08-Nov-2018 20:06:12 [INFO] --- maven-resources-plugin:2.6:testResources (default-testResources) @ spring-cloud-dataflow-acceptance-tests ---
08-Nov-2018 20:06:12 [INFO] Using 'UTF-8' encoding to copy filtered resources.
08-Nov-2018 20:06:12 [INFO] Copying 1 resource
08-Nov-2018 20:06:12 [INFO]
08-Nov-2018 20:06:12 [INFO] --- maven-compiler-plugin:3.1:testCompile (default-testCompile) @ spring-cloud-dataflow-acceptance-tests ---
08-Nov-2018 20:06:12 [INFO] Nothing to compile - all classes are up to date
08-Nov-2018 20:06:12 [INFO]
08-Nov-2018 20:06:12 [INFO] --- maven-surefire-plugin:2.18.1:test (default-test) @ spring-cloud-dataflow-acceptance-tests ---
08-Nov-2018 20:06:12 [INFO] Skipping execution of surefire because it has already been run for this configuration
08-Nov-2018 20:06:12 [INFO]
08-Nov-2018 20:06:12 [INFO] <<< maven-surefire-report-plugin:3.0.0-M1:report (default-cli) < [surefire]test @ spring-cloud-dataflow-acceptance-tests <<<
08-Nov-2018 20:06:12 [INFO]
08-Nov-2018 20:06:12 [INFO] --- maven-surefire-report-plugin:3.0.0-M1:report (default-cli) @ spring-cloud-dataflow-acceptance-tests ---
08-Nov-2018 20:06:12 [INFO] Downloading: http://repo.spring.io/libs-snapshot-local/org/apache/maven/surefire/surefire-report-parser/3.0.0-M1/surefire-report-parser-3.0.0-M1.pom
08-Nov-2018 20:06:12 [INFO] Downloading: http://repo.spring.io/libs-milestone-local/org/apache/maven/surefire/surefire-report-parser/3.0.0-M1/surefire-report-parser-3.0.0-M1.pom
08-Nov-2018 20:06:12 [INFO] Downloading: https://repo.maven.apache.org/maven2/org/apache/maven/surefire/surefire-report-parser/3.0.0-M1/surefire-report-parser-3.0.0-M1.pom
08-Nov-2018 20:06:12 [INFO] Downloaded: https://repo.maven.apache.org/maven2/org/apache/maven/surefire/surefire-report-parser/3.0.0-M1/surefire-report-parser-3.0.0-M1.pom (4 KB at 130.3 KB/sec)
08-Nov-2018 20:06:12 [INFO] Downloading: http://repo.spring.io/libs-snapshot-local/org/apache/maven/surefire/surefire-logger-api/3.0.0-M1/surefire-logger-api-3.0.0-M1.pom
08-Nov-2018 20:06:12 [INFO] Downloading: http://repo.spring.io/libs-milestone-local/org/apache/maven/surefire/surefire-logger-api/3.0.0-M1/surefire-logger-api-3.0.0-M1.pom
08-Nov-2018 20:06:12 [INFO] Downloading: https://repo.maven.apache.org/maven2/org/apache/maven/surefire/surefire-logger-api/3.0.0-M1/surefire-logger-api-3.0.0-M1.pom
08-Nov-2018 20:06:12 [INFO] Downloaded: https://repo.maven.apache.org/maven2/org/apache/maven/surefire/surefire-logger-api/3.0.0-M1/surefire-logger-api-3.0.0-M1.pom (2 KB at 273.7 KB/sec)
08-Nov-2018 20:06:12 [INFO] Downloading: http://repo.spring.io/libs-snapshot-local/org/apache/maven/reporting/maven-reporting-impl/3.0.0/maven-reporting-impl-3.0.0.pom
08-Nov-2018 20:06:12 [INFO] Downloading: http://repo.spring.io/libs-milestone-local/org/apache/maven/reporting/maven-reporting-impl/3.0.0/maven-reporting-impl-3.0.0.pom
08-Nov-2018 20:06:12 [INFO] Downloading: https://repo.maven.apache.org/maven2/org/apache/maven/reporting/maven-reporting-impl/3.0.0/maven-reporting-impl-3.0.0.pom
08-Nov-2018 20:06:12 [INFO] Downloaded: https://repo.maven.apache.org/maven2/org/apache/maven/reporting/maven-reporting-impl/3.0.0/maven-reporting-impl-3.0.0.pom (8 KB at 929.1 KB/sec)
08-Nov-2018 20:06:12 [INFO] Downloading: http://repo.spring.io/libs-snapshot-local/org/apache/maven/surefire/surefire-report-parser/3.0.0-M1/surefire-report-parser-3.0.0-M1.jar
08-Nov-2018 20:06:12 [INFO] Downloading: http://repo.spring.io/libs-snapshot-local/org/apache/maven/surefire/surefire-logger-api/3.0.0-M1/surefire-logger-api-3.0.0-M1.jar
08-Nov-2018 20:06:12 [INFO] Downloading: http://repo.spring.io/libs-snapshot-local/org/apache/maven/reporting/maven-reporting-impl/3.0.0/maven-reporting-impl-3.0.0.jar
08-Nov-2018 20:06:13 [INFO] Downloading: http://repo.spring.io/libs-milestone-local/org/apache/maven/surefire/surefire-report-parser/3.0.0-M1/surefire-report-parser-3.0.0-M1.jar
08-Nov-2018 20:06:13 [INFO] Downloading: http://repo.spring.io/libs-milestone-local/org/apache/maven/surefire/surefire-logger-api/3.0.0-M1/surefire-logger-api-3.0.0-M1.jar
08-Nov-2018 20:06:13 [INFO] Downloading: http://repo.spring.io/libs-milestone-local/org/apache/maven/reporting/maven-reporting-impl/3.0.0/maven-reporting-impl-3.0.0.jar
08-Nov-2018 20:06:13 [INFO] Downloading: https://repo.maven.apache.org/maven2/org/apache/maven/surefire/surefire-report-parser/3.0.0-M1/surefire-report-parser-3.0.0-M1.jar
08-Nov-2018 20:06:13 [INFO] Downloading: https://repo.maven.apache.org/maven2/org/apache/maven/surefire/surefire-logger-api/3.0.0-M1/surefire-logger-api-3.0.0-M1.jar
08-Nov-2018 20:06:13 [INFO] Downloading: https://repo.maven.apache.org/maven2/org/apache/maven/reporting/maven-reporting-impl/3.0.0/maven-reporting-impl-3.0.0.jar
08-Nov-2018 20:06:13 [INFO] Downloaded: https://repo.maven.apache.org/maven2/org/apache/maven/surefire/surefire-report-parser/3.0.0-M1/surefire-report-parser-3.0.0-M1.jar (56 KB at 3090.2 KB/sec)
08-Nov-2018 20:06:13 [INFO] Downloaded: https://repo.maven.apache.org/maven2/org/apache/maven/reporting/maven-reporting-impl/3.0.0/maven-reporting-impl-3.0.0.jar (18 KB at 996.9 KB/sec)
08-Nov-2018 20:06:13 [INFO] Downloaded: https://repo.maven.apache.org/maven2/org/apache/maven/surefire/surefire-logger-api/3.0.0-M1/surefire-logger-api-3.0.0-M1.jar (14 KB at 691.9 KB/sec)
08-Nov-2018 20:06:13 [WARNING] Unable to locate Test Source XRef to link to - DISABLED
08-Nov-2018 20:06:13 [INFO] ------------------------------------------------------------------------
08-Nov-2018 20:06:13 [INFO] BUILD SUCCESS
08-Nov-2018 20:06:13 [INFO] ------------------------------------------------------------------------
08-Nov-2018 20:06:13 [INFO] Total time: 15:36 min
08-Nov-2018 20:06:13 [INFO] Finished at: 2018-11-08T20:06:13+00:00
08-Nov-2018 20:06:13 [INFO] Final Memory: 60M/411M
08-Nov-2018 20:06:13 [INFO] ------------------------------------------------------------------------
08-Nov-2018 20:06:13 Clean up, clean up, everybody everywhere; clean up clean up, everybody do your share!
08-Nov-2018 20:06:13 Killing process PID [5291]
08-Nov-2018 20:06:13 Killing process PID [5064]
08-Nov-2018 20:06:14 No stopped containers
08-Nov-2018 20:06:14 Stopping mysql_mysql_1 ...
08-Nov-2018 20:06:18
08-Nov-2018 20:06:18 Stopping mysql_mysql_1 ... done
08-Nov-2018 20:06:18 Removing mysql_mysql_1 ...
08-Nov-2018 20:06:18
08-Nov-2018 20:06:18 Removing mysql_mysql_1 ... done
08-Nov-2018 20:06:18 Going to remove mysql_mysql_1
08-Nov-2018 20:06:18 Stopping kafka_kafka_1 ...
08-Nov-2018 20:06:18 Stopping kafka_zookeeper_1 ...
08-Nov-2018 20:06:21
08-Nov-2018 20:06:21 Stopping kafka_kafka_1 ... done
08-Nov-2018 20:06:29
08-Nov-2018 20:06:29 Stopping kafka_zookeeper_1 ... done
08-Nov-2018 20:06:29 Removing kafka_kafka_1 ...
08-Nov-2018 20:06:29 Removing kafka_zookeeper_1 ...
08-Nov-2018 20:06:29
08-Nov-2018 20:06:29 Removing kafka_kafka_1 ... done
08-Nov-2018 20:06:29
08-Nov-2018 20:06:29 Removing kafka_zookeeper_1 ... done
08-Nov-2018 20:06:29 Going to remove kafka_kafka_1, kafka_zookeeper_1
08-Nov-2018 20:06:29
08-Nov-2018 20:06:29 Finished task 'Execute Acceptance Tests' with result: Success
08-Nov-2018 20:06:29 Starting task 'JUnit Parser' of type 'com.atlassian.bamboo.plugins.testresultparser:task.testresultparser.junit'
08-Nov-2018 20:06:29 Parsing test results under /opt/bamboo-home/xml-data/build-dir/SCDT-LOCAL20XSKIPPER20X-KAFKA...
08-Nov-2018 20:06:29 Finished task 'JUnit Parser' with result: Success
08-Nov-2018 20:06:29 Starting task 'clean up' of type 'com.atlassian.bamboo.plugins.scripttask:task.builder.script'
08-Nov-2018 20:06:29
Beginning to execute external process for build 'Spring Cloud Data Flow Acceptance Tests - Local + SCDF-2.0.0.BS + Skipper 2.0.0.BS - Run Data Flow Acceptance Tests for Kafka #3 (SCDT-LOCAL20XSKIPPER20X-KAFKA-3)'
... running command line:
/opt/bamboo-home/temp/SCDT-LOCAL20XSKIPPER20X-KAFKA-3-ScriptBuildTask-2320953483297892942.sh
... in: /opt/bamboo-home/xml-data/build-dir/SCDT-LOCAL20XSKIPPER20X-KAFKA
... using extra environment variables:
bamboo_planRepository_1_branch=master
bamboo_signing_store_password=********
bamboo_capability_system_builder_ant_Ant_1_9=/opt/ant-1.9
bamboo_capability_system_builder_ant_Ant_1_8=/opt/ant-1.8
bamboo_planRepository_1_branchDisplayName=master
bamboo_repository_274694331_git_username=spring-buildmaster
bamboo_capability_system_jdk_OpenJDK_7u181=/opt/openjdk-7
bamboo_repository_revision_number=08e5bc520aba466c60a3788b41b49655670899b6
bamboo_capability_system_builder_node_Node_js_6=/usr/bin/node
bamboo_RIAK_BIN=/usr/sbin/riak
bamboo_buildKey=SCDT-LOCAL20XSKIPPER20X-KAFKA
bamboo_repository_274694331_branch_name=master
bamboo_sonar_token_password=********
bamboo_shortJobName=Run Data Flow Acceptance Tests for Kafka
bamboo_capability_system_builder_gradle___gradlew=./gradlew
bamboo_buildResultsUrl=https://build.spring.io/browse/SCDT-LOCAL20XSKIPPER20X-KAFKA-3
bamboo_capability_system_builder_mvn3_Maven_3_3=/opt/maven-3.3
bamboo_capability_system_builder_mvn3_Maven_3_2=/opt/maven-3.2
bamboo_capability_system_builder_mvn3_Maven_3_1=/opt/maven-3.1
bamboo_planRepository_repositoryUrl=https://github.com/spring-cloud/spring-cloud-dataflow-acceptance-tests.git
bamboo_agentId=208568333
bamboo_capability_system_builder_mvn3_Maven_3_5=/opt/maven-3.5
bamboo_capability_system_builder_mvn3_Maven_3_0=/opt/maven-3.0
bamboo_planRepository_revision=08e5bc520aba466c60a3788b41b49655670899b6
bamboo_planRepository_previousRevision=08e5bc520aba466c60a3788b41b49655670899b6
bamboo_capability_remote_build=true
bamboo_repository_branch_name=master
bamboo_repository_274694331_name=Git
bamboo_scdf_acceptance_tests_password=********
bamboo_dependenciesDisabled=false
bamboo_repository_274694331_git_branch=master
bamboo_capability_Agent=bamboo-13.af.pivotal.io
bamboo_planRepository_branch=master
bamboo_planRepository_1_type=gitv2
bamboo_planRepository_branchName=master
bamboo_sonar_password=********
bamboo_hg_cache_directory=/opt/bamboo-home/xml-data/build-dir/_hg-repositories-cache
bamboo_planRepository_1_username=spring-buildmaster
bamboo_repository_274694331_git_repositoryUrl=https://github.com/spring-cloud/spring-cloud-dataflow-acceptance-tests.git
bamboo_planRepository_type=gitv2
bamboo_ManualBuildTriggerReason_userName=mpollack
bamboo_git_cache_directory=/opt/bamboo-home/xml-data/build-dir/_git-repositories-cache
bamboo_artifactory_username=buildmaster
bamboo_tmp_directory=/opt/bamboo-home/temp
bamboo_planKey=SCDT-LOCAL20XSKIPPER20X
bamboo_planRepository_username=spring-buildmaster
bamboo_JDK8_HOME=/opt/jdk-8
bamboo_repository_274694331_previous_revision_number=08e5bc520aba466c60a3788b41b49655670899b6
bamboo_planRepository_1_branchName=master
bamboo_sonar_version=5.6.3
bamboo_capability_system_jdk_JDK_1_11=/opt/jdk-11
bamboo_resultsUrl=https://build.spring.io/browse/SCDT-LOCAL20XSKIPPER20X-KAFKA-3
bamboo_capability_system_jdk_JDK_1_10=/opt/jdk-10
bamboo_build_working_directory=/opt/bamboo-home/xml-data/build-dir/SCDT-LOCAL20XSKIPPER20X-KAFKA
bamboo_planRepository_1_name=Git
bamboo_capability_system_os=ubuntu1604
bamboo_nexusPush_stagingProfile=buildmaster
bamboo_shortPlanName=Local + SCDF-2.0.0.BS + Skipper 2.0.0.BS
bamboo_planRepository_name=Git
bamboo_buildNumber=3
bamboo_planName=Spring Cloud Data Flow Acceptance Tests - Local + SCDF-2.0.0.BS + Skipper 2.0.0.BS
bamboo_JDK7_HOME=/opt/jdk-7
bamboo_build_commandline_com_atlassian_bamboo_plugins_scripttask_task_builder_script_7=/opt/bamboo-home/temp/SCDT-LOCAL20XSKIPPER20X-KAFKA-3-ScriptBuildTask-6089655602347880588.sh
bamboo_shortPlanKey=LOCAL20XSKIPPER20X
bamboo_shortJobKey=KAFKA
bamboo_artifactory_password=********
bamboo_buildTimeStamp=2018-11-08T19:47:29.430Z
bamboo_repository_previous_revision_number=08e5bc520aba466c60a3788b41b49655670899b6
bamboo_sonar_username=buildmaster
bamboo_repository_git_branch=master
bamboo_buildResultKey=SCDT-LOCAL20XSKIPPER20X-KAFKA-3
bamboo_nexusPush_close=true
bamboo_buildPlanName=Spring Cloud Data Flow Acceptance Tests - Local + SCDF-2.0.0.BS + Skipper 2.0.0.BS - Run Data Flow Acceptance Tests for Kafka
bamboo_repository_274694331_revision_number=08e5bc520aba466c60a3788b41b49655670899b6
bamboo_planRepository_1_revision=08e5bc520aba466c60a3788b41b49655670899b6
bamboo_repository_name=Git
bamboo_signing_key_password=********
bamboo_buildFailed=false
bamboo_capability_system_docker_executable=/usr/bin/docker
bamboo_capability_system_builder_groovy_Groovy_2_4=/opt/groovy-2.4
bamboo_capability_system_builder_command_Bash=/bin/bash
bamboo_jobFailed=false
bamboo_agentWorkingDirectory=/opt/bamboo-home/xml-data/build-dir
bamboo_capability_system_git_executable=/usr/bin/git
bamboo_repository_git_username=spring-buildmaster
bamboo_planRepository_1_previousRevision=08e5bc520aba466c60a3788b41b49655670899b6
bamboo_capability_os_family=unix
bamboo_planRepository_branchDisplayName=master
bamboo_capability_system_builder_maven_Artifactory_Maven_3_5=/opt/maven-3.5
bamboo_capability_system_builder_maven_Artifactory_Maven_3_3=/opt/maven-3.3
bamboo_capability_system_builder_maven_Artifactory_Maven_3_2=/opt/maven-3.2
bamboo_s3_properties=/home/bamboo/tools/s3.properties
bamboo_capability_system_builder_maven_Artifactory_Maven_3_1=/opt/maven-3.1
bamboo_capability_system_builder_maven_Artifactory_Maven_3_0=/opt/maven-3.0
bamboo_plan_storageTag=plan-274497908
bamboo_repository_git_repositoryUrl=https://github.com/spring-cloud/spring-cloud-dataflow-acceptance-tests.git
bamboo_working_directory=/opt/bamboo-home/xml-data/build-dir/SCDT-LOCAL20XSKIPPER20X-KAFKA
bamboo_planRepository_1_repositoryUrl=https://github.com/spring-cloud/spring-cloud-dataflow-acceptance-tests.git
bamboo_capability_system_jdk_JDK_1_8=/opt/jdk-8
bamboo_capability_system_jdk_JDK_1_9=/opt/jdk-9
bamboo_capability_system_jdk_JDK_1_6=/opt/jdk-6
bamboo_capability_system_jdk_JDK_1_7=/opt/jdk-7
bamboo_sonar_ip=10.194.6.9
08-Nov-2018 20:06:29 CLEANING UP RESOURCES AFTER RUNNING TESTS
08-Nov-2018 20:06:29 Environment variable JAVA_HOME must be set
08-Nov-2018 20:06:29 FINISHED CLEANING UP RESOURCES
08-Nov-2018 20:06:29 Finished task 'clean up' with result: Success
08-Nov-2018 20:06:29 Running post build plugin 'Docker Container Cleanup'
08-Nov-2018 20:06:29 Running post build plugin 'NCover Results Collector'
08-Nov-2018 20:06:29 Running post build plugin 'Artifactory Release Management Staging'
08-Nov-2018 20:06:29 Running post build plugin 'Artifactory Build Info Copier'
08-Nov-2018 20:06:29 Running post build plugin 'Artifactory Gradle Properties Info Copier'
08-Nov-2018 20:06:29 Running post build plugin 'Clover Results Collector'
08-Nov-2018 20:06:29 Running post build plugin 'npm Cache Cleanup'
08-Nov-2018 20:06:29 Running post build plugin 'Artifact Copier'
08-Nov-2018 20:06:29 Publishing an artifact: Test Results
08-Nov-2018 20:06:29 Finished publishing of artifact Job artifact: [Test Results], pattern: [**/target/surefire-reports/**/*.*] in 44.12 ms
08-Nov-2018 20:06:29 Publishing an artifact: App and Server Logs
08-Nov-2018 20:06:29 Finished publishing of artifact Job artifact: [App and Server Logs], pattern: [**/*.log] anchored at: [local] in 65.66 ms
08-Nov-2018 20:06:29 Successfully removed working directory at '/opt/bamboo-home/xml-data/build-dir/SCDT-LOCAL20XSKIPPER20X-KAFKA'
08-Nov-2018 20:06:29 Finalising the build...
08-Nov-2018 20:06:29 Stopping timer.
08-Nov-2018 20:06:29 Build SCDT-LOCAL20XSKIPPER20X-KAFKA-3 completed.
08-Nov-2018 20:06:29 Running on server: post build plugin 'NCover Results Collector'
08-Nov-2018 20:06:29 Running on server: post build plugin 'Build Hanging Detection Configuration'
08-Nov-2018 20:06:29 Running on server: post build plugin 'Clover Delta Calculator'
08-Nov-2018 20:06:29 Running on server: post build plugin 'Maven Dependencies Postprocessor'
08-Nov-2018 20:06:29 All post build plugins have finished
08-Nov-2018 20:06:29 Generating build results summary...
08-Nov-2018 20:06:29 Saving build results to disk...
08-Nov-2018 20:06:29 Logging substituted variables...
08-Nov-2018 20:06:29 Indexing build results...
08-Nov-2018 20:06:29 Finished building SCDT-LOCAL20XSKIPPER20X-KAFKA-3.