Build: #303 failed

Job: Run Data Flow Acceptance Tests for Kafka failed

Stages & jobs

  1. Test Stage - Kafka

  2. Test Stage - Rabbit

Build log

The build generated 954 lines of output. Download or view full build log

30-Mar-2020 00:00:04 Build Spring Cloud Data Flow Acceptance Tests - Local + SCDF-2.0.4.BS + Skipper 2.0.4.BS (12 am) - Run Data Flow Acceptance Tests for Kafka #303 (SCDT-LOCAL20XSKIPPER20X-KAFKA-303) started building on agent bamboo-17.af.pivotal.io
30-Mar-2020 00:00:04 Remote agent on host bamboo-17.af.pivotal.io
30-Mar-2020 00:00:04 Build working directory is /opt/bamboo-home/xml-data/build-dir/SCDT-LOCAL20XSKIPPER20X-KAFKA
30-Mar-2020 00:00:04 Executing build Spring Cloud Data Flow Acceptance Tests - Local + SCDF-2.0.4.BS + Skipper 2.0.4.BS (12 am) - Run Data Flow Acceptance Tests for Kafka #303 (SCDT-LOCAL20XSKIPPER20X-KAFKA-303)
30-Mar-2020 00:00:04 Starting task 'Checkout Default Repository' of type 'com.atlassian.bamboo.plugins.vcs:task.vcs.checkout'
30-Mar-2020 00:00:04 Checking out into /opt/bamboo-home/xml-data/build-dir/SCDT-LOCAL20XSKIPPER20X-KAFKA
30-Mar-2020 00:00:04 Updating source code to revision: dd41fb40bc32a7a65c2616a8ca39a0a5c2402ad1
30-Mar-2020 00:00:04 Creating local git repository in '/opt/bamboo-home/xml-data/build-dir/SCDT-LOCAL20XSKIPPER20X-KAFKA/.git'.
30-Mar-2020 00:00:04 Initialized empty Git repository in /opt/bamboo-home/xml-data/build-dir/SCDT-LOCAL20XSKIPPER20X-KAFKA/.git/
30-Mar-2020 00:00:05 Fetching 'refs/heads/master' from 'https://github.com/spring-cloud/spring-cloud-dataflow-acceptance-tests.git'.
30-Mar-2020 00:00:06 From https://github.com/spring-cloud/spring-cloud-dataflow-acceptance-tests
30-Mar-2020 00:00:06 * [new branch]      master     -> master
30-Mar-2020 00:00:06 Checking out revision dd41fb40bc32a7a65c2616a8ca39a0a5c2402ad1.
30-Mar-2020 00:00:06 Already on 'master'
30-Mar-2020 00:00:06 Updated source code to revision: dd41fb40bc32a7a65c2616a8ca39a0a5c2402ad1
30-Mar-2020 00:00:06 Finished task 'Checkout Default Repository' with result: Success
30-Mar-2020 00:00:06 Running pre-build action: Artifactory Release Staging
30-Mar-2020 00:00:06 Running pre-build action: VCS Version Collector
30-Mar-2020 00:00:08 Starting task 'Execute Acceptance Tests' of type 'com.atlassian.bamboo.plugins.scripttask:task.builder.script'
30-Mar-2020 00:00:08
Beginning to execute external process for build 'Spring Cloud Data Flow Acceptance Tests - Local + SCDF-2.0.4.BS + Skipper 2.0.4.BS (12 am) - Run Data Flow Acceptance Tests for Kafka #303 (SCDT-LOCAL20XSKIPPER20X-KAFKA-303)'
... running command line:
/opt/bamboo-home/temp/SCDT-LOCAL20XSKIPPER20X-KAFKA-303-ScriptBuildTask-4078652244734576054.sh
... in: /opt/bamboo-home/xml-data/build-dir/SCDT-LOCAL20XSKIPPER20X-KAFKA
... using extra environment variables:
bamboo_planRepository_1_branch=master
bamboo_********_username_password=********
bamboo_signing_store_password=********
bamboo_capability_system_builder_ant_Ant_1_9=/opt/ant-1.9
bamboo_capability_system_builder_ant_Ant_1_8=/opt/ant-1.8
bamboo_planRepository_1_branchDisplayName=master
bamboo_repository_274694331_git_username=spring-buildmaster
bamboo_artifactory_override_resolve_repo=libs-milestone
bamboo_capability_system_builder_node_Node_js_10_16=/opt/node-10.16/bin/node
bamboo_repository_revision_number=dd41fb40bc32a7a65c2616a8ca39a0a5c2402ad1
bamboo_RIAK_BIN=/usr/sbin/riak
bamboo_buildKey=SCDT-LOCAL20XSKIPPER20X-KAFKA
bamboo_repository_274694331_branch_name=master
bamboo_ge_cache_username=ci
bamboo_bintray_password=********
bamboo_gradle_enterprise_cache_user=ci
bamboo_sonar_token_password=********
bamboo_shortJobName=Run Data Flow Acceptance Tests for Kafka
bamboo_artifactory_override_resolver_password=********
bamboo_sonatype_token=RSJChaox
bamboo_capability_system_builder_gradle___gradlew=./gradlew
bamboo_buildResultsUrl=https://build.spring.io/browse/SCDT-LOCAL20XSKIPPER20X-KAFKA-303
bamboo_capability_system_builder_mvn3_Maven_3_3=/opt/maven-3.3
bamboo_capability_system_builder_mvn3_Maven_3_2=/opt/maven-3.2
bamboo_capability_system_builder_mvn3_Maven_3_1=/opt/maven-3.1
bamboo_planRepository_repositoryUrl=https://github.com/spring-cloud/spring-cloud-dataflow-acceptance-tests.git
bamboo_capability_system_builder_mvn3_Maven_3_6=/opt/maven-3.6
bamboo_agentId=286195718
bamboo_capability_system_builder_mvn3_Maven_3_5=/opt/maven-3.5
bamboo_capability_system_builder_mvn3_Maven_3_0=/opt/maven-3.0
bamboo_planRepository_revision=dd41fb40bc32a7a65c2616a8ca39a0a5c2402ad1
bamboo_planRepository_previousRevision=dd41fb40bc32a7a65c2616a8ca39a0a5c2402ad1
bamboo_capability_remote_build=true
bamboo_repository_branch_name=master
bamboo_sonatype_token_password=********
bamboo_sonatype_user=springsource
bamboo_gradle_enterprise_cache_password=********
bamboo_repository_274694331_name=Git
bamboo_scdf_acceptance_tests_password=********
bamboo_APPLE_AC_PASSWORD=********
JAVA_HOME=/opt/jdk-8
bamboo_repository_274694331_git_branch=master
bamboo_gradle_enterprise_secret_access_key=********
bamboo_planRepository_branch=master
bamboo_capability_system_jdk_JDK_15=/opt/jdk-15
bamboo_capability_system_jdk_JDK_13=/opt/jdk-13
bamboo_capability_system_jdk_JDK_14=/opt/jdk-14
bamboo_planRepository_1_type=gitv2
bamboo_planRepository_branchName=master
bamboo_capability_system_jdk_JDK_12=/opt/jdk-12
bamboo_capability_system_builder_gradlew_gradlew=./
bamboo_capability_system_builder_ant_Ant_1_10=/opt/ant-1.10
bamboo_sonar_password=********
bamboo_hg_cache_directory=/opt/bamboo-home/xml-data/build-dir/_hg-repositories-cache
bamboo_planRepository_1_username=spring-buildmaster
bamboo_repository_274694331_git_repositoryUrl=https://github.com/spring-cloud/spring-cloud-dataflow-acceptance-tests.git
bamboo_planRepository_type=gitv2
bamboo_git_cache_directory=/opt/bamboo-home/xml-data/build-dir/_git-repositories-cache
bamboo_artifactory_username=buildmaster
bamboo_tmp_directory=/opt/bamboo-home/temp
bamboo_planKey=SCDT-LOCAL20XSKIPPER20X
bamboo_planRepository_username=spring-buildmaster
bamboo_JDK8_HOME=/opt/jdk-8
bamboo_repository_274694331_previous_revision_number=dd41fb40bc32a7a65c2616a8ca39a0a5c2402ad1
bamboo_planRepository_1_branchName=master
bamboo_sonar_version=6.7.7
bamboo_sonar_jdbc_password=********
bamboo_bintray_api_key_password=********
bamboo_capability_system_jdk_JDK_1_11=/opt/jdk-11
bamboo_resultsUrl=https://build.spring.io/browse/SCDT-LOCAL20XSKIPPER20X-KAFKA-303
bamboo_APPLE_AC_USERNAME_PASSWORD=********
bamboo_capability_system_jdk_JDK_1_10=/opt/jdk-10
bamboo_build_working_directory=/opt/bamboo-home/xml-data/build-dir/SCDT-LOCAL20XSKIPPER20X-KAFKA
bamboo_planRepository_1_name=Git
bamboo_capability_system_os=ubuntu1804
bamboo_nexusPush_stagingProfile=buildmaster
bamboo_shortPlanName=Local + SCDF-2.0.4.BS + Skipper 2.0.4.BS (12 am)
bamboo_planRepository_name=Git
bamboo_buildNumber=303
bamboo_planName=Spring Cloud Data Flow Acceptance Tests - Local + SCDF-2.0.4.BS + Skipper 2.0.4.BS (12 am)
bamboo_JDK7_HOME=/opt/jdk-7
bamboo_shortPlanKey=LOCAL20XSKIPPER20X
bamboo_shortJobKey=KAFKA
bamboo_artifactory_password=********
bamboo_buildTimeStamp=2020-03-30T00:00:03.790Z
bamboo_repository_previous_revision_number=dd41fb40bc32a7a65c2616a8ca39a0a5c2402ad1
bamboo_sonar_username=buildmaster
bamboo_********_password=********
bamboo_repository_git_branch=master
bamboo_buildResultKey=SCDT-LOCAL20XSKIPPER20X-KAFKA-303
bamboo_nexusPush_close=true
bamboo_artifactory_override_resolver_username=buildmaster
bamboo_buildPlanName=Spring Cloud Data Flow Acceptance Tests - Local + SCDF-2.0.4.BS + Skipper 2.0.4.BS (12 am) - Run Data Flow Acceptance Tests for Kafka
bamboo_repository_274694331_revision_number=dd41fb40bc32a7a65c2616a8ca39a0a5c2402ad1
bamboo_planRepository_1_revision=dd41fb40bc32a7a65c2616a8ca39a0a5c2402ad1
bamboo_repository_name=Git
bamboo_signing_key_password=********
bamboo_capability_system_builder_groovy_Groovy_2_5=/opt/groovy-2.5
bamboo_buildFailed=false
bamboo_capability_system_docker_executable=/usr/bin/docker
bamboo_capability_system_jdk_OpenJDK_7=/opt/jdk-7
bamboo_capability_system_builder_groovy_Groovy_2_4=/opt/groovy-2.4
bamboo_artifactory_override_deployer_username=buildmaster
bamboo_capability_system_builder_command_Bash=/bin/bash
bamboo_agentWorkingDirectory=/opt/bamboo-home/xml-data/build-dir
bamboo_capability_system_git_executable=/usr/bin/git
bamboo_repository_git_username=spring-buildmaster
bamboo_planRepository_1_previousRevision=dd41fb40bc32a7a65c2616a8ca39a0a5c2402ad1
bamboo_capability_os_family=unix
bamboo_planRepository_branchDisplayName=master
bamboo_capability_system_builder_maven_Artifactory_Maven_3_6=/opt/maven-3.6
bamboo_capability_system_builder_maven_Artifactory_Maven_3_5=/opt/maven-3.5
bamboo_capability_system_builder_maven_Artifactory_Maven_3_3=/opt/maven-3.3
bamboo_capability_system_builder_maven_Artifactory_Maven_3_2=/opt/maven-3.2
bamboo_s3_properties=/home/bamboo/tools/s3.properties
bamboo_capability_system_builder_maven_Artifactory_Maven_3_1=/opt/maven-3.1
bamboo_artifactory_override_deploy_repo=libs-snapshot-local
bamboo_capability_system_builder_maven_Artifactory_Maven_3_0=/opt/maven-3.0
bamboo_plan_storageTag=plan-274497908
bamboo_bintray_username_password=********
bamboo_repository_git_repositoryUrl=https://github.com/spring-cloud/spring-cloud-dataflow-acceptance-tests.git
bamboo_working_directory=/opt/bamboo-home/xml-data/build-dir/SCDT-LOCAL20XSKIPPER20X-KAFKA
bamboo_planRepository_1_repositoryUrl=https://github.com/spring-cloud/spring-cloud-dataflow-acceptance-tests.git
bamboo_capability_system_jdk_JDK_1_8=/opt/jdk-8
bamboo_artifactory_override_deployer_password=********
bamboo_capability_system_jdk_JDK_1_9=/opt/jdk-9
bamboo_capability_system_jdk_JDK_1_6=/opt/jdk-6
bamboo_sonatype_password=********
bamboo_capability_system_jdk_JDK_1_7=/opt/jdk-7
bamboo_sonar_ip=10.194.6.9
bamboo_ge_cache_password=********
30-Mar-2020 00:00:08 CLEANING UP RESOURCES BEFORE TESTS
30-Mar-2020 00:00:08 Setting the environment variables
30-Mar-2020 00:00:08 Export the unset env. variables from /opt/bamboo-home/xml-data/build-dir/SCDT-LOCAL20XSKIPPER20X-KAFKA/local/init/env.properties :
30-Mar-2020 00:00:08    SPRING_CLOUD_DATAFLOW_SERVER_DOWNLOAD_URL = https://repo.spring.io/libs-snapshot/org/springframework/cloud/spring-cloud-dataflow-server-local//spring-cloud-dataflow-server-local-.jar
30-Mar-2020 00:00:08    SPRING_CLOUD_SKIPPER_SERVER_DOWNLOAD_URL = https://repo.spring.io/libs-snapshot/org/springframework/cloud/spring-cloud-skipper-server//spring-cloud-skipper-server-.jar
30-Mar-2020 00:00:08    SPRING_DATASOURCE_USERNAME = spring
30-Mar-2020 00:00:08    SPRING_DATASOURCE_PASSWORD = cloud
30-Mar-2020 00:00:08    SPRING_SCHEMA_NAME = dataflow
30-Mar-2020 00:00:08    DOCKER_SERVER = localhost
30-Mar-2020 00:00:08 Setting retries to 60 and WAIT_TIME to 5
30-Mar-2020 00:00:08 Export the unset env. variables from /opt/bamboo-home/xml-data/build-dir/SCDT-LOCAL20XSKIPPER20X-KAFKA/local/binder/rabbit/env.properties :
30-Mar-2020 00:00:08    STREAM_REGISTRATION_RESOURCE = https://dataflow.spring.io/latest-stream-applications-rabbit-maven
30-Mar-2020 00:00:08    TASK_REGISTRATION_RESOURCE = https://dataflow.spring.io/latest-task-applications-maven
30-Mar-2020 00:00:08 SCDF SERVER URI: http://localhost:9393
30-Mar-2020 00:00:08 Clean up, clean up, everybody everywhere; clean up clean up, everybody do your share!
30-Mar-2020 00:00:08 Clean up servers
30-Mar-2020 00:00:09 No stopped containers
30-Mar-2020 00:00:10 No stopped containers
30-Mar-2020 00:00:10 No stopped containers
30-Mar-2020 00:00:10 FINISHED CLEANING UP RESOURCES
30-Mar-2020 00:00:10 Setting the environment variables
30-Mar-2020 00:00:10 Export the unset env. variables from /opt/bamboo-home/xml-data/build-dir/SCDT-LOCAL20XSKIPPER20X-KAFKA/local/init/env.properties :
30-Mar-2020 00:00:10    SPRING_CLOUD_DATAFLOW_SERVER_DOWNLOAD_URL = https://repo.spring.io/libs-snapshot/org/springframework/cloud/spring-cloud-dataflow-server/2.0.4.BUILD-SNAPSHOT/spring-cloud-dataflow-server-2.0.4.BUILD-SNAPSHOT.jar
30-Mar-2020 00:00:11    SPRING_CLOUD_SKIPPER_SERVER_DOWNLOAD_URL = https://repo.spring.io/libs-snapshot/org/springframework/cloud/spring-cloud-skipper-server/2.0.4.BUILD-SNAPSHOT/spring-cloud-skipper-server-2.0.4.BUILD-SNAPSHOT.jar
30-Mar-2020 00:00:11    SPRING_DATASOURCE_USERNAME = spring
30-Mar-2020 00:00:11    SPRING_DATASOURCE_PASSWORD = cloud
30-Mar-2020 00:00:11    SPRING_SCHEMA_NAME = dataflow
30-Mar-2020 00:00:11    DOCKER_SERVER = localhost
30-Mar-2020 00:00:11 Setting retries to 60 and WAIT_TIME to 5
30-Mar-2020 00:00:11 cleaning up any previous mysql docker containers...
30-Mar-2020 00:00:11 done cleaning up.
30-Mar-2020 00:00:11 Could not find a local mysql server, trying docker.
30-Mar-2020 00:00:11 Pulling mysql (mysql:5.7)...
30-Mar-2020 00:00:12 5.7: Pulling from library/mysql
30-Mar-2020 00:00:54 Digest: sha256:f4a5f5be3d94b4f4d3aef00fbc276ce7c08e62f2e1f28867d930deb73a314c58
30-Mar-2020 00:00:54 Status: Downloaded newer image for mysql:5.7
30-Mar-2020 00:00:54 Creating mysql_mysql_1 ...
30-Mar-2020 00:00:55
30-Mar-2020 00:00:55 Creating mysql_mysql_1 ... done
30-Mar-2020 00:00:55 mysql running on localhost:3306
30-Mar-2020 00:00:55 Service host is localhost
30-Mar-2020 00:00:55 Creating kafka compose file on /opt/bamboo-home/xml-data/build-dir/SCDT-LOCAL20XSKIPPER20X-KAFKA/local/binder/kafka/docker-compose.yml
30-Mar-2020 00:00:55 cleaning up any previous kafka docker containers...
30-Mar-2020 00:00:55 done cleaning up
30-Mar-2020 00:00:55 Could not find a local kafka server, trying docker.
30-Mar-2020 00:00:56 Pulling zookeeper (wurstmeister/zookeeper:)...
30-Mar-2020 00:00:58 latest: Pulling from wurstmeister/zookeeper
30-Mar-2020 00:02:04 Digest: sha256:7a7fd44a72104bfbd24a77844bad5fabc86485b036f988ea927d1780782a6680
30-Mar-2020 00:02:04 Status: Downloaded newer image for wurstmeister/zookeeper:latest
30-Mar-2020 00:02:04 Pulling kafka (wurstmeister/kafka:2.11-0.11.0.3)...
30-Mar-2020 00:02:05 2.11-0.11.0.3: Pulling from wurstmeister/kafka
30-Mar-2020 00:02:39 Digest: sha256:f84086e3965b17c392bb0dc97107081c46206bf62d40f3c3c9e40fb639d92e8d
30-Mar-2020 00:02:39 Status: Downloaded newer image for wurstmeister/kafka:2.11-0.11.0.3
30-Mar-2020 00:02:39 Creating kafka_kafka_1 ...
30-Mar-2020 00:02:39 Creating kafka_zookeeper_1 ...
30-Mar-2020 00:02:40
30-Mar-2020 00:02:40 Creating kafka_kafka_1     ... done
30-Mar-2020 00:02:41
30-Mar-2020 00:02:41 Creating kafka_zookeeper_1 ... done
30-Mar-2020 00:02:41 kafka running on localhost:9092
30-Mar-2020 00:02:41 Export the unset env. variables from /opt/bamboo-home/xml-data/build-dir/SCDT-LOCAL20XSKIPPER20X-KAFKA/local/binder/kafka/env.properties :
30-Mar-2020 00:02:41    STREAM_REGISTRATION_RESOURCE = https://dataflow.spring.io/latest-stream-applications-kafka-maven
30-Mar-2020 00:02:41    TASK_REGISTRATION_RESOURCE = https://dataflow.spring.io/latest-task-applications-maven
30-Mar-2020 00:02:41 cleaning up any previous redis docker containers...
30-Mar-2020 00:02:41 done cleaning up.
30-Mar-2020 00:02:42 redis found on localhost
30-Mar-2020 00:02:42 SKIPPER SERVER URI: http://localhost:7577
30-Mar-2020 00:02:42 Downloading server from https://repo.spring.io/libs-snapshot/org/springframework/cloud/spring-cloud-skipper-server/2.0.4.BUILD-SNAPSHOT/spring-cloud-skipper-server-2.0.4.BUILD-SNAPSHOT.jar
30-Mar-2020 00:02:47 2020-03-30 00:02:47 URL:https://repo.spring.io/libs-snapshot/org/springframework/cloud/spring-cloud-skipper-server/2.0.4.BUILD-SNAPSHOT/spring-cloud-skipper-server-2.0.4.BUILD-SNAPSHOT.jar [84387317/84387317] -> "/opt/bamboo-home/xml-data/build-dir/SCDT-LOCAL20XSKIPPER20X-KAFKA/local/skipper-server/skipper-server.jar" [1]
30-Mar-2020 00:02:47 executing [nohup /opt/jdk-8/bin/java  -Dlogging.level.org.springframework.cloud.deployer.spi.local.LocalAppDeployer=DEBUG -Xmx1024m -Xss1024k -jar /opt/bamboo-home/xml-data/build-dir/SCDT-LOCAL20XSKIPPER20X-KAFKA/local/skipper-server/skipper-server.jar  --spring.datasource.driver-class-name=org.mariadb.jdbc.Driver --spring.datasource.url=jdbc:mysql://localhost/dataflow --spring.datasource.username=spring --spring.datasource.password=cloud  --spring.cloud.dataflow.applicationProperties.stream.spring.cloud.stream.kafka.binder.brokers=localhost --spring.cloud.dataflow.applicationProperties.stream.spring.cloud.stream.kafka.binder.zkNodes=localhost  --spring.redis.host=127.0.0.1 --spring.cloud.skipper.server.platform.local.accounts.default.workingDirectoriesRoot=/opt/bamboo-home/xml-data/build-dir/SCDT-LOCAL20XSKIPPER20X-KAFKA/local/skipper-server/app-logs > /opt/bamboo-home/xml-data/build-dir/SCDT-LOCAL20XSKIPPER20X-KAFKA/local/skipper-server/skipper-server.log &]
30-Mar-2020 00:02:47 [/opt/bamboo-home/xml-data/build-dir/SCDT-LOCAL20XSKIPPER20X-KAFKA/local/skipper-server] process pid is [24838]
30-Mar-2020 00:02:47 System props are []
30-Mar-2020 00:02:47 Logs are under [/opt/bamboo-home/xml-data/build-dir/SCDT-LOCAL20XSKIPPER20X-KAFKA/local/skipper-server/skipper-server.log] or from nohup [/opt/bamboo-home/xml-data/build-dir/SCDT-LOCAL20XSKIPPER20X-KAFKA/local/skipper-server/nohup.log]
30-Mar-2020 00:02:47 Failed to connect to localhost:7577. Attempt  #1/60... will try again in [5] seconds
30-Mar-2020 00:02:52 Failed to connect to localhost:7577. Attempt  #2/60... will try again in [5] seconds
30-Mar-2020 00:02:57 Failed to connect to localhost:7577. Attempt  #3/60... will try again in [5] seconds
30-Mar-2020 00:03:02 Failed to connect to localhost:7577. Attempt  #4/60... will try again in [5] seconds
30-Mar-2020 00:03:08 SCDF SERVER URI: http://localhost:9393
30-Mar-2020 00:03:08 Downloading server from https://repo.spring.io/libs-snapshot/org/springframework/cloud/spring-cloud-dataflow-server/2.0.4.BUILD-SNAPSHOT/spring-cloud-dataflow-server-2.0.4.BUILD-SNAPSHOT.jar
30-Mar-2020 00:03:16 2020-03-30 00:03:16 URL:https://repo.spring.io/libs-snapshot/org/springframework/cloud/spring-cloud-dataflow-server/2.0.4.BUILD-SNAPSHOT/spring-cloud-dataflow-server-2.0.4.BUILD-SNAPSHOT.jar [87897631/87897631] -> "/opt/bamboo-home/xml-data/build-dir/SCDT-LOCAL20XSKIPPER20X-KAFKA/local/server/scdf-server.jar" [1]
30-Mar-2020 00:03:16 SPRING_PROFILES_ACTIVE []
30-Mar-2020 00:03:16 executing [nohup /opt/jdk-8/bin/java  -Xmx1024m -Xss1024k -jar /opt/bamboo-home/xml-data/build-dir/SCDT-LOCAL20XSKIPPER20X-KAFKA/local/server/scdf-server.jar  --spring.datasource.driver-class-name=org.mariadb.jdbc.Driver --spring.datasource.url=jdbc:mysql://localhost/dataflow --spring.datasource.username=spring --spring.datasource.password=cloud  --spring.cloud.dataflow.applicationProperties.stream.spring.cloud.stream.kafka.binder.brokers=localhost --spring.cloud.dataflow.applicationProperties.stream.spring.cloud.stream.kafka.binder.zkNodes=localhost  --spring.redis.host=127.0.0.1 --spring.cloud.skipper.server.platform.local.accounts.default.workingDirectoriesRoot=/opt/bamboo-home/xml-data/build-dir/SCDT-LOCAL20XSKIPPER20X-KAFKA/local/skipper-server/app-logs --spring.cloud.dataflow.features.skipper-enabled=true > /opt/bamboo-home/xml-data/build-dir/SCDT-LOCAL20XSKIPPER20X-KAFKA/local/server/scdf-server.log &]
30-Mar-2020 00:03:16 [/opt/bamboo-home/xml-data/build-dir/SCDT-LOCAL20XSKIPPER20X-KAFKA/local/server] process pid is [24925]
30-Mar-2020 00:03:16 System props are []
30-Mar-2020 00:03:16 Logs are under [/opt/bamboo-home/xml-data/build-dir/SCDT-LOCAL20XSKIPPER20X-KAFKA/local/server/scdf-server.log] or from nohup [/opt/bamboo-home/xml-data/build-dir/SCDT-LOCAL20XSKIPPER20X-KAFKA/local/server/nohup.log]
30-Mar-2020 00:03:16 Failed to connect to localhost:9393. Attempt  #1/60... will try again in [5] seconds
30-Mar-2020 00:03:21 Failed to connect to localhost:9393. Attempt  #2/60... will try again in [5] seconds
30-Mar-2020 00:03:26 Failed to connect to localhost:9393. Attempt  #3/60... will try again in [5] seconds
30-Mar-2020 00:03:32 SCDF SERVER ABOUT:
30-Mar-2020 00:03:32 --2020-03-30 00:03:32--  http://localhost:9393/about
30-Mar-2020 00:03:32 Resolving localhost (localhost)... ::1, 127.0.0.1
30-Mar-2020 00:03:32 Connecting to localhost (localhost)|::1|:9393... connected.
30-Mar-2020 00:03:33 HTTP request sent, awaiting response... 200
30-Mar-2020 00:03:33 Length: unspecified [application/hal+json]
30-Mar-2020 00:03:33 Saving to: ‘STDOUT’
30-Mar-2020 00:03:33
30-Mar-2020 00:03:33      0K .                                                       186M=0s
30-Mar-2020 00:03:33
30-Mar-2020 00:03:33 2020-03-30 00:03:33 (186 MB/s) - written to stdout [1681]
30-Mar-2020 00:03:33
30-Mar-2020 00:03:33 {
30-Mar-2020 00:03:33     "_links": {
30-Mar-2020 00:03:33         "self": {
30-Mar-2020 00:03:33             "href": "http://localhost:9393/about"
30-Mar-2020 00:03:33         }
30-Mar-2020 00:03:33     },
30-Mar-2020 00:03:33     "featureInfo": {
30-Mar-2020 00:03:33         "analyticsEnabled": true,
30-Mar-2020 00:03:33         "grafanaEnabled": false,
30-Mar-2020 00:03:33         "schedulesEnabled": false,
30-Mar-2020 00:03:33         "streamsEnabled": true,
30-Mar-2020 00:03:33         "tasksEnabled": true
30-Mar-2020 00:03:33     },
30-Mar-2020 00:03:33     "grafanaInfo": {
30-Mar-2020 00:03:33         "refreshInterval": 15,
30-Mar-2020 00:03:33         "url": ""
30-Mar-2020 00:03:33     },
30-Mar-2020 00:03:33     "runtimeEnvironment": {
30-Mar-2020 00:03:33         "appDeployer": {
30-Mar-2020 00:03:33             "deployerImplementationVersion": "2.0.4.BUILD-SNAPSHOT",
30-Mar-2020 00:03:33             "deployerName": "Spring Cloud Skipper Server",
30-Mar-2020 00:03:33             "deployerSpiVersion": "2.0.3.RELEASE",
30-Mar-2020 00:03:33             "javaVersion": "1.8.0_232",
30-Mar-2020 00:03:33             "platformApiVersion": "",
30-Mar-2020 00:03:33             "platformClientVersion": "",
30-Mar-2020 00:03:33             "platformHostVersion": "",
30-Mar-2020 00:03:33             "platformSpecificInfo": {
30-Mar-2020 00:03:33                 "default": "local"
30-Mar-2020 00:03:33             },
30-Mar-2020 00:03:33             "platformType": "Skipper Managed",
30-Mar-2020 00:03:33             "springBootVersion": "2.1.3.RELEASE",
30-Mar-2020 00:03:33             "springVersion": "5.1.5.RELEASE"
30-Mar-2020 00:03:33         },
30-Mar-2020 00:03:33         "taskLaunchers": [
30-Mar-2020 00:03:33             {
30-Mar-2020 00:03:33                 "deployerImplementationVersion": "2.0.3.RELEASE",
30-Mar-2020 00:03:33                 "deployerName": "LocalTaskLauncher",
30-Mar-2020 00:03:33                 "deployerSpiVersion": "2.0.2.RELEASE",
30-Mar-2020 00:03:33                 "javaVersion": "1.8.0_232",
30-Mar-2020 00:03:33                 "platformApiVersion": "Linux 4.15.0-91-generic",
30-Mar-2020 00:03:33                 "platformClientVersion": "4.15.0-91-generic",
30-Mar-2020 00:03:33                 "platformHostVersion": "4.15.0-91-generic",
30-Mar-2020 00:03:33                 "platformSpecificInfo": {},
30-Mar-2020 00:03:33                 "platformType": "Local",
30-Mar-2020 00:03:33                 "springBootVersion": "2.1.3.RELEASE",
30-Mar-2020 00:03:33                 "springVersion": "5.1.5.RELEASE"
30-Mar-2020 00:03:33             }
30-Mar-2020 00:03:33         ]
30-Mar-2020 00:03:33     },
30-Mar-2020 00:03:33     "securityInfo": {
30-Mar-2020 00:03:33         "authenticated": false,
30-Mar-2020 00:03:33         "authenticationEnabled": false,
30-Mar-2020 00:03:33         "roles": [],
30-Mar-2020 00:03:33         "username": null
30-Mar-2020 00:03:33     },
30-Mar-2020 00:03:33     "versionInfo": {
30-Mar-2020 00:03:33         "core": {
30-Mar-2020 00:03:33             "name": "Spring Cloud Data Flow Core",
30-Mar-2020 00:03:33             "version": "2.0.4.BUILD-SNAPSHOT"
30-Mar-2020 00:03:33         },
30-Mar-2020 00:03:33         "dashboard": {
30-Mar-2020 00:03:33             "name": "Spring Cloud Dataflow UI",
30-Mar-2020 00:03:33             "version": "2.0.3.RELEASE"
30-Mar-2020 00:03:33         },
30-Mar-2020 00:03:33         "implementation": {
30-Mar-2020 00:03:33             "name": "spring-cloud-dataflow-server",
30-Mar-2020 00:03:33             "version": "2.0.4.BUILD-SNAPSHOT"
30-Mar-2020 00:03:33         },
30-Mar-2020 00:03:33         "shell": {
30-Mar-2020 00:03:33             "name": "Spring Cloud Data Flow Shell",
30-Mar-2020 00:03:33             "url": "https://repo.spring.io/libs-snapshot/org/springframework/cloud/spring-cloud-dataflow-shell/2.0.4.BUILD-SNAPSHOT/spring-cloud-dataflow-shell-2.0.4.BUILD-SNAPSHOT.jar",
30-Mar-2020 00:03:33             "version": "2.0.4.BUILD-SNAPSHOT"
30-Mar-2020 00:03:33         }
30-Mar-2020 00:03:33     }
30-Mar-2020 00:03:33 }
30-Mar-2020 00:03:33 SKIPPER SERVER ABOUT:
30-Mar-2020 00:03:33 --2020-03-30 00:03:33--  http://localhost:7577/api/about
30-Mar-2020 00:03:33 Resolving localhost (localhost)... ::1, 127.0.0.1
30-Mar-2020 00:03:33 Connecting to localhost (localhost)|::1|:7577... connected.
30-Mar-2020 00:03:33 HTTP request sent, awaiting response... 200
30-Mar-2020 00:03:33 Length: unspecified [application/hal+json]
30-Mar-2020 00:03:33 Saving to: ‘STDOUT’
30-Mar-2020 00:03:33
30-Mar-2020 00:03:33      0K                                                        57.9M=0s
30-Mar-2020 00:03:33
30-Mar-2020 00:03:33 2020-03-30 00:03:33 (57.9 MB/s) - written to stdout [426]
30-Mar-2020 00:03:33
30-Mar-2020 00:03:33 {
30-Mar-2020 00:03:33     "versionInfo": {
30-Mar-2020 00:03:33         "server": {
30-Mar-2020 00:03:33             "name": "Spring Cloud Skipper Server",
30-Mar-2020 00:03:33             "version": "2.0.4.BUILD-SNAPSHOT"
30-Mar-2020 00:03:33         },
30-Mar-2020 00:03:33         "shell": {
30-Mar-2020 00:03:33             "name": "Spring Cloud Skipper Shell",
30-Mar-2020 00:03:33             "url": "https://repo.spring.io/libs-snapshot/org/springframework/cloud/spring-cloud-skipper-shell/2.0.4.BUILD-SNAPSHOT/spring-cloud-skipper-shell-2.0.4.BUILD-SNAPSHOT.jar",
30-Mar-2020 00:03:33             "version": "2.0.4.BUILD-SNAPSHOT"
30-Mar-2020 00:03:33         }
30-Mar-2020 00:03:33     }
30-Mar-2020 00:03:33 }
30-Mar-2020 00:03:34 [INFO] Scanning for projects...
30-Mar-2020 00:03:34 [INFO] Downloading: https://repo.spring.io/libs-milestone-local/org/codehaus/mojo/maven-metadata.xml
30-Mar-2020 00:03:34 [INFO] Downloading: https://repo.spring.io/libs-snapshot-local/org/codehaus/mojo/maven-metadata.xml
30-Mar-2020 00:03:34 [INFO] Downloading: https://repo.spring.io/libs-snapshot-local/org/apache/maven/plugins/maven-metadata.xml
30-Mar-2020 00:03:34 [INFO] Downloading: https://repo.spring.io/libs-milestone-local/org/apache/maven/plugins/maven-metadata.xml
30-Mar-2020 00:03:34 [INFO] Downloading: https://repo.spring.io/libs-snapshot-local/org/apache/maven/plugins/maven-surefire-report-plugin/maven-metadata.xml
30-Mar-2020 00:03:34 [INFO] Downloading: https://repo.spring.io/libs-milestone-local/org/apache/maven/plugins/maven-surefire-report-plugin/maven-metadata.xml
30-Mar-2020 00:03:34 [INFO]                                                                         
30-Mar-2020 00:03:34 [INFO] ------------------------------------------------------------------------
30-Mar-2020 00:03:34 [INFO] Building Data Flow Acceptance Tests 1.1.0.BUILD-SNAPSHOT
30-Mar-2020 00:03:34 [INFO] ------------------------------------------------------------------------
30-Mar-2020 00:03:35 [INFO] Downloading: https://repo.spring.io/libs-snapshot-local/org/springframework/cloud/spring-cloud-dataflow-rest-client/1.7.0.BUILD-SNAPSHOT/maven-metadata.xml
30-Mar-2020 00:03:35 [INFO] Downloaded: https://repo.spring.io/libs-snapshot-local/org/springframework/cloud/spring-cloud-dataflow-rest-client/1.7.0.BUILD-SNAPSHOT/maven-metadata.xml (2 KB at 4.4 KB/sec)
30-Mar-2020 00:03:35 [INFO] Downloading: https://repo.spring.io/libs-snapshot-local/org/springframework/cloud/spring-cloud-dataflow-parent/1.7.0.BUILD-SNAPSHOT/maven-metadata.xml
30-Mar-2020 00:03:35 [INFO] Downloaded: https://repo.spring.io/libs-snapshot-local/org/springframework/cloud/spring-cloud-dataflow-parent/1.7.0.BUILD-SNAPSHOT/maven-metadata.xml (646 B at 2.3 KB/sec)
30-Mar-2020 00:03:36 [INFO] Downloading: https://repo.spring.io/libs-snapshot-local/org/springframework/cloud/spring-cloud-dataflow-dependencies/1.7.0.BUILD-SNAPSHOT/maven-metadata.xml
30-Mar-2020 00:03:36 [INFO] Downloaded: https://repo.spring.io/libs-snapshot-local/org/springframework/cloud/spring-cloud-dataflow-dependencies/1.7.0.BUILD-SNAPSHOT/maven-metadata.xml (652 B at 2.1 KB/sec)
30-Mar-2020 00:03:36 [INFO] Downloading: https://repo.spring.io/libs-snapshot-local/org/springframework/cloud/spring-cloud-dataflow-rest-resource/1.7.0.BUILD-SNAPSHOT/maven-metadata.xml
30-Mar-2020 00:03:36 [INFO] Downloaded: https://repo.spring.io/libs-snapshot-local/org/springframework/cloud/spring-cloud-dataflow-rest-resource/1.7.0.BUILD-SNAPSHOT/maven-metadata.xml (2 KB at 4.7 KB/sec)
30-Mar-2020 00:03:36 [INFO] Downloading: https://repo.spring.io/libs-snapshot-local/org/springframework/cloud/spring-cloud-dataflow-core/1.7.0.BUILD-SNAPSHOT/maven-metadata.xml
30-Mar-2020 00:03:37 [INFO] Downloaded: https://repo.spring.io/libs-snapshot-local/org/springframework/cloud/spring-cloud-dataflow-core/1.7.0.BUILD-SNAPSHOT/maven-metadata.xml (2 KB at 3.3 KB/sec)
30-Mar-2020 00:03:37 [INFO]
30-Mar-2020 00:03:37 [INFO] --- maven-checkstyle-plugin:2.17:check (checkstyle-validation) @ spring-cloud-dataflow-acceptance-tests ---
30-Mar-2020 00:03:37 [INFO]
30-Mar-2020 00:03:37 [INFO] --- maven-resources-plugin:2.6:resources (default-resources) @ spring-cloud-dataflow-acceptance-tests ---
30-Mar-2020 00:03:37 [INFO] Using 'UTF-8' encoding to copy filtered resources.
30-Mar-2020 00:03:37 [INFO] skip non existing resourceDirectory /opt/bamboo-home/xml-data/build-dir/SCDT-LOCAL20XSKIPPER20X-KAFKA/src/main/resources
30-Mar-2020 00:03:37 [INFO] skip non existing resourceDirectory /opt/bamboo-home/xml-data/build-dir/SCDT-LOCAL20XSKIPPER20X-KAFKA/src/main/resources
30-Mar-2020 00:03:37 [INFO]
30-Mar-2020 00:03:37 [INFO] --- maven-compiler-plugin:3.1:compile (default-compile) @ spring-cloud-dataflow-acceptance-tests ---
30-Mar-2020 00:03:38 [INFO] Changes detected - recompiling the module!
30-Mar-2020 00:03:38 [INFO] Compiling 8 source files to /opt/bamboo-home/xml-data/build-dir/SCDT-LOCAL20XSKIPPER20X-KAFKA/target/classes
30-Mar-2020 00:03:38 [INFO]
30-Mar-2020 00:03:38 [INFO] --- maven-resources-plugin:2.6:testResources (default-testResources) @ spring-cloud-dataflow-acceptance-tests ---
30-Mar-2020 00:03:38 [INFO] Using 'UTF-8' encoding to copy filtered resources.
30-Mar-2020 00:03:38 [INFO] Copying 1 resource
30-Mar-2020 00:03:38 [INFO]
30-Mar-2020 00:03:38 [INFO] --- maven-compiler-plugin:3.1:testCompile (default-testCompile) @ spring-cloud-dataflow-acceptance-tests ---
30-Mar-2020 00:03:38 [INFO] Changes detected - recompiling the module!
30-Mar-2020 00:03:38 [INFO] Compiling 16 source files to /opt/bamboo-home/xml-data/build-dir/SCDT-LOCAL20XSKIPPER20X-KAFKA/target/test-classes
30-Mar-2020 00:03:39 [WARNING] /opt/bamboo-home/xml-data/build-dir/SCDT-LOCAL20XSKIPPER20X-KAFKA/src/test/java/org/springframework/cloud/dataflow/acceptance/test/AbstractTaskTests.java: Some input files use unchecked or unsafe operations.
30-Mar-2020 00:03:39 [WARNING] /opt/bamboo-home/xml-data/build-dir/SCDT-LOCAL20XSKIPPER20X-KAFKA/src/test/java/org/springframework/cloud/dataflow/acceptance/test/AbstractTaskTests.java: Recompile with -Xlint:unchecked for details.
30-Mar-2020 00:03:39 [INFO]
30-Mar-2020 00:03:39 [INFO] --- maven-surefire-plugin:2.18.1:test (default-test) @ spring-cloud-dataflow-acceptance-tests ---
30-Mar-2020 00:03:39 [INFO] Surefire report directory: /opt/bamboo-home/xml-data/build-dir/SCDT-LOCAL20XSKIPPER20X-KAFKA/target/surefire-reports
30-Mar-2020 00:03:39
30-Mar-2020 00:03:39 -------------------------------------------------------
30-Mar-2020 00:03:39 T E S T S
30-Mar-2020 00:03:39 -------------------------------------------------------
30-Mar-2020 00:03:39 2020-03-30 00:03:39.738  INFO   --- [           main] .b.t.c.SpringBootTestContextBootstrapper : Neither @ContextConfiguration nor @ContextHierarchy found for test class [org.springframework.cloud.dataflow.acceptance.test.AnalyticsTests], using SpringBootContextLoader
30-Mar-2020 00:03:39 2020-03-30 00:03:39.804  INFO   --- [           main] .b.t.c.SpringBootTestContextBootstrapper : Loaded default TestExecutionListener class names from location [META-INF/spring.factories]: [org.springframework.boot.test.mock.mockito.MockitoTestExecutionListener, org.springframework.boot.test.mock.mockito.ResetMocksTestExecutionListener, org.springframework.boot.test.autoconfigure.restdocs.RestDocsTestExecutionListener, org.springframework.boot.test.autoconfigure.web.client.MockRestServiceServerResetTestExecutionListener, org.springframework.boot.test.autoconfigure.web.servlet.MockMvcPrintOnlyOnFailureTestExecutionListener, org.springframework.boot.test.autoconfigure.web.servlet.WebDriverTestExecutionListener, org.springframework.test.context.web.ServletTestExecutionListener, org.springframework.test.context.support.DirtiesContextBeforeModesTestExecutionListener, org.springframework.test.context.support.DependencyInjectionTestExecutionListener, org.springframework.test.context.support.DirtiesContextTestExecutionListener, org.springframework.test.context.transaction.TransactionalTestExecutionListener, org.springframework.test.context.jdbc.SqlScriptsTestExecutionListener]
30-Mar-2020 00:03:39 2020-03-30 00:03:39.823  INFO   --- [           main] .b.t.c.SpringBootTestContextBootstrapper : Using TestExecutionListeners: [org.springframework.test.context.web.ServletTestExecutionListener@4b5d6a01, org.springframework.test.context.support.DirtiesContextBeforeModesTestExecutionListener@4a22f9e2, org.springframework.boot.test.autoconfigure.SpringBootDependencyInjectionTestExecutionListener@3c419631, org.springframework.test.context.support.DirtiesContextTestExecutionListener@418e7838, org.springframework.test.context.transaction.TransactionalTestExecutionListener@61230f6a, org.springframework.test.context.jdbc.SqlScriptsTestExecutionListener@3c130745, org.springframework.boot.test.mock.mockito.MockitoTestExecutionListener@cd3fee8, org.springframework.boot.test.autoconfigure.web.servlet.MockMvcPrintOnlyOnFailureTestExecutionListener@3e2e18f2, org.springframework.boot.test.autoconfigure.web.client.MockRestServiceServerResetTestExecutionListener@470f1802, org.springframework.boot.test.mock.mockito.ResetMocksTestExecutionListener@63021689, org.springframework.boot.test.autoconfigure.web.servlet.WebDriverTestExecutionListener@703580bf, org.springframework.boot.test.autoconfigure.restdocs.RestDocsTestExecutionListener@3e92efc3]
30-Mar-2020 00:03:39 2020-03-30 00:03:39.829  INFO   --- [           main] .b.t.c.SpringBootTestContextBootstrapper : Neither @ContextConfiguration nor @ContextHierarchy found for test class [org.springframework.cloud.dataflow.acceptance.test.WoodChuckTests], using SpringBootContextLoader
30-Mar-2020 00:03:39 2020-03-30 00:03:39.844  INFO   --- [           main] .b.t.c.SpringBootTestContextBootstrapper : Loaded default TestExecutionListener class names from location [META-INF/spring.factories]: [org.springframework.boot.test.mock.mockito.MockitoTestExecutionListener, org.springframework.boot.test.mock.mockito.ResetMocksTestExecutionListener, org.springframework.boot.test.autoconfigure.restdocs.RestDocsTestExecutionListener, org.springframework.boot.test.autoconfigure.web.client.MockRestServiceServerResetTestExecutionListener, org.springframework.boot.test.autoconfigure.web.servlet.MockMvcPrintOnlyOnFailureTestExecutionListener, org.springframework.boot.test.autoconfigure.web.servlet.WebDriverTestExecutionListener, org.springframework.test.context.web.ServletTestExecutionListener, org.springframework.test.context.support.DirtiesContextBeforeModesTestExecutionListener, org.springframework.test.context.support.DependencyInjectionTestExecutionListener, org.springframework.test.context.support.DirtiesContextTestExecutionListener, org.springframework.test.context.transaction.TransactionalTestExecutionListener, org.springframework.test.context.jdbc.SqlScriptsTestExecutionListener]
30-Mar-2020 00:03:39 2020-03-30 00:03:39.848  INFO   --- [           main] .b.t.c.SpringBootTestContextBootstrapper : Using TestExecutionListeners: [org.springframework.test.context.web.ServletTestExecutionListener@7ec7ffd3, org.springframework.test.context.support.DirtiesContextBeforeModesTestExecutionListener@5b239d7d, org.springframework.boot.test.autoconfigure.SpringBootDependencyInjectionTestExecutionListener@6572421, org.springframework.test.context.support.DirtiesContextTestExecutionListener@6b81ce95, org.springframework.test.context.transaction.TransactionalTestExecutionListener@2a798d51, org.springframework.test.context.jdbc.SqlScriptsTestExecutionListener@6d763516, org.springframework.boot.test.mock.mockito.MockitoTestExecutionListener@52bf72b5, org.springframework.boot.test.autoconfigure.web.servlet.MockMvcPrintOnlyOnFailureTestExecutionListener@37afeb11, org.springframework.boot.test.autoconfigure.web.client.MockRestServiceServerResetTestExecutionListener@515aebb0, org.springframework.boot.test.mock.mockito.ResetMocksTestExecutionListener@dd8ba08, org.springframework.boot.test.autoconfigure.web.servlet.WebDriverTestExecutionListener@245b4bdc, org.springframework.boot.test.autoconfigure.restdocs.RestDocsTestExecutionListener@6c64cb25]
30-Mar-2020 00:03:39 2020-03-30 00:03:39.849  INFO   --- [           main] .b.t.c.SpringBootTestContextBootstrapper : Neither @ContextConfiguration nor @ContextHierarchy found for test class [org.springframework.cloud.dataflow.acceptance.test.HttpSourceTests], using SpringBootContextLoader
30-Mar-2020 00:03:39 2020-03-30 00:03:39.859  INFO   --- [           main] .b.t.c.SpringBootTestContextBootstrapper : Loaded default TestExecutionListener class names from location [META-INF/spring.factories]: [org.springframework.boot.test.mock.mockito.MockitoTestExecutionListener, org.springframework.boot.test.mock.mockito.ResetMocksTestExecutionListener, org.springframework.boot.test.autoconfigure.restdocs.RestDocsTestExecutionListener, org.springframework.boot.test.autoconfigure.web.client.MockRestServiceServerResetTestExecutionListener, org.springframework.boot.test.autoconfigure.web.servlet.MockMvcPrintOnlyOnFailureTestExecutionListener, org.springframework.boot.test.autoconfigure.web.servlet.WebDriverTestExecutionListener, org.springframework.test.context.web.ServletTestExecutionListener, org.springframework.test.context.support.DirtiesContextBeforeModesTestExecutionListener, org.springframework.test.context.support.DependencyInjectionTestExecutionListener, org.springframework.test.context.support.DirtiesContextTestExecutionListener, org.springframework.test.context.transaction.TransactionalTestExecutionListener, org.springframework.test.context.jdbc.SqlScriptsTestExecutionListener]
30-Mar-2020 00:03:39 2020-03-30 00:03:39.862  INFO   --- [           main] .b.t.c.SpringBootTestContextBootstrapper : Using TestExecutionListeners: [org.springframework.test.context.web.ServletTestExecutionListener@40a4337a, org.springframework.test.context.support.DirtiesContextBeforeModesTestExecutionListener@6025e1b6, org.springframework.boot.test.autoconfigure.SpringBootDependencyInjectionTestExecutionListener@22ff4249, org.springframework.test.context.support.DirtiesContextTestExecutionListener@2d1ef81a, org.springframework.test.context.transaction.TransactionalTestExecutionListener@4c402120, org.springframework.test.context.jdbc.SqlScriptsTestExecutionListener@327514f, org.springframework.boot.test.mock.mockito.MockitoTestExecutionListener@5b12b668, org.springframework.boot.test.autoconfigure.web.servlet.MockMvcPrintOnlyOnFailureTestExecutionListener@1165b38, org.springframework.boot.test.autoconfigure.web.client.MockRestServiceServerResetTestExecutionListener@4c12331b, org.springframework.boot.test.mock.mockito.ResetMocksTestExecutionListener@7586beff, org.springframework.boot.test.autoconfigure.web.servlet.WebDriverTestExecutionListener@3b69e7d1, org.springframework.boot.test.autoconfigure.restdocs.RestDocsTestExecutionListener@815b41f]
30-Mar-2020 00:03:39 2020-03-30 00:03:39.879  INFO   --- [           main] .b.t.c.SpringBootTestContextBootstrapper : Neither @ContextConfiguration nor @ContextHierarchy found for test class [org.springframework.cloud.dataflow.acceptance.test.TickTockTests], using SpringBootContextLoader
30-Mar-2020 00:03:39 2020-03-30 00:03:39.888  INFO   --- [           main] .b.t.c.SpringBootTestContextBootstrapper : Loaded default TestExecutionListener class names from location [META-INF/spring.factories]: [org.springframework.boot.test.mock.mockito.MockitoTestExecutionListener, org.springframework.boot.test.mock.mockito.ResetMocksTestExecutionListener, org.springframework.boot.test.autoconfigure.restdocs.RestDocsTestExecutionListener, org.springframework.boot.test.autoconfigure.web.client.MockRestServiceServerResetTestExecutionListener, org.springframework.boot.test.autoconfigure.web.servlet.MockMvcPrintOnlyOnFailureTestExecutionListener, org.springframework.boot.test.autoconfigure.web.servlet.WebDriverTestExecutionListener, org.springframework.test.context.web.ServletTestExecutionListener, org.springframework.test.context.support.DirtiesContextBeforeModesTestExecutionListener, org.springframework.test.context.support.DependencyInjectionTestExecutionListener, org.springframework.test.context.support.DirtiesContextTestExecutionListener, org.springframework.test.context.transaction.TransactionalTestExecutionListener, org.springframework.test.context.jdbc.SqlScriptsTestExecutionListener]
30-Mar-2020 00:03:39 2020-03-30 00:03:39.892  INFO   --- [           main] .b.t.c.SpringBootTestContextBootstrapper : Using TestExecutionListeners: [org.springframework.test.context.web.ServletTestExecutionListener@55b53d44, org.springframework.test.context.support.DirtiesContextBeforeModesTestExecutionListener@482bce4f, org.springframework.boot.test.autoconfigure.SpringBootDependencyInjectionTestExecutionListener@366647c2, org.springframework.test.context.support.DirtiesContextTestExecutionListener@6a6afff2, org.springframework.test.context.transaction.TransactionalTestExecutionListener@1649b0e6, org.springframework.test.context.jdbc.SqlScriptsTestExecutionListener@865dd6, org.springframework.boot.test.mock.mockito.MockitoTestExecutionListener@4da4253, org.springframework.boot.test.autoconfigure.web.servlet.MockMvcPrintOnlyOnFailureTestExecutionListener@3972a855, org.springframework.boot.test.autoconfigure.web.client.MockRestServiceServerResetTestExecutionListener@62e7f11d, org.springframework.boot.test.mock.mockito.ResetMocksTestExecutionListener@503d687a, org.springframework.boot.test.autoconfigure.web.servlet.WebDriverTestExecutionListener@6a370f4, org.springframework.boot.test.autoconfigure.restdocs.RestDocsTestExecutionListener@2abf4075]
30-Mar-2020 00:03:39 2020-03-30 00:03:39.900  INFO   --- [           main] .b.t.c.SpringBootTestContextBootstrapper : Neither @ContextConfiguration nor @ContextHierarchy found for test class [org.springframework.cloud.dataflow.acceptance.test.TransformTests], using SpringBootContextLoader
30-Mar-2020 00:03:39 2020-03-30 00:03:39.909  INFO   --- [           main] .b.t.c.SpringBootTestContextBootstrapper : Loaded default TestExecutionListener class names from location [META-INF/spring.factories]: [org.springframework.boot.test.mock.mockito.MockitoTestExecutionListener, org.springframework.boot.test.mock.mockito.ResetMocksTestExecutionListener, org.springframework.boot.test.autoconfigure.restdocs.RestDocsTestExecutionListener, org.springframework.boot.test.autoconfigure.web.client.MockRestServiceServerResetTestExecutionListener, org.springframework.boot.test.autoconfigure.web.servlet.MockMvcPrintOnlyOnFailureTestExecutionListener, org.springframework.boot.test.autoconfigure.web.servlet.WebDriverTestExecutionListener, org.springframework.test.context.web.ServletTestExecutionListener, org.springframework.test.context.support.DirtiesContextBeforeModesTestExecutionListener, org.springframework.test.context.support.DependencyInjectionTestExecutionListener, org.springframework.test.context.support.DirtiesContextTestExecutionListener, org.springframework.test.context.transaction.TransactionalTestExecutionListener, org.springframework.test.context.jdbc.SqlScriptsTestExecutionListener]
30-Mar-2020 00:03:39 2020-03-30 00:03:39.912  INFO   --- [           main] .b.t.c.SpringBootTestContextBootstrapper : Using TestExecutionListeners: [org.springframework.test.context.web.ServletTestExecutionListener@51e69659, org.springframework.test.context.support.DirtiesContextBeforeModesTestExecutionListener@47e2e487, org.springframework.boot.test.autoconfigure.SpringBootDependencyInjectionTestExecutionListener@201a4587, org.springframework.test.context.support.DirtiesContextTestExecutionListener@61001b64, org.springframework.test.context.transaction.TransactionalTestExecutionListener@4310d43, org.springframework.test.context.jdbc.SqlScriptsTestExecutionListener@54a7079e, org.springframework.boot.test.mock.mockito.MockitoTestExecutionListener@26e356f0, org.springframework.boot.test.autoconfigure.web.servlet.MockMvcPrintOnlyOnFailureTestExecutionListener@47d9a273, org.springframework.boot.test.autoconfigure.web.client.MockRestServiceServerResetTestExecutionListener@4b8ee4de, org.springframework.boot.test.mock.mockito.ResetMocksTestExecutionListener@27f981c6, org.springframework.boot.test.autoconfigure.web.servlet.WebDriverTestExecutionListener@1b11171f, org.springframework.boot.test.autoconfigure.restdocs.RestDocsTestExecutionListener@1151e434]
30-Mar-2020 00:03:39 2020-03-30 00:03:39.925  INFO   --- [           main] .b.t.c.SpringBootTestContextBootstrapper : Neither @ContextConfiguration nor @ContextHierarchy found for test class [org.springframework.cloud.dataflow.acceptance.test.NamedChannelTests], using SpringBootContextLoader
30-Mar-2020 00:03:39 2020-03-30 00:03:39.933  INFO   --- [           main] .b.t.c.SpringBootTestContextBootstrapper : Loaded default TestExecutionListener class names from location [META-INF/spring.factories]: [org.springframework.boot.test.mock.mockito.MockitoTestExecutionListener, org.springframework.boot.test.mock.mockito.ResetMocksTestExecutionListener, org.springframework.boot.test.autoconfigure.restdocs.RestDocsTestExecutionListener, org.springframework.boot.test.autoconfigure.web.client.MockRestServiceServerResetTestExecutionListener, org.springframework.boot.test.autoconfigure.web.servlet.MockMvcPrintOnlyOnFailureTestExecutionListener, org.springframework.boot.test.autoconfigure.web.servlet.WebDriverTestExecutionListener, org.springframework.test.context.web.ServletTestExecutionListener, org.springframework.test.context.support.DirtiesContextBeforeModesTestExecutionListener, org.springframework.test.context.support.DependencyInjectionTestExecutionListener, org.springframework.test.context.support.DirtiesContextTestExecutionListener, org.springframework.test.context.transaction.TransactionalTestExecutionListener, org.springframework.test.context.jdbc.SqlScriptsTestExecutionListener]
30-Mar-2020 00:03:39 2020-03-30 00:03:39.936  INFO   --- [           main] .b.t.c.SpringBootTestContextBootstrapper : Using TestExecutionListeners: [org.springframework.test.context.web.ServletTestExecutionListener@70cf32e3, org.springframework.test.context.support.DirtiesContextBeforeModesTestExecutionListener@5a59ca5e, org.springframework.boot.test.autoconfigure.SpringBootDependencyInjectionTestExecutionListener@4bdeaabb, org.springframework.test.context.support.DirtiesContextTestExecutionListener@6c4906d3, org.springframework.test.context.transaction.TransactionalTestExecutionListener@65987993, org.springframework.test.context.jdbc.SqlScriptsTestExecutionListener@71075444, org.springframework.boot.test.mock.mockito.MockitoTestExecutionListener@4f32a3ad, org.springframework.boot.test.autoconfigure.web.servlet.MockMvcPrintOnlyOnFailureTestExecutionListener@6b695b06, org.springframework.boot.test.autoconfigure.web.client.MockRestServiceServerResetTestExecutionListener@4d1bf319, org.springframework.boot.test.mock.mockito.ResetMocksTestExecutionListener@6f53b8a, org.springframework.boot.test.autoconfigure.web.servlet.WebDriverTestExecutionListener@5c80cf32, org.springframework.boot.test.autoconfigure.restdocs.RestDocsTestExecutionListener@7d900ecf]
30-Mar-2020 00:03:39 Running org.springframework.cloud.dataflow.acceptance.test.AnalyticsTests
30-Mar-2020 00:03:39 2020-03-30 00:03:39.961  INFO   --- [           main] .b.t.c.SpringBootTestContextBootstrapper : Neither @ContextConfiguration nor @ContextHierarchy found for test class [org.springframework.cloud.dataflow.acceptance.test.AnalyticsTests], using SpringBootContextLoader
30-Mar-2020 00:03:39 2020-03-30 00:03:39.983  INFO   --- [           main] .b.t.c.SpringBootTestContextBootstrapper : Loaded default TestExecutionListener class names from location [META-INF/spring.factories]: [org.springframework.boot.test.mock.mockito.MockitoTestExecutionListener, org.springframework.boot.test.mock.mockito.ResetMocksTestExecutionListener, org.springframework.boot.test.autoconfigure.restdocs.RestDocsTestExecutionListener, org.springframework.boot.test.autoconfigure.web.client.MockRestServiceServerResetTestExecutionListener, org.springframework.boot.test.autoconfigure.web.servlet.MockMvcPrintOnlyOnFailureTestExecutionListener, org.springframework.boot.test.autoconfigure.web.servlet.WebDriverTestExecutionListener, org.springframework.test.context.web.ServletTestExecutionListener, org.springframework.test.context.support.DirtiesContextBeforeModesTestExecutionListener, org.springframework.test.context.support.DependencyInjectionTestExecutionListener, org.springframework.test.context.support.DirtiesContextTestExecutionListener, org.springframework.test.context.transaction.TransactionalTestExecutionListener, org.springframework.test.context.jdbc.SqlScriptsTestExecutionListener]
30-Mar-2020 00:03:39 2020-03-30 00:03:39.987  INFO   --- [           main] .b.t.c.SpringBootTestContextBootstrapper : Using TestExecutionListeners: [org.springframework.test.context.web.ServletTestExecutionListener@77659b30, org.springframework.test.context.support.DirtiesContextBeforeModesTestExecutionListener@456d6c1e, org.springframework.boot.test.autoconfigure.SpringBootDependencyInjectionTestExecutionListener@1e13529a, org.springframework.test.context.support.DirtiesContextTestExecutionListener@1ec9bd38, org.springframework.test.context.transaction.TransactionalTestExecutionListener@452e19ca, org.springframework.test.context.jdbc.SqlScriptsTestExecutionListener@6b0d80ed, org.springframework.boot.test.mock.mockito.MockitoTestExecutionListener@6f8e8894, org.springframework.boot.test.autoconfigure.web.servlet.MockMvcPrintOnlyOnFailureTestExecutionListener@3cfdd820, org.springframework.boot.test.autoconfigure.web.client.MockRestServiceServerResetTestExecutionListener@928763c, org.springframework.boot.test.mock.mockito.ResetMocksTestExecutionListener@e25951c, org.springframework.boot.test.autoconfigure.web.servlet.WebDriverTestExecutionListener@15f47664, org.springframework.boot.test.autoconfigure.restdocs.RestDocsTestExecutionListener@471a9022]
30-Mar-2020 00:03:40 2020-03-30 00:03:40.602  INFO 25035 --- [           main] s.c.a.AnnotationConfigApplicationContext : Refreshing org.springframework.context.annotation.AnnotationConfigApplicationContext@2fa7ae9: startup date [Mon Mar 30 00:03:40 UTC 2020]; root of context hierarchy
30-Mar-2020 00:03:40 2020-03-30 00:03:40.824  INFO 25035 --- [           main] trationDelegate$BeanPostProcessorChecker : Bean 'configurationPropertiesRebinderAutoConfiguration' of type [class org.springframework.cloud.autoconfigure.ConfigurationPropertiesRebinderAutoConfiguration$$EnhancerBySpringCGLIB$$219d8b3d] is not eligible for getting processed by all BeanPostProcessors (for example: not eligible for auto-proxying)
30-Mar-2020 00:03:41
30-Mar-2020 00:03:41   .   ____          _            __ _ _
30-Mar-2020 00:03:41 /\\ / ___'_ __ _ _(_)_ __  __ _ \ \ \ \
30-Mar-2020 00:03:41 ( ( )\___ | '_ | '_| | '_ \/ _` | \ \ \ \
30-Mar-2020 00:03:41 \\/  ___)| |_)| | | | | || (_| |  ) ) ) )
30-Mar-2020 00:03:41   '  |____| .__|_| |_|_| |_\__, | / / / /
30-Mar-2020 00:03:41 =========|_|==============|___/=/_/_/_/
30-Mar-2020 00:03:41 :: Spring Boot ::        (v1.4.1.RELEASE)
30-Mar-2020 00:03:41
30-Mar-2020 00:03:41 2020-03-30 00:03:41.156  INFO 25035 --- [           main] c.c.c.ConfigServicePropertySourceLocator : Fetching config from server at: http://localhost:8888
30-Mar-2020 00:03:41 2020-03-30 00:03:41.251  WARN 25035 --- [           main] c.c.c.ConfigServicePropertySourceLocator : Could not locate PropertySource: I/O error on GET request for "http://localhost:8888//blah": Connection refused (Connection refused); nested exception is java.net.ConnectException: Connection refused (Connection refused)
30-Mar-2020 00:03:41 2020-03-30 00:03:41.259  INFO 25035 --- [           main] o.s.c.d.acceptance.test.AnalyticsTests   : The following profiles are active: blah
30-Mar-2020 00:03:41 2020-03-30 00:03:41.469  INFO 25035 --- [           main] o.s.c.d.acceptance.test.AnalyticsTests   : Started AnalyticsTests in 1.409 seconds (JVM running for 2.178)
30-Mar-2020 00:03:41 2020-03-30 00:03:41.726  INFO 25035 --- [           main] junit.logTestName                        : Starting Test analyticsTest(org.springframework.cloud.dataflow.acceptance.test.AnalyticsTests)
30-Mar-2020 00:03:41 2020-03-30 00:03:41.733  INFO 25035 --- [           main] o.s.c.d.acceptance.test.AnalyticsTests   : Importing stream apps from uri resource: https://dataflow.spring.io/kafka-maven-latest
30-Mar-2020 00:03:44 2020-03-30 00:03:44.089  INFO 25035 --- [           main] junit.logTestName                        : Finished Test analyticsTest(org.springframework.cloud.dataflow.acceptance.test.AnalyticsTests)
30-Mar-2020 00:03:44 2020-03-30 00:03:44.089  INFO 25035 --- [           main] o.s.c.d.acceptance.test.AnalyticsTests   : Destroy all streams
30-Mar-2020 00:03:44 Tests run: 1, Failures: 0, Errors: 0, Skipped: 1, Time elapsed: 4.157 sec - in org.springframework.cloud.dataflow.acceptance.test.AnalyticsTests
30-Mar-2020 00:03:44 Running org.springframework.cloud.dataflow.acceptance.test.WoodChuckTests
30-Mar-2020 00:03:44 2020-03-30 00:03:44.114  INFO 25035 --- [           main] .b.t.c.SpringBootTestContextBootstrapper : Neither @ContextConfiguration nor @ContextHierarchy found for test class [org.springframework.cloud.dataflow.acceptance.test.WoodChuckTests], using SpringBootContextLoader
30-Mar-2020 00:03:44 2020-03-30 00:03:44.130  INFO 25035 --- [           main] .b.t.c.SpringBootTestContextBootstrapper : Loaded default TestExecutionListener class names from location [META-INF/spring.factories]: [org.springframework.boot.test.mock.mockito.MockitoTestExecutionListener, org.springframework.boot.test.mock.mockito.ResetMocksTestExecutionListener, org.springframework.boot.test.autoconfigure.restdocs.RestDocsTestExecutionListener, org.springframework.boot.test.autoconfigure.web.client.MockRestServiceServerResetTestExecutionListener, org.springframework.boot.test.autoconfigure.web.servlet.MockMvcPrintOnlyOnFailureTestExecutionListener, org.springframework.boot.test.autoconfigure.web.servlet.WebDriverTestExecutionListener, org.springframework.test.context.web.ServletTestExecutionListener, org.springframework.test.context.support.DirtiesContextBeforeModesTestExecutionListener, org.springframework.test.context.support.DependencyInjectionTestExecutionListener, org.springframework.test.context.support.DirtiesContextTestExecutionListener, org.springframework.test.context.transaction.TransactionalTestExecutionListener, org.springframework.test.context.jdbc.SqlScriptsTestExecutionListener]
30-Mar-2020 00:03:44 2020-03-30 00:03:44.138  INFO 25035 --- [           main] .b.t.c.SpringBootTestContextBootstrapper : Using TestExecutionListeners: [org.springframework.test.context.web.ServletTestExecutionListener@646c0a67, org.springframework.test.context.support.DirtiesContextBeforeModesTestExecutionListener@3804a9a8, org.springframework.boot.test.autoconfigure.SpringBootDependencyInjectionTestExecutionListener@117525fe, org.springframework.test.context.support.DirtiesContextTestExecutionListener@5f7989fa, org.springframework.test.context.transaction.TransactionalTestExecutionListener@5bc28f40, org.springframework.test.context.jdbc.SqlScriptsTestExecutionListener@46963479, org.springframework.boot.test.mock.mockito.MockitoTestExecutionListener@7e74a380, org.springframework.boot.test.autoconfigure.web.servlet.MockMvcPrintOnlyOnFailureTestExecutionListener@6dd1c3ed, org.springframework.boot.test.autoconfigure.web.client.MockRestServiceServerResetTestExecutionListener@22a6e998, org.springframework.boot.test.mock.mockito.ResetMocksTestExecutionListener@55e42449, org.springframework.boot.test.autoconfigure.web.servlet.WebDriverTestExecutionListener@e57e5d6, org.springframework.boot.test.autoconfigure.restdocs.RestDocsTestExecutionListener@6dfa915a]
30-Mar-2020 00:03:44 2020-03-30 00:03:44.221  INFO 25035 --- [           main] junit.logTestName                        : Starting Test testPartitioning(org.springframework.cloud.dataflow.acceptance.test.WoodChuckTests)
30-Mar-2020 00:03:44 2020-03-30 00:03:44.235  INFO 25035 --- [           main] o.s.c.d.acceptance.test.WoodChuckTests   : Creating stream 'WOODCHUCK-TEST'
30-Mar-2020 00:03:44 2020-03-30 00:03:44.351  INFO 25035 --- [           main] o.s.c.d.acceptance.test.WoodChuckTests   : Deploying stream 'WOODCHUCK-TEST' with properties: {app.*.spring.cloud.streamapp.security.enabled=false, app.log.logging.pattern.level=WOODCHUCK-${INSTANCE_INDEX:${CF_INSTANCE_INDEX:${spring.cloud.stream.instanceIndex:0}}} %5p, app.*.logging.file=${PID}-test.log, app.splitter.producer.partitionKeyExpression=payload, app.*.endpoints.logfile.sensitive=false, app.log.spring.cloud.stream.kafka.bindings.input.consumer.autoRebalanceEnabled=false, app.*.management.endpoints.web.exposure.include=*, deployer.log.count=2}
30-Mar-2020 00:03:46 2020-03-30 00:03:46.638  INFO 25035 --- [           main] o.s.c.d.acceptance.test.WoodChuckTests   : Checking: Stream=WOODCHUCK-TEST, status = deploying, status description = The stream is being deployed.
30-Mar-2020 00:03:46 2020-03-30 00:03:46.638  INFO 25035 --- [           main] o.s.c.d.acceptance.test.WoodChuckTests   : Sleeping to check status of Stream=WOODCHUCK-TEST
30-Mar-2020 00:03:56 2020-03-30 00:03:56.725  INFO 25035 --- [           main] o.s.c.d.acceptance.test.WoodChuckTests   : Checking: Stream=WOODCHUCK-TEST, status = deploying, status description = The stream is being deployed.
30-Mar-2020 00:03:56 2020-03-30 00:03:56.726  INFO 25035 --- [           main] o.s.c.d.acceptance.test.WoodChuckTests   : Sleeping to check status of Stream=WOODCHUCK-TEST
30-Mar-2020 00:04:06 2020-03-30 00:04:06.840  INFO 25035 --- [           main] o.s.c.d.acceptance.test.WoodChuckTests   : Checking: Stream=WOODCHUCK-TEST, status = deploying, status description = The stream is being deployed.
30-Mar-2020 00:04:06 2020-03-30 00:04:06.840  INFO 25035 --- [           main] o.s.c.d.acceptance.test.WoodChuckTests   : Sleeping to check status of Stream=WOODCHUCK-TEST
30-Mar-2020 00:04:16 2020-03-30 00:04:16.916  INFO 25035 --- [           main] o.s.c.d.acceptance.test.WoodChuckTests   : Checking: Stream=WOODCHUCK-TEST, status = deployed, status description = The stream has been successfully deployed
30-Mar-2020 00:04:16 2020-03-30 00:04:16.989  INFO 25035 --- [           main] o.s.c.d.acceptance.test.WoodChuckTests   : Sleeping to check status of Stream=WOODCHUCK-TEST
30-Mar-2020 00:04:26 2020-03-30 00:04:26.989  INFO 25035 --- [           main] o.s.c.d.acceptance.test.WoodChuckTests   : Stream 'WOODCHUCK-TEST' started with status: deployed
30-Mar-2020 00:04:26 2020-03-30 00:04:26.990  INFO 25035 --- [           main] o.s.c.d.acceptance.test.WoodChuckTests   : App 'log' has instances: {WOODCHUCK-TEST.log-v1-0=http://10.194.6.127:21978, WOODCHUCK-TEST.log-v1-1=http://10.194.6.127:40208}
30-Mar-2020 00:04:26 2020-03-30 00:04:26.990  INFO 25035 --- [           main] o.s.c.d.acceptance.test.WoodChuckTests   : App 'http' has instances: {WOODCHUCK-TEST.http-v1-0=http://10.194.6.127:60730}
30-Mar-2020 00:04:26 2020-03-30 00:04:26.990  INFO 25035 --- [           main] o.s.c.d.acceptance.test.WoodChuckTests   : App 'splitter' has instances: {WOODCHUCK-TEST.splitter-v1-0=http://10.194.6.127:49202}
30-Mar-2020 00:04:26 2020-03-30 00:04:26.990  INFO 25035 --- [           main] o.s.c.d.acceptance.test.WoodChuckTests   : Looking for 'Started HttpSource' in logfile for http
30-Mar-2020 00:04:36 2020-03-30 00:04:36.991  INFO 25035 --- [           main] o.s.c.d.acceptance.test.WoodChuckTests   : Requesting log for app WOODCHUCK-TEST.http-v1-0
30-Mar-2020 00:04:37 2020-03-30 00:04:37.317  INFO 25035 --- [           main] o.s.c.d.acceptance.test.WoodChuckTests   : Retrieved logfile from 'http://10.194.6.127:60730/actuator/logfile
30-Mar-2020 00:04:37 2020-03-30 00:04:37.323  INFO 25035 --- [           main] o.s.c.d.acceptance.test.WoodChuckTests   : Matched all 'Started HttpSource' in logfile for app http (source WOODCHUCK-TEST.http-v1-0)
30-Mar-2020 00:04:37 2020-03-30 00:04:37.325  INFO 25035 --- [           main] o.s.c.d.acceptance.test.WoodChuckTests   : Looking for 'Started SplitterProcessor' in logfile for splitter
30-Mar-2020 00:04:47 2020-03-30 00:04:47.326  INFO 25035 --- [           main] o.s.c.d.acceptance.test.WoodChuckTests   : Requesting log for app WOODCHUCK-TEST.splitter-v1-0
30-Mar-2020 00:04:47 2020-03-30 00:04:47.486  INFO 25035 --- [           main] o.s.c.d.acceptance.test.WoodChuckTests   : Retrieved logfile from 'http://10.194.6.127:49202/actuator/logfile
30-Mar-2020 00:04:47 2020-03-30 00:04:47.486  INFO 25035 --- [           main] o.s.c.d.acceptance.test.WoodChuckTests   : Matched all 'Started SplitterProcessor' in logfile for app splitter (source WOODCHUCK-TEST.splitter-v1-0)
30-Mar-2020 00:04:47 2020-03-30 00:04:47.486  INFO 25035 --- [           main] o.s.c.d.acceptance.test.WoodChuckTests   : Looking for 'Started LogSink' in logfile for log
30-Mar-2020 00:04:57 2020-03-30 00:04:57.486  INFO 25035 --- [           main] o.s.c.d.acceptance.test.WoodChuckTests   : Requesting log for app WOODCHUCK-TEST.log-v1-0
30-Mar-2020 00:04:57 2020-03-30 00:04:57.657  INFO 25035 --- [           main] o.s.c.d.acceptance.test.WoodChuckTests   : Retrieved logfile from 'http://10.194.6.127:21978/actuator/logfile
30-Mar-2020 00:04:57 2020-03-30 00:04:57.658  INFO 25035 --- [           main] o.s.c.d.acceptance.test.WoodChuckTests   : Requesting log for app WOODCHUCK-TEST.log-v1-1
30-Mar-2020 00:04:58 2020-03-30 00:04:58.040  INFO 25035 --- [           main] o.s.c.d.acceptance.test.WoodChuckTests   : Retrieved logfile from 'http://10.194.6.127:40208/actuator/logfile
30-Mar-2020 00:04:58 2020-03-30 00:04:58.040  INFO 25035 --- [           main] o.s.c.d.acceptance.test.WoodChuckTests   : Matched all 'Started LogSink' in logfile for app log (source WOODCHUCK-TEST.log-v1-0)
30-Mar-2020 00:04:58 2020-03-30 00:04:58.243  INFO 25035 --- [           main] o.s.c.d.acceptance.test.WoodChuckTests   : Looking for 'WOODCHUCK-0,How,chuck' in logfile for log
30-Mar-2020 00:05:08 2020-03-30 00:05:08.244  INFO 25035 --- [           main] o.s.c.d.acceptance.test.WoodChuckTests   : Requesting log for app WOODCHUCK-TEST.log-v1-0
30-Mar-2020 00:05:08 2020-03-30 00:05:08.255  INFO 25035 --- [           main] o.s.c.d.acceptance.test.WoodChuckTests   : Retrieved logfile from 'http://10.194.6.127:21978/actuator/logfile
30-Mar-2020 00:05:08 2020-03-30 00:05:08.256  INFO 25035 --- [           main] o.s.c.d.acceptance.test.WoodChuckTests   : Requesting log for app WOODCHUCK-TEST.log-v1-1
30-Mar-2020 00:05:08 2020-03-30 00:05:08.264  INFO 25035 --- [           main] o.s.c.d.acceptance.test.WoodChuckTests   : Retrieved logfile from 'http://10.194.6.127:40208/actuator/logfile
30-Mar-2020 00:05:08 2020-03-30 00:05:08.264  INFO 25035 --- [           main] o.s.c.d.acceptance.test.WoodChuckTests   : Matched all 'WOODCHUCK-0,How,chuck' in logfile for app log (source WOODCHUCK-TEST.log-v1-0)
30-Mar-2020 00:05:08 2020-03-30 00:05:08.264  INFO 25035 --- [           main] o.s.c.d.acceptance.test.WoodChuckTests   : Looking for 'WOODCHUCK-1,much,wood,would,if,a,woodchuck,could' in logfile for log
30-Mar-2020 00:05:18 2020-03-30 00:05:18.264  INFO 25035 --- [           main] o.s.c.d.acceptance.test.WoodChuckTests   : Requesting log for app WOODCHUCK-TEST.log-v1-0
30-Mar-2020 00:05:18 2020-03-30 00:05:18.274  INFO 25035 --- [           main] o.s.c.d.acceptance.test.WoodChuckTests   : Retrieved logfile from 'http://10.194.6.127:21978/actuator/logfile
30-Mar-2020 00:05:18 2020-03-30 00:05:18.274  INFO 25035 --- [           main] o.s.c.d.acceptance.test.WoodChuckTests   : Requesting log for app WOODCHUCK-TEST.log-v1-1
30-Mar-2020 00:05:18 2020-03-30 00:05:18.287  INFO 25035 --- [           main] o.s.c.d.acceptance.test.WoodChuckTests   : Retrieved logfile from 'http://10.194.6.127:40208/actuator/logfile
30-Mar-2020 00:05:18 2020-03-30 00:05:18.288  INFO 25035 --- [           main] o.s.c.d.acceptance.test.WoodChuckTests   : Matched all 'WOODCHUCK-1,much,wood,would,if,a,woodchuck,could' in logfile for app log (source WOODCHUCK-TEST.log-v1-1)
30-Mar-2020 00:05:18 2020-03-30 00:05:18.289  INFO 25035 --- [           main] junit.logTestName                        : Test testPartitioning(org.springframework.cloud.dataflow.acceptance.test.WoodChuckTests) Succeeded
30-Mar-2020 00:05:18 2020-03-30 00:05:18.291  INFO 25035 --- [           main] junit.logTestName                        : Finished Test testPartitioning(org.springframework.cloud.dataflow.acceptance.test.WoodChuckTests)
30-Mar-2020 00:05:18 2020-03-30 00:05:18.291  INFO 25035 --- [           main] o.s.c.d.acceptance.test.WoodChuckTests   : Destroy all streams
30-Mar-2020 00:05:18 Tests run: 1, Failures: 0, Errors: 0, Skipped: 0, Time elapsed: 94.589 sec - in org.springframework.cloud.dataflow.acceptance.test.WoodChuckTests
30-Mar-2020 00:05:18 Running org.springframework.cloud.dataflow.acceptance.test.HttpSourceTests
30-Mar-2020 00:05:18 2020-03-30 00:05:18.774  INFO 25035 --- [           main] .b.t.c.SpringBootTestContextBootstrapper : Neither @ContextConfiguration nor @ContextHierarchy found for test class [org.springframework.cloud.dataflow.acceptance.test.HttpSourceTests], using SpringBootContextLoader
30-Mar-2020 00:05:18 2020-03-30 00:05:18.789  INFO 25035 --- [           main] .b.t.c.SpringBootTestContextBootstrapper : Loaded default TestExecutionListener class names from location [META-INF/spring.factories]: [org.springframework.boot.test.mock.mockito.MockitoTestExecutionListener, org.springframework.boot.test.mock.mockito.ResetMocksTestExecutionListener, org.springframework.boot.test.autoconfigure.restdocs.RestDocsTestExecutionListener, org.springframework.boot.test.autoconfigure.web.client.MockRestServiceServerResetTestExecutionListener, org.springframework.boot.test.autoconfigure.web.servlet.MockMvcPrintOnlyOnFailureTestExecutionListener, org.springframework.boot.test.autoconfigure.web.servlet.WebDriverTestExecutionListener, org.springframework.test.context.web.ServletTestExecutionListener, org.springframework.test.context.support.DirtiesContextBeforeModesTestExecutionListener, org.springframework.test.context.support.DependencyInjectionTestExecutionListener, org.springframework.test.context.support.DirtiesContextTestExecutionListener, org.springframework.test.context.transaction.TransactionalTestExecutionListener, org.springframework.test.context.jdbc.SqlScriptsTestExecutionListener]
30-Mar-2020 00:05:18 2020-03-30 00:05:18.797  INFO 25035 --- [           main] .b.t.c.SpringBootTestContextBootstrapper : Using TestExecutionListeners: [org.springframework.test.context.web.ServletTestExecutionListener@3b545206, org.springframework.test.context.support.DirtiesContextBeforeModesTestExecutionListener@77bb48d5, org.springframework.boot.test.autoconfigure.SpringBootDependencyInjectionTestExecutionListener@181d8899, org.springframework.test.context.support.DirtiesContextTestExecutionListener@12d5c30e, org.springframework.test.context.transaction.TransactionalTestExecutionListener@b887730, org.springframework.test.context.jdbc.SqlScriptsTestExecutionListener@26586b74, org.springframework.boot.test.mock.mockito.MockitoTestExecutionListener@52f57666, org.springframework.boot.test.autoconfigure.web.servlet.MockMvcPrintOnlyOnFailureTestExecutionListener@6e041285, org.springframework.boot.test.autoconfigure.web.client.MockRestServiceServerResetTestExecutionListener@267dc982, org.springframework.boot.test.mock.mockito.ResetMocksTestExecutionListener@439b15f2, org.springframework.boot.test.autoconfigure.web.servlet.WebDriverTestExecutionListener@3aa41da1, org.springframework.boot.test.autoconfigure.restdocs.RestDocsTestExecutionListener@74fab04a]
30-Mar-2020 00:05:18 2020-03-30 00:05:18.886  INFO 25035 --- [           main] junit.logTestName                        : Starting Test httpSourceTests(org.springframework.cloud.dataflow.acceptance.test.HttpSourceTests)
30-Mar-2020 00:05:18 2020-03-30 00:05:18.887  INFO 25035 --- [           main] o.s.c.d.acceptance.test.HttpSourceTests  : Creating stream 'HTTP-TEST'
30-Mar-2020 00:05:18 2020-03-30 00:05:18.933  INFO 25035 --- [           main] o.s.c.d.acceptance.test.HttpSourceTests  : Deploying stream 'HTTP-TEST' with properties: {app.*.spring.cloud.streamapp.security.enabled=false, app.*.logging.file=${PID}-test.log, app.*.endpoints.logfile.sensitive=false, app.*.management.endpoints.web.exposure.include=*}
30-Mar-2020 00:05:19 2020-03-30 00:05:19.694  INFO 25035 --- [           main] o.s.c.d.acceptance.test.HttpSourceTests  : Checking: Stream=HTTP-TEST, status = deploying, status description = The stream is being deployed.
30-Mar-2020 00:05:19 2020-03-30 00:05:19.695  INFO 25035 --- [           main] o.s.c.d.acceptance.test.HttpSourceTests  : Sleeping to check status of Stream=HTTP-TEST
30-Mar-2020 00:05:29 2020-03-30 00:05:29.775  INFO 25035 --- [           main] o.s.c.d.acceptance.test.HttpSourceTests  : Checking: Stream=HTTP-TEST, status = deploying, status description = The stream is being deployed.
30-Mar-2020 00:05:29 2020-03-30 00:05:29.775  INFO 25035 --- [           main] o.s.c.d.acceptance.test.HttpSourceTests  : Sleeping to check status of Stream=HTTP-TEST
30-Mar-2020 00:05:39 2020-03-30 00:05:39.811  INFO 25035 --- [           main] o.s.c.d.acceptance.test.HttpSourceTests  : Checking: Stream=HTTP-TEST, status = deployed, status description = The stream has been successfully deployed
30-Mar-2020 00:05:39 2020-03-30 00:05:39.861  INFO 25035 --- [           main] o.s.c.d.acceptance.test.HttpSourceTests  : Sleeping to check status of Stream=HTTP-TEST
30-Mar-2020 00:05:49 2020-03-30 00:05:49.861  INFO 25035 --- [           main] o.s.c.d.acceptance.test.HttpSourceTests  : Stream 'HTTP-TEST' started with status: deployed
30-Mar-2020 00:05:49 2020-03-30 00:05:49.862  INFO 25035 --- [           main] o.s.c.d.acceptance.test.HttpSourceTests  : App 'log' has instances: {HTTP-TEST.log-v1-0=http://10.194.6.127:47875}
30-Mar-2020 00:05:49 2020-03-30 00:05:49.862  INFO 25035 --- [           main] o.s.c.d.acceptance.test.HttpSourceTests  : App 'http' has instances: {HTTP-TEST.http-v1-0=http://10.194.6.127:56262}
30-Mar-2020 00:05:49 2020-03-30 00:05:49.870  INFO 25035 --- [           main] o.s.c.d.acceptance.test.HttpSourceTests  : Looking for 'Started HttpSource' in logfile for http
30-Mar-2020 00:05:59 2020-03-30 00:05:59.870  INFO 25035 --- [           main] o.s.c.d.acceptance.test.HttpSourceTests  : Requesting log for app HTTP-TEST.http-v1-0
30-Mar-2020 00:06:00 2020-03-30 00:06:00.158  INFO 25035 --- [           main] o.s.c.d.acceptance.test.HttpSourceTests  : Retrieved logfile from 'http://10.194.6.127:56262/actuator/logfile
30-Mar-2020 00:06:00 2020-03-30 00:06:00.158  INFO 25035 --- [           main] o.s.c.d.acceptance.test.HttpSourceTests  : Matched all 'Started HttpSource' in logfile for app http (source HTTP-TEST.http-v1-0)
30-Mar-2020 00:06:00 2020-03-30 00:06:00.158  INFO 25035 --- [           main] o.s.c.d.acceptance.test.HttpSourceTests  : Looking for 'Started LogSink' in logfile for log
30-Mar-2020 00:06:10 2020-03-30 00:06:10.159  INFO 25035 --- [           main] o.s.c.d.acceptance.test.HttpSourceTests  : Requesting log for app HTTP-TEST.log-v1-0
30-Mar-2020 00:06:10 2020-03-30 00:06:10.282  INFO 25035 --- [           main] o.s.c.d.acceptance.test.HttpSourceTests  : Retrieved logfile from 'http://10.194.6.127:47875/actuator/logfile
30-Mar-2020 00:06:10 2020-03-30 00:06:10.283  INFO 25035 --- [           main] o.s.c.d.acceptance.test.HttpSourceTests  : Matched all 'Started LogSink' in logfile for app log (source HTTP-TEST.log-v1-0)
30-Mar-2020 00:06:10 2020-03-30 00:06:10.459  INFO 25035 --- [           main] o.s.c.d.acceptance.test.HttpSourceTests  : Looking for 'adb44b5b-1987-4300-8ad3-96cdc94a21b0' in logfile for log
30-Mar-2020 00:06:20 2020-03-30 00:06:20.460  INFO 25035 --- [           main] o.s.c.d.acceptance.test.HttpSourceTests  : Requesting log for app HTTP-TEST.log-v1-0
30-Mar-2020 00:06:20 2020-03-30 00:06:20.469  INFO 25035 --- [           main] o.s.c.d.acceptance.test.HttpSourceTests  : Retrieved logfile from 'http://10.194.6.127:47875/actuator/logfile
30-Mar-2020 00:06:20 2020-03-30 00:06:20.469  INFO 25035 --- [           main] o.s.c.d.acceptance.test.HttpSourceTests  : Matched all 'adb44b5b-1987-4300-8ad3-96cdc94a21b0' in logfile for app log (source HTTP-TEST.log-v1-0)
30-Mar-2020 00:06:20 2020-03-30 00:06:20.470  INFO 25035 --- [           main] junit.logTestName                        : Test httpSourceTests(org.springframework.cloud.dataflow.acceptance.test.HttpSourceTests) Succeeded
30-Mar-2020 00:06:20 2020-03-30 00:06:20.471  INFO 25035 --- [           main] junit.logTestName                        : Finished Test httpSourceTests(org.springframework.cloud.dataflow.acceptance.test.HttpSourceTests)
30-Mar-2020 00:06:20 2020-03-30 00:06:20.471  INFO 25035 --- [           main] o.s.c.d.acceptance.test.HttpSourceTests  : Destroy all streams
30-Mar-2020 00:06:20 Tests run: 1, Failures: 0, Errors: 0, Skipped: 0, Time elapsed: 61.888 sec - in org.springframework.cloud.dataflow.acceptance.test.HttpSourceTests
30-Mar-2020 00:06:20 Running org.springframework.cloud.dataflow.acceptance.test.TimestampTaskTests
30-Mar-2020 00:06:20 2020-03-30 00:06:20.675  INFO 25035 --- [           main] o.s.c.support.GenericApplicationContext  : Refreshing org.springframework.context.support.GenericApplicationContext@7e446d92: startup date [Mon Mar 30 00:06:20 UTC 2020]; root of context hierarchy
30-Mar-2020 00:06:20 2020-03-30 00:06:20.787  INFO 25035 --- [           main] junit.logTestName                        : Starting Test timeStampTests(org.springframework.cloud.dataflow.acceptance.test.TimestampTaskTests)
30-Mar-2020 00:06:20 2020-03-30 00:06:20.788  INFO 25035 --- [           main] o.s.c.d.a.test.AbstractTaskTests         : Importing task apps from uri resource: https://dataflow.spring.io/task-maven-latest
30-Mar-2020 00:06:21 2020-03-30 00:06:21.351  INFO 25035 --- [           main] o.s.c.d.a.test.AbstractTaskTests         : Done importing task apps.
30-Mar-2020 00:06:31 2020-03-30 00:06:31.743  INFO 25035 --- [           main] junit.logTestName                        : Test timeStampTests(org.springframework.cloud.dataflow.acceptance.test.TimestampTaskTests) Succeeded
30-Mar-2020 00:06:31 2020-03-30 00:06:31.744  INFO 25035 --- [           main] junit.logTestName                        : Finished Test timeStampTests(org.springframework.cloud.dataflow.acceptance.test.TimestampTaskTests)
30-Mar-2020 00:06:31 2020-03-30 00:06:31.803  INFO 25035 --- [           main] junit.logTestName                        : Starting Test timeStampTestsMultipleLaunch(org.springframework.cloud.dataflow.acceptance.test.TimestampTaskTests)
30-Mar-2020 00:06:52 2020-03-30 00:06:52.247  INFO 25035 --- [           main] junit.logTestName                        : Test timeStampTestsMultipleLaunch(org.springframework.cloud.dataflow.acceptance.test.TimestampTaskTests) Succeeded
30-Mar-2020 00:06:52 2020-03-30 00:06:52.247  INFO 25035 --- [           main] junit.logTestName                        : Finished Test timeStampTestsMultipleLaunch(org.springframework.cloud.dataflow.acceptance.test.TimestampTaskTests)
30-Mar-2020 00:06:52 Tests run: 2, Failures: 0, Errors: 0, Skipped: 0, Time elapsed: 31.579 sec - in org.springframework.cloud.dataflow.acceptance.test.TimestampTaskTests
30-Mar-2020 00:06:52 Running org.springframework.cloud.dataflow.acceptance.test.TickTockTests
30-Mar-2020 00:06:52 2020-03-30 00:06:52.248  INFO 25035 --- [           main] .b.t.c.SpringBootTestContextBootstrapper : Neither @ContextConfiguration nor @ContextHierarchy found for test class [org.springframework.cloud.dataflow.acceptance.test.TickTockTests], using SpringBootContextLoader
30-Mar-2020 00:06:52 2020-03-30 00:06:52.253  INFO 25035 --- [           main] .b.t.c.SpringBootTestContextBootstrapper : Loaded default TestExecutionListener class names from location [META-INF/spring.factories]: [org.springframework.boot.test.mock.mockito.MockitoTestExecutionListener, org.springframework.boot.test.mock.mockito.ResetMocksTestExecutionListener, org.springframework.boot.test.autoconfigure.restdocs.RestDocsTestExecutionListener, org.springframework.boot.test.autoconfigure.web.client.MockRestServiceServerResetTestExecutionListener, org.springframework.boot.test.autoconfigure.web.servlet.MockMvcPrintOnlyOnFailureTestExecutionListener, org.springframework.boot.test.autoconfigure.web.servlet.WebDriverTestExecutionListener, org.springframework.test.context.web.ServletTestExecutionListener, org.springframework.test.context.support.DirtiesContextBeforeModesTestExecutionListener, org.springframework.test.context.support.DependencyInjectionTestExecutionListener, org.springframework.test.context.support.DirtiesContextTestExecutionListener, org.springframework.test.context.transaction.TransactionalTestExecutionListener, org.springframework.test.context.jdbc.SqlScriptsTestExecutionListener]
30-Mar-2020 00:06:52 2020-03-30 00:06:52.255  INFO 25035 --- [           main] .b.t.c.SpringBootTestContextBootstrapper : Using TestExecutionListeners: [org.springframework.test.context.web.ServletTestExecutionListener@201c3cda, org.springframework.test.context.support.DirtiesContextBeforeModesTestExecutionListener@4c86da0c, org.springframework.boot.test.autoconfigure.SpringBootDependencyInjectionTestExecutionListener@5d97caa4, org.springframework.test.context.support.DirtiesContextTestExecutionListener@6732726, org.springframework.test.context.transaction.TransactionalTestExecutionListener@474821de, org.springframework.test.context.jdbc.SqlScriptsTestExecutionListener@3d64c581, org.springframework.boot.test.mock.mockito.MockitoTestExecutionListener@5ec5ea63, org.springframework.boot.test.autoconfigure.web.servlet.MockMvcPrintOnlyOnFailureTestExecutionListener@4190bc8a, org.springframework.boot.test.autoconfigure.web.client.MockRestServiceServerResetTestExecutionListener@47d023b7, org.springframework.boot.test.mock.mockito.ResetMocksTestExecutionListener@5c83ae01, org.springframework.boot.test.autoconfigure.web.servlet.WebDriverTestExecutionListener@2d64c100, org.springframework.boot.test.autoconfigure.restdocs.RestDocsTestExecutionListener@69d45cca]
30-Mar-2020 00:06:52 2020-03-30 00:06:52.345  INFO 25035 --- [           main] junit.logTestName                        : Starting Test tickTockUpdateRollbackTests(org.springframework.cloud.dataflow.acceptance.test.TickTockTests)
30-Mar-2020 00:06:52 2020-03-30 00:06:52.377  INFO 25035 --- [           main] o.s.c.d.acceptance.test.TickTockTests    : Creating stream 'TICKTOCK'
30-Mar-2020 00:06:52 2020-03-30 00:06:52.407  INFO 25035 --- [           main] o.s.c.d.acceptance.test.TickTockTests    : Deploying stream 'TICKTOCK' with properties: {app.*.spring.cloud.streamapp.security.enabled=false, app.*.logging.file=${PID}-test.log, app.*.endpoints.logfile.sensitive=false, app.log.log.expression='TICKTOCK - TIMESTAMP: '.concat(payload), app.*.management.endpoints.web.exposure.include=*}
30-Mar-2020 00:06:53 2020-03-30 00:06:53.005  INFO 25035 --- [           main] o.s.c.d.acceptance.test.TickTockTests    : Checking: Stream=TICKTOCK, status = deploying, status description = The stream is being deployed.
30-Mar-2020 00:06:53 2020-03-30 00:06:53.006  INFO 25035 --- [           main] o.s.c.d.acceptance.test.TickTockTests    : Sleeping to check status of Stream=TICKTOCK
30-Mar-2020 00:07:03 2020-03-30 00:07:03.065  INFO 25035 --- [           main] o.s.c.d.acceptance.test.TickTockTests    : Checking: Stream=TICKTOCK, status = deploying, status description = The stream is being deployed.
30-Mar-2020 00:07:03 2020-03-30 00:07:03.065  INFO 25035 --- [           main] o.s.c.d.acceptance.test.TickTockTests    : Sleeping to check status of Stream=TICKTOCK
30-Mar-2020 00:07:13 2020-03-30 00:07:13.099  INFO 25035 --- [           main] o.s.c.d.acceptance.test.TickTockTests    : Checking: Stream=TICKTOCK, status = deployed, status description = The stream has been successfully deployed
30-Mar-2020 00:07:13 2020-03-30 00:07:13.133  INFO 25035 --- [           main] o.s.c.d.acceptance.test.TickTockTests    : Sleeping to check status of Stream=TICKTOCK
30-Mar-2020 00:07:23 2020-03-30 00:07:23.133  INFO 25035 --- [           main] o.s.c.d.acceptance.test.TickTockTests    : Stream 'TICKTOCK' started with status: deployed
30-Mar-2020 00:07:23 2020-03-30 00:07:23.133  INFO 25035 --- [           main] o.s.c.d.acceptance.test.TickTockTests    : App 'log' has instances: {TICKTOCK.log-v1-0=http://10.194.6.127:23746}
30-Mar-2020 00:07:23 2020-03-30 00:07:23.133  INFO 25035 --- [           main] o.s.c.d.acceptance.test.TickTockTests    : App 'time' has instances: {TICKTOCK.time-v1-0=http://10.194.6.127:50813}
30-Mar-2020 00:07:23 2020-03-30 00:07:23.134  INFO 25035 --- [           main] o.s.c.d.acceptance.test.TickTockTests    : Looking for 'Started TimeSource' in logfile for time
30-Mar-2020 00:07:33 2020-03-30 00:07:33.134  INFO 25035 --- [           main] o.s.c.d.acceptance.test.TickTockTests    : Requesting log for app TICKTOCK.time-v1-0
30-Mar-2020 00:07:33 2020-03-30 00:07:33.451  INFO 25035 --- [           main] o.s.c.d.acceptance.test.TickTockTests    : Retrieved logfile from 'http://10.194.6.127:50813/actuator/logfile
30-Mar-2020 00:07:33 2020-03-30 00:07:33.451  INFO 25035 --- [           main] o.s.c.d.acceptance.test.TickTockTests    : Matched all 'Started TimeSource' in logfile for app time (source TICKTOCK.time-v1-0)
30-Mar-2020 00:07:33 2020-03-30 00:07:33.451  INFO 25035 --- [           main] o.s.c.d.acceptance.test.TickTockTests    : Looking for 'Started LogSink' in logfile for log
30-Mar-2020 00:07:43 2020-03-30 00:07:43.452  INFO 25035 --- [           main] o.s.c.d.acceptance.test.TickTockTests    : Requesting log for app TICKTOCK.log-v1-0
30-Mar-2020 00:07:43 2020-03-30 00:07:43.592  INFO 25035 --- [           main] o.s.c.d.acceptance.test.TickTockTests    : Retrieved logfile from 'http://10.194.6.127:23746/actuator/logfile
30-Mar-2020 00:07:43 2020-03-30 00:07:43.592  INFO 25035 --- [           main] o.s.c.d.acceptance.test.TickTockTests    : Matched all 'Started LogSink' in logfile for app log (source TICKTOCK.log-v1-0)
30-Mar-2020 00:07:43 2020-03-30 00:07:43.592  INFO 25035 --- [           main] o.s.c.d.acceptance.test.TickTockTests    : Looking for 'TICKTOCK - TIMESTAMP:' in logfile for log
30-Mar-2020 00:07:53 2020-03-30 00:07:53.593  INFO 25035 --- [           main] o.s.c.d.acceptance.test.TickTockTests    : Requesting log for app TICKTOCK.log-v1-0
30-Mar-2020 00:07:53 2020-03-30 00:07:53.603  INFO 25035 --- [           main] o.s.c.d.acceptance.test.TickTockTests    : Retrieved logfile from 'http://10.194.6.127:23746/actuator/logfile
30-Mar-2020 00:07:53 2020-03-30 00:07:53.603  INFO 25035 --- [           main] o.s.c.d.acceptance.test.TickTockTests    : Matched all 'TICKTOCK - TIMESTAMP:' in logfile for app log (source TICKTOCK.log-v1-0)
30-Mar-2020 00:07:53 2020-03-30 00:07:53.604  INFO 25035 --- [           main] o.s.c.d.acceptance.test.TickTockTests    : Updating stream 'TICKTOCK'
30-Mar-2020 00:07:54 2020-03-30 00:07:54.186  INFO 25035 --- [           main] o.s.c.d.acceptance.test.TickTockTests    : Checking: Stream=TICKTOCK, status = deploying, status description = The stream is being deployed.
30-Mar-2020 00:07:54 2020-03-30 00:07:54.187  INFO 25035 --- [           main] o.s.c.d.acceptance.test.TickTockTests    : Sleeping to check status of Stream=TICKTOCK
30-Mar-2020 00:08:04 2020-03-30 00:08:04.215  INFO 25035 --- [           main] o.s.c.d.acceptance.test.TickTockTests    : Checking: Stream=TICKTOCK, status = deployed, status description = The stream has been successfully deployed
30-Mar-2020 00:08:04 2020-03-30 00:08:04.241  INFO 25035 --- [           main] o.s.c.d.acceptance.test.TickTockTests    : Sleeping to check status of Stream=TICKTOCK
30-Mar-2020 00:08:14 2020-03-30 00:08:14.241  INFO 25035 --- [           main] o.s.c.d.acceptance.test.TickTockTests    : Stream 'TICKTOCK' started with status: deployed
30-Mar-2020 00:08:14 2020-03-30 00:08:14.242  INFO 25035 --- [           main] o.s.c.d.acceptance.test.TickTockTests    : App 'log' has instances: {TICKTOCK.log-v1-0=http://10.194.6.127:23746, TICKTOCK.log-v2-0=http://10.194.6.127:40613}
30-Mar-2020 00:08:14 2020-03-30 00:08:14.242  INFO 25035 --- [           main] o.s.c.d.acceptance.test.TickTockTests    : App 'time' has instances: {TICKTOCK.time-v1-0=http://10.194.6.127:50813}
30-Mar-2020 00:08:14 2020-03-30 00:08:14.242  INFO 25035 --- [           main] o.s.c.d.acceptance.test.TickTockTests    : Looking for 'Started LogSink' in logfile for log
30-Mar-2020 00:08:24 2020-03-30 00:08:24.242  INFO 25035 --- [           main] o.s.c.d.acceptance.test.TickTockTests    : Requesting log for app TICKTOCK.log-v1-0
30-Mar-2020 00:08:24 2020-03-30 00:08:24.243  WARN 25035 --- [           main] o.s.c.d.acceptance.test.TickTockTests    : Error while trying to access logfile from 'http://10.194.6.127:23746/logfile' due to : org.springframework.web.client.ResourceAccessException: I/O error on GET request for "http://10.194.6.127:23746/logfile": Connection refused (Connection refused); nested exception is java.net.ConnectException: Connection refused (Connection refused)
30-Mar-2020 00:08:24 2020-03-30 00:08:24.243  INFO 25035 --- [           main] o.s.c.d.acceptance.test.TickTockTests    : Requesting log for app TICKTOCK.log-v2-0
30-Mar-2020 00:08:24 2020-03-30 00:08:24.396  INFO 25035 --- [           main] o.s.c.d.acceptance.test.TickTockTests    : Retrieved logfile from 'http://10.194.6.127:40613/actuator/logfile
30-Mar-2020 00:08:24 2020-03-30 00:08:24.397  INFO 25035 --- [           main] o.s.c.d.acceptance.test.TickTockTests    : Matched all 'Started LogSink' in logfile for app log (source TICKTOCK.log-v2-0)
30-Mar-2020 00:08:24 2020-03-30 00:08:24.397  INFO 25035 --- [           main] o.s.c.d.acceptance.test.TickTockTests    : Looking for 'TICKTOCK Updated - TIMESTAMP:' in logfile for log
30-Mar-2020 00:08:34 2020-03-30 00:08:34.397  INFO 25035 --- [           main] o.s.c.d.acceptance.test.TickTockTests    : Requesting log for app TICKTOCK.log-v1-0
30-Mar-2020 00:08:34 2020-03-30 00:08:34.398  WARN 25035 --- [           main] o.s.c.d.acceptance.test.TickTockTests    : Error while trying to access logfile from 'http://10.194.6.127:23746/logfile' due to : org.springframework.web.client.ResourceAccessException: I/O error on GET request for "http://10.194.6.127:23746/logfile": Connection refused (Connection refused); nested exception is java.net.ConnectException: Connection refused (Connection refused)
30-Mar-2020 00:08:34 2020-03-30 00:08:34.398  INFO 25035 --- [           main] o.s.c.d.acceptance.test.TickTockTests    : Requesting log for app TICKTOCK.log-v2-0
30-Mar-2020 00:08:34 2020-03-30 00:08:34.406  INFO 25035 --- [           main] o.s.c.d.acceptance.test.TickTockTests    : Retrieved logfile from 'http://10.194.6.127:40613/actuator/logfile
30-Mar-2020 00:08:34 2020-03-30 00:08:34.407  INFO 25035 --- [           main] o.s.c.d.acceptance.test.TickTockTests    : Matched all 'TICKTOCK Updated - TIMESTAMP:' in logfile for app log (source TICKTOCK.log-v2-0)
30-Mar-2020 00:08:34 2020-03-30 00:08:34.407  INFO 25035 --- [           main] o.s.c.d.acceptance.test.TickTockTests    : Rolling back the stream 'TICKTOCK' to the version 0
30-Mar-2020 00:08:34 2020-03-30 00:08:34.807  INFO 25035 --- [           main] o.s.c.d.acceptance.test.TickTockTests    : Checking: Stream=TICKTOCK, status = deploying, status description = The stream is being deployed.
30-Mar-2020 00:08:34 2020-03-30 00:08:34.808  INFO 25035 --- [           main] o.s.c.d.acceptance.test.TickTockTests    : Sleeping to check status of Stream=TICKTOCK
30-Mar-2020 00:08:44 2020-03-30 00:08:44.836  INFO 25035 --- [           main] o.s.c.d.acceptance.test.TickTockTests    : Checking: Stream=TICKTOCK, status = deployed, status description = The stream has been successfully deployed
30-Mar-2020 00:08:44 2020-03-30 00:08:44.865  INFO 25035 --- [           main] o.s.c.d.acceptance.test.TickTockTests    : Sleeping to check status of Stream=TICKTOCK
30-Mar-2020 00:08:54 2020-03-30 00:08:54.866  INFO 25035 --- [           main] o.s.c.d.acceptance.test.TickTockTests    : Stream 'TICKTOCK' started with status: deployed
30-Mar-2020 00:08:54 2020-03-30 00:08:54.866  INFO 25035 --- [           main] o.s.c.d.acceptance.test.TickTockTests    : App 'log' has instances: {TICKTOCK.log-v1-0=http://10.194.6.127:23746, TICKTOCK.log-v3-0=http://10.194.6.127:39333, TICKTOCK.log-v2-0=http://10.194.6.127:40613}
30-Mar-2020 00:08:54 2020-03-30 00:08:54.866  INFO 25035 --- [           main] o.s.c.d.acceptance.test.TickTockTests    : App 'time' has instances: {TICKTOCK.time-v1-0=http://10.194.6.127:50813}
30-Mar-2020 00:08:54 2020-03-30 00:08:54.866  INFO 25035 --- [           main] o.s.c.d.acceptance.test.TickTockTests    : Looking for 'TICKTOCK - TIMESTAMP:' in logfile for log
30-Mar-2020 00:09:04 2020-03-30 00:09:04.867  INFO 25035 --- [           main] o.s.c.d.acceptance.test.TickTockTests    : Requesting log for app TICKTOCK.log-v1-0
30-Mar-2020 00:09:04 2020-03-30 00:09:04.868  WARN 25035 --- [           main] o.s.c.d.acceptance.test.TickTockTests    : Error while trying to access logfile from 'http://10.194.6.127:23746/logfile' due to : org.springframework.web.client.ResourceAccessException: I/O error on GET request for "http://10.194.6.127:23746/logfile": Connection refused (Connection refused); nested exception is java.net.ConnectException: Connection refused (Connection refused)
30-Mar-2020 00:09:04 2020-03-30 00:09:04.868  INFO 25035 --- [           main] o.s.c.d.acceptance.test.TickTockTests    : Requesting log for app TICKTOCK.log-v3-0
30-Mar-2020 00:09:04 2020-03-30 00:09:04.996  INFO 25035 --- [           main] o.s.c.d.acceptance.test.TickTockTests    : Retrieved logfile from 'http://10.194.6.127:39333/actuator/logfile
30-Mar-2020 00:09:04 2020-03-30 00:09:04.996  INFO 25035 --- [           main] o.s.c.d.acceptance.test.TickTockTests    : Requesting log for app TICKTOCK.log-v2-0
30-Mar-2020 00:09:04 2020-03-30 00:09:04.997  WARN 25035 --- [           main] o.s.c.d.acceptance.test.TickTockTests    : Error while trying to access logfile from 'http://10.194.6.127:40613/logfile' due to : org.springframework.web.client.ResourceAccessException: I/O error on GET request for "http://10.194.6.127:40613/logfile": Connection refused (Connection refused); nested exception is java.net.ConnectException: Connection refused (Connection refused)
30-Mar-2020 00:09:04 2020-03-30 00:09:04.998  INFO 25035 --- [           main] o.s.c.d.acceptance.test.TickTockTests    : Matched all 'TICKTOCK - TIMESTAMP:' in logfile for app log (source TICKTOCK.log-v3-0)
30-Mar-2020 00:09:05 2020-03-30 00:09:04.999  INFO 25035 --- [           main] junit.logTestName                        : Test tickTockUpdateRollbackTests(org.springframework.cloud.dataflow.acceptance.test.TickTockTests) Succeeded
30-Mar-2020 00:09:05 2020-03-30 00:09:05.000  INFO 25035 --- [           main] junit.logTestName                        : Finished Test tickTockUpdateRollbackTests(org.springframework.cloud.dataflow.acceptance.test.TickTockTests)
30-Mar-2020 00:09:05 2020-03-30 00:09:05.000  INFO 25035 --- [           main] o.s.c.d.acceptance.test.TickTockTests    : Destroy all streams
30-Mar-2020 00:09:05 2020-03-30 00:09:05.490  INFO 25035 --- [           main] junit.logTestName                        : Starting Test tickTockTests(org.springframework.cloud.dataflow.acceptance.test.TickTockTests)
30-Mar-2020 00:09:05 2020-03-30 00:09:05.492  INFO 25035 --- [           main] o.s.c.d.acceptance.test.TickTockTests    : Creating stream 'TICKTOCK'
30-Mar-2020 00:09:05 2020-03-30 00:09:05.543  INFO 25035 --- [           main] o.s.c.d.acceptance.test.TickTockTests    : Deploying stream 'TICKTOCK' with properties: {app.*.spring.cloud.streamapp.security.enabled=false, app.*.logging.file=${PID}-test.log, app.*.endpoints.logfile.sensitive=false, app.log.log.expression='TICKTOCK - TIMESTAMP: '.concat(payload), app.*.management.endpoints.web.exposure.include=*}
30-Mar-2020 00:09:06 2020-03-30 00:09:06.141  INFO 25035 --- [           main] o.s.c.d.acceptance.test.TickTockTests    : Checking: Stream=TICKTOCK, status = deploying, status description = The stream is being deployed.
30-Mar-2020 00:09:06 2020-03-30 00:09:06.142  INFO 25035 --- [           main] o.s.c.d.acceptance.test.TickTockTests    : Sleeping to check status of Stream=TICKTOCK
30-Mar-2020 00:09:16 2020-03-30 00:09:16.179  INFO 25035 --- [           main] o.s.c.d.acceptance.test.TickTockTests    : Checking: Stream=TICKTOCK, status = deploying, status description = The stream is being deployed.
30-Mar-2020 00:09:16 2020-03-30 00:09:16.179  INFO 25035 --- [           main] o.s.c.d.acceptance.test.TickTockTests    : Sleeping to check status of Stream=TICKTOCK
30-Mar-2020 00:09:26 2020-03-30 00:09:26.205  INFO 25035 --- [           main] o.s.c.d.acceptance.test.TickTockTests    : Checking: Stream=TICKTOCK, status = deployed, status description = The stream has been successfully deployed
30-Mar-2020 00:09:26 2020-03-30 00:09:26.235  INFO 25035 --- [           main] o.s.c.d.acceptance.test.TickTockTests    : Sleeping to check status of Stream=TICKTOCK
30-Mar-2020 00:09:36 2020-03-30 00:09:36.236  INFO 25035 --- [           main] o.s.c.d.acceptance.test.TickTockTests    : Stream 'TICKTOCK' started with status: deployed
30-Mar-2020 00:09:36 2020-03-30 00:09:36.236  INFO 25035 --- [           main] o.s.c.d.acceptance.test.TickTockTests    : App 'log' has instances: {TICKTOCK.log-v4-0=http://10.194.6.127:52459}
30-Mar-2020 00:09:36 2020-03-30 00:09:36.236  INFO 25035 --- [           main] o.s.c.d.acceptance.test.TickTockTests    : App 'time' has instances: {TICKTOCK.time-v4-0=http://10.194.6.127:59573}
30-Mar-2020 00:09:36 2020-03-30 00:09:36.236  INFO 25035 --- [           main] o.s.c.d.acceptance.test.TickTockTests    : Looking for 'Started TimeSource' in logfile for time
30-Mar-2020 00:09:46 2020-03-30 00:09:46.236  INFO 25035 --- [           main] o.s.c.d.acceptance.test.TickTockTests    : Requesting log for app TICKTOCK.time-v4-0
30-Mar-2020 00:09:46 2020-03-30 00:09:46.539  INFO 25035 --- [           main] o.s.c.d.acceptance.test.TickTockTests    : Retrieved logfile from 'http://10.194.6.127:59573/actuator/logfile
30-Mar-2020 00:09:46 2020-03-30 00:09:46.540  INFO 25035 --- [           main] o.s.c.d.acceptance.test.TickTockTests    : Matched all 'Started TimeSource' in logfile for app time (source TICKTOCK.time-v4-0)
30-Mar-2020 00:09:46 2020-03-30 00:09:46.540  INFO 25035 --- [           main] o.s.c.d.acceptance.test.TickTockTests    : Looking for 'Started LogSink' in logfile for log
30-Mar-2020 00:09:56 2020-03-30 00:09:56.540  INFO 25035 --- [           main] o.s.c.d.acceptance.test.TickTockTests    : Requesting log for app TICKTOCK.log-v4-0
30-Mar-2020 00:09:56 2020-03-30 00:09:56.673  INFO 25035 --- [           main] o.s.c.d.acceptance.test.TickTockTests    : Retrieved logfile from 'http://10.194.6.127:52459/actuator/logfile
30-Mar-2020 00:09:56 2020-03-30 00:09:56.673  INFO 25035 --- [           main] o.s.c.d.acceptance.test.TickTockTests    : Matched all 'Started LogSink' in logfile for app log (source TICKTOCK.log-v4-0)
30-Mar-2020 00:09:56 2020-03-30 00:09:56.673  INFO 25035 --- [           main] o.s.c.d.acceptance.test.TickTockTests    : Looking for 'TICKTOCK - TIMESTAMP:' in logfile for log
30-Mar-2020 00:10:06 2020-03-30 00:10:06.674  INFO 25035 --- [           main] o.s.c.d.acceptance.test.TickTockTests    : Requesting log for app TICKTOCK.log-v4-0
30-Mar-2020 00:10:06 2020-03-30 00:10:06.681  INFO 25035 --- [           main] o.s.c.d.acceptance.test.TickTockTests    : Retrieved logfile from 'http://10.194.6.127:52459/actuator/logfile
30-Mar-2020 00:10:06 2020-03-30 00:10:06.682  INFO 25035 --- [           main] o.s.c.d.acceptance.test.TickTockTests    : Matched all 'TICKTOCK - TIMESTAMP:' in logfile for app log (source TICKTOCK.log-v4-0)
30-Mar-2020 00:10:06 2020-03-30 00:10:06.683  INFO 25035 --- [           main] junit.logTestName                        : Test tickTockTests(org.springframework.cloud.dataflow.acceptance.test.TickTockTests) Succeeded
30-Mar-2020 00:10:06 2020-03-30 00:10:06.683  INFO 25035 --- [           main] junit.logTestName                        : Finished Test tickTockTests(org.springframework.cloud.dataflow.acceptance.test.TickTockTests)
30-Mar-2020 00:10:06 2020-03-30 00:10:06.684  INFO 25035 --- [           main] o.s.c.d.acceptance.test.TickTockTests    : Destroy all streams
30-Mar-2020 00:10:06 2020-03-30 00:10:06.934  INFO 25035 --- [           main] junit.logTestName                        : Starting Test tickTockTestsFromConfigServer(org.springframework.cloud.dataflow.acceptance.test.TickTockTests)
30-Mar-2020 00:10:06 2020-03-30 00:10:06.938  INFO 25035 --- [           main] junit.logTestName                        : Finished Test tickTockTestsFromConfigServer(org.springframework.cloud.dataflow.acceptance.test.TickTockTests)
30-Mar-2020 00:10:06 2020-03-30 00:10:06.939  INFO 25035 --- [           main] o.s.c.d.acceptance.test.TickTockTests    : Destroy all streams
30-Mar-2020 00:10:06 Tests run: 3, Failures: 0, Errors: 0, Skipped: 1, Time elapsed: 194.706 sec - in org.springframework.cloud.dataflow.acceptance.test.TickTockTests
30-Mar-2020 00:10:06 Running org.springframework.cloud.dataflow.acceptance.test.ComposedTaskTests
30-Mar-2020 00:10:07 2020-03-30 00:10:07.063  INFO 25035 --- [           main] junit.logTestName                        : Starting Test ctrMultipleLaunchWithArguments(org.springframework.cloud.dataflow.acceptance.test.ComposedTaskTests)
30-Mar-2020 00:13:07 2020-03-30 00:13:07.596 ERROR 25035 --- [           main] junit.logTestName                        : !!! Test ctrMultipleLaunchWithArguments(org.springframework.cloud.dataflow.acceptance.test.ComposedTaskTests) Failed !!!
30-Mar-2020 00:13:07
30-Mar-2020 00:13:07 java.lang.AssertionError: null
30-Mar-2020 00:13:07         at org.junit.Assert.fail(Assert.java:86)
30-Mar-2020 00:13:07         at org.junit.Assert.assertTrue(Assert.java:41)
30-Mar-2020 00:13:07         at org.junit.Assert.assertTrue(Assert.java:52)
30-Mar-2020 00:13:07         at org.springframework.cloud.dataflow.acceptance.test.ComposedTaskTests.assertTaskExecutions(ComposedTaskTests.java:65)
30-Mar-2020 00:13:07         at org.springframework.cloud.dataflow.acceptance.test.ComposedTaskTests.ctrMultipleLaunchWithArguments(ComposedTaskTests.java:57)
30-Mar-2020 00:13:07         at sun.reflect.NativeMethodAccessorImpl.invoke0(Native Method)
30-Mar-2020 00:13:07         at sun.reflect.NativeMethodAccessorImpl.invoke(NativeMethodAccessorImpl.java:62)
30-Mar-2020 00:13:07         at sun.reflect.DelegatingMethodAccessorImpl.invoke(DelegatingMethodAccessorImpl.java:43)
30-Mar-2020 00:13:07         at java.lang.reflect.Method.invoke(Method.java:498)
30-Mar-2020 00:13:07         at org.junit.runners.model.FrameworkMethod$1.runReflectiveCall(FrameworkMethod.java:50)
30-Mar-2020 00:13:07         at org.junit.internal.runners.model.ReflectiveCallable.run(ReflectiveCallable.java:12)
30-Mar-2020 00:13:07         at org.junit.runners.model.FrameworkMethod.invokeExplosively(FrameworkMethod.java:47)
30-Mar-2020 00:13:07         at org.junit.internal.runners.statements.InvokeMethod.evaluate(InvokeMethod.java:17)
30-Mar-2020 00:13:07         at org.junit.internal.runners.statements.RunBefores.evaluate(RunBefores.java:26)
30-Mar-2020 00:13:07         at org.springframework.test.context.junit4.statements.RunBeforeTestMethodCallbacks.evaluate(RunBeforeTestMethodCallbacks.java:75)
30-Mar-2020 00:13:07         at org.junit.internal.runners.statements.RunAfters.evaluate(RunAfters.java:27)
30-Mar-2020 00:13:07         at org.springframework.test.context.junit4.statements.RunAfterTestMethodCallbacks.evaluate(RunAfterTestMethodCallbacks.java:86)
30-Mar-2020 00:13:07         at org.junit.rules.TestWatcher$1.evaluate(TestWatcher.java:55)
30-Mar-2020 00:13:07         at org.junit.rules.RunRules.evaluate(RunRules.java:20)
30-Mar-2020 00:13:07         at org.springframework.test.context.junit4.statements.SpringRepeat.evaluate(SpringRepeat.java:84)
30-Mar-2020 00:13:07         at org.junit.runners.ParentRunner.runLeaf(ParentRunner.java:325)
30-Mar-2020 00:13:07         at org.springframework.test.context.junit4.SpringJUnit4ClassRunner.runChild(SpringJUnit4ClassRunner.java:252)
30-Mar-2020 00:13:07         at org.springframework.test.context.junit4.SpringJUnit4ClassRunner.runChild(SpringJUnit4ClassRunner.java:94)
30-Mar-2020 00:13:07         at org.junit.runners.ParentRunner$3.run(ParentRunner.java:290)
30-Mar-2020 00:13:07         at org.junit.runners.ParentRunner$1.schedule(ParentRunner.java:71)
30-Mar-2020 00:13:07         at org.junit.runners.ParentRunner.runChildren(ParentRunner.java:288)
30-Mar-2020 00:13:07         at org.junit.runners.ParentRunner.access$000(ParentRunner.java:58)
30-Mar-2020 00:13:07         at org.junit.runners.ParentRunner$2.evaluate(ParentRunner.java:268)
30-Mar-2020 00:13:07         at org.springframework.test.context.junit4.statements.RunBeforeTestClassCallbacks.evaluate(RunBeforeTestClassCallbacks.java:61)
30-Mar-2020 00:13:07         at org.springframework.test.context.junit4.statements.RunAfterTestClassCallbacks.evaluate(RunAfterTestClassCallbacks.java:70)
30-Mar-2020 00:13:07         at org.junit.runners.ParentRunner.run(ParentRunner.java:363)
30-Mar-2020 00:13:07         at org.springframework.test.context.junit4.SpringJUnit4ClassRunner.run(SpringJUnit4ClassRunner.java:191)
30-Mar-2020 00:13:07         at org.apache.maven.surefire.junit4.JUnit4Provider.execute(JUnit4Provider.java:283)
30-Mar-2020 00:13:07         at org.apache.maven.surefire.junit4.JUnit4Provider.executeWithRerun(JUnit4Provider.java:173)
30-Mar-2020 00:13:07         at org.apache.maven.surefire.junit4.JUnit4Provider.executeTestSet(JUnit4Provider.java:153)
30-Mar-2020 00:13:07         at org.apache.maven.surefire.junit4.JUnit4Provider.invoke(JUnit4Provider.java:128)
30-Mar-2020 00:13:07         at org.apache.maven.surefire.booter.ForkedBooter.invokeProviderInSameClassLoader(ForkedBooter.java:203)
30-Mar-2020 00:13:07         at org.apache.maven.surefire.booter.ForkedBooter.runSuitesInProcess(ForkedBooter.java:155)
30-Mar-2020 00:13:07         at org.apache.maven.surefire.booter.ForkedBooter.main(ForkedBooter.java:103)
30-Mar-2020 00:13:07
30-Mar-2020 00:13:07 2020-03-30 00:13:07.597  INFO 25035 --- [           main] junit.logTestName                        : Finished Test ctrMultipleLaunchWithArguments(org.springframework.cloud.dataflow.acceptance.test.ComposedTaskTests)
30-Mar-2020 00:13:07 2020-03-30 00:13:07.673  INFO 25035 --- [           main] junit.logTestName                        : Starting Test ctrMultipleLaunch(org.springframework.cloud.dataflow.acceptance.test.ComposedTaskTests)
30-Mar-2020 00:16:08 2020-03-30 00:16:08.143 ERROR 25035 --- [           main] junit.logTestName                        : !!! Test ctrMultipleLaunch(org.springframework.cloud.dataflow.acceptance.test.ComposedTaskTests) Failed !!!
30-Mar-2020 00:16:08
30-Mar-2020 00:16:08 java.lang.AssertionError: null
30-Mar-2020 00:16:08         at org.junit.Assert.fail(Assert.java:86)
30-Mar-2020 00:16:08         at org.junit.Assert.assertTrue(Assert.java:41)
30-Mar-2020 00:16:08         at org.junit.Assert.assertTrue(Assert.java:52)
30-Mar-2020 00:16:08         at org.springframework.cloud.dataflow.acceptance.test.ComposedTaskTests.assertTaskExecutions(ComposedTaskTests.java:65)
30-Mar-2020 00:16:08         at org.springframework.cloud.dataflow.acceptance.test.ComposedTaskTests.ctrMultipleLaunch(ComposedTaskTests.java:47)
30-Mar-2020 00:16:08         at sun.reflect.NativeMethodAccessorImpl.invoke0(Native Method)
30-Mar-2020 00:16:08         at sun.reflect.NativeMethodAccessorImpl.invoke(NativeMethodAccessorImpl.java:62)
30-Mar-2020 00:16:08         at sun.reflect.DelegatingMethodAccessorImpl.invoke(DelegatingMethodAccessorImpl.java:43)
30-Mar-2020 00:16:08         at java.lang.reflect.Method.invoke(Method.java:498)
30-Mar-2020 00:16:08         at org.junit.runners.model.FrameworkMethod$1.runReflectiveCall(FrameworkMethod.java:50)
30-Mar-2020 00:16:08         at org.junit.internal.runners.model.ReflectiveCallable.run(ReflectiveCallable.java:12)
30-Mar-2020 00:16:08         at org.junit.runners.model.FrameworkMethod.invokeExplosively(FrameworkMethod.java:47)
30-Mar-2020 00:16:08         at org.junit.internal.runners.statements.InvokeMethod.evaluate(InvokeMethod.java:17)
30-Mar-2020 00:16:08         at org.junit.internal.runners.statements.RunBefores.evaluate(RunBefores.java:26)
30-Mar-2020 00:16:08         at org.springframework.test.context.junit4.statements.RunBeforeTestMethodCallbacks.evaluate(RunBeforeTestMethodCallbacks.java:75)
30-Mar-2020 00:16:08         at org.junit.internal.runners.statements.RunAfters.evaluate(RunAfters.java:27)
30-Mar-2020 00:16:08         at org.springframework.test.context.junit4.statements.RunAfterTestMethodCallbacks.evaluate(RunAfterTestMethodCallbacks.java:86)
30-Mar-2020 00:16:08         at org.junit.rules.TestWatcher$1.evaluate(TestWatcher.java:55)
30-Mar-2020 00:16:08         at org.junit.rules.RunRules.evaluate(RunRules.java:20)
30-Mar-2020 00:16:08         at org.springframework.test.context.junit4.statements.SpringRepeat.evaluate(SpringRepeat.java:84)
30-Mar-2020 00:16:08         at org.junit.runners.ParentRunner.runLeaf(ParentRunner.java:325)
30-Mar-2020 00:16:08         at org.springframework.test.context.junit4.SpringJUnit4ClassRunner.runChild(SpringJUnit4ClassRunner.java:252)
30-Mar-2020 00:16:08         at org.springframework.test.context.junit4.SpringJUnit4ClassRunner.runChild(SpringJUnit4ClassRunner.java:94)
30-Mar-2020 00:16:08         at org.junit.runners.ParentRunner$3.run(ParentRunner.java:290)
30-Mar-2020 00:16:08         at org.junit.runners.ParentRunner$1.schedule(ParentRunner.java:71)
30-Mar-2020 00:16:08         at org.junit.runners.ParentRunner.runChildren(ParentRunner.java:288)
30-Mar-2020 00:16:08         at org.junit.runners.ParentRunner.access$000(ParentRunner.java:58)
30-Mar-2020 00:16:08         at org.junit.runners.ParentRunner$2.evaluate(ParentRunner.java:268)
30-Mar-2020 00:16:08         at org.springframework.test.context.junit4.statements.RunBeforeTestClassCallbacks.evaluate(RunBeforeTestClassCallbacks.java:61)
30-Mar-2020 00:16:08         at org.springframework.test.context.junit4.statements.RunAfterTestClassCallbacks.evaluate(RunAfterTestClassCallbacks.java:70)
30-Mar-2020 00:16:08         at org.junit.runners.ParentRunner.run(ParentRunner.java:363)
30-Mar-2020 00:16:08         at org.springframework.test.context.junit4.SpringJUnit4ClassRunner.run(SpringJUnit4ClassRunner.java:191)
30-Mar-2020 00:16:08         at org.apache.maven.surefire.junit4.JUnit4Provider.execute(JUnit4Provider.java:283)
30-Mar-2020 00:16:08         at org.apache.maven.surefire.junit4.JUnit4Provider.executeWithRerun(JUnit4Provider.java:173)
30-Mar-2020 00:16:08         at org.apache.maven.surefire.junit4.JUnit4Provider.executeTestSet(JUnit4Provider.java:153)
30-Mar-2020 00:16:08         at org.apache.maven.surefire.junit4.JUnit4Provider.invoke(JUnit4Provider.java:128)
30-Mar-2020 00:16:08         at org.apache.maven.surefire.booter.ForkedBooter.invokeProviderInSameClassLoader(ForkedBooter.java:203)
30-Mar-2020 00:16:08         at org.apache.maven.surefire.booter.ForkedBooter.runSuitesInProcess(ForkedBooter.java:155)
30-Mar-2020 00:16:08         at org.apache.maven.surefire.booter.ForkedBooter.main(ForkedBooter.java:103)
30-Mar-2020 00:16:08
30-Mar-2020 00:16:08 2020-03-30 00:16:08.143  INFO 25035 --- [           main] junit.logTestName                        : Finished Test ctrMultipleLaunch(org.springframework.cloud.dataflow.acceptance.test.ComposedTaskTests)
30-Mar-2020 00:16:08 2020-03-30 00:16:08.215  INFO 25035 --- [           main] junit.logTestName                        : Starting Test ctrLaunch(org.springframework.cloud.dataflow.acceptance.test.ComposedTaskTests)
30-Mar-2020 00:19:08 2020-03-30 00:19:08.737 ERROR 25035 --- [           main] junit.logTestName                        : !!! Test ctrLaunch(org.springframework.cloud.dataflow.acceptance.test.ComposedTaskTests) Failed !!!
30-Mar-2020 00:19:08
30-Mar-2020 00:19:08 java.lang.AssertionError: null
30-Mar-2020 00:19:08         at org.junit.Assert.fail(Assert.java:86)
30-Mar-2020 00:19:08         at org.junit.Assert.assertTrue(Assert.java:41)
30-Mar-2020 00:19:08         at org.junit.Assert.assertTrue(Assert.java:52)
30-Mar-2020 00:19:08         at org.springframework.cloud.dataflow.acceptance.test.ComposedTaskTests.assertTaskExecutions(ComposedTaskTests.java:65)
30-Mar-2020 00:19:08         at org.springframework.cloud.dataflow.acceptance.test.ComposedTaskTests.ctrLaunch(ComposedTaskTests.java:41)
30-Mar-2020 00:19:08         at sun.reflect.NativeMethodAccessorImpl.invoke0(Native Method)
30-Mar-2020 00:19:08         at sun.reflect.NativeMethodAccessorImpl.invoke(NativeMethodAccessorImpl.java:62)
30-Mar-2020 00:19:08         at sun.reflect.DelegatingMethodAccessorImpl.invoke(DelegatingMethodAccessorImpl.java:43)
30-Mar-2020 00:19:08         at java.lang.reflect.Method.invoke(Method.java:498)
30-Mar-2020 00:19:08         at org.junit.runners.model.FrameworkMethod$1.runReflectiveCall(FrameworkMethod.java:50)
30-Mar-2020 00:19:08         at org.junit.internal.runners.model.ReflectiveCallable.run(ReflectiveCallable.java:12)
30-Mar-2020 00:19:08         at org.junit.runners.model.FrameworkMethod.invokeExplosively(FrameworkMethod.java:47)
30-Mar-2020 00:19:08         at org.junit.internal.runners.statements.InvokeMethod.evaluate(InvokeMethod.java:17)
30-Mar-2020 00:19:08         at org.junit.internal.runners.statements.RunBefores.evaluate(RunBefores.java:26)
30-Mar-2020 00:19:08         at org.springframework.test.context.junit4.statements.RunBeforeTestMethodCallbacks.evaluate(RunBeforeTestMethodCallbacks.java:75)
30-Mar-2020 00:19:08         at org.junit.internal.runners.statements.RunAfters.evaluate(RunAfters.java:27)
30-Mar-2020 00:19:08         at org.springframework.test.context.junit4.statements.RunAfterTestMethodCallbacks.evaluate(RunAfterTestMethodCallbacks.java:86)
30-Mar-2020 00:19:08         at org.junit.rules.TestWatcher$1.evaluate(TestWatcher.java:55)
30-Mar-2020 00:19:08         at org.junit.rules.RunRules.evaluate(RunRules.java:20)
30-Mar-2020 00:19:08         at org.springframework.test.context.junit4.statements.SpringRepeat.evaluate(SpringRepeat.java:84)
30-Mar-2020 00:19:08         at org.junit.runners.ParentRunner.runLeaf(ParentRunner.java:325)
30-Mar-2020 00:19:08         at org.springframework.test.context.junit4.SpringJUnit4ClassRunner.runChild(SpringJUnit4ClassRunner.java:252)
30-Mar-2020 00:19:08         at org.springframework.test.context.junit4.SpringJUnit4ClassRunner.runChild(SpringJUnit4ClassRunner.java:94)
30-Mar-2020 00:19:08         at org.junit.runners.ParentRunner$3.run(ParentRunner.java:290)
30-Mar-2020 00:19:08         at org.junit.runners.ParentRunner$1.schedule(ParentRunner.java:71)
30-Mar-2020 00:19:08         at org.junit.runners.ParentRunner.runChildren(ParentRunner.java:288)
30-Mar-2020 00:19:08         at org.junit.runners.ParentRunner.access$000(ParentRunner.java:58)
30-Mar-2020 00:19:08         at org.junit.runners.ParentRunner$2.evaluate(ParentRunner.java:268)
30-Mar-2020 00:19:08         at org.springframework.test.context.junit4.statements.RunBeforeTestClassCallbacks.evaluate(RunBeforeTestClassCallbacks.java:61)
30-Mar-2020 00:19:08         at org.springframework.test.context.junit4.statements.RunAfterTestClassCallbacks.evaluate(RunAfterTestClassCallbacks.java:70)
30-Mar-2020 00:19:08         at org.junit.runners.ParentRunner.run(ParentRunner.java:363)
30-Mar-2020 00:19:08         at org.springframework.test.context.junit4.SpringJUnit4ClassRunner.run(SpringJUnit4ClassRunner.java:191)
30-Mar-2020 00:19:08         at org.apache.maven.surefire.junit4.JUnit4Provider.execute(JUnit4Provider.java:283)
30-Mar-2020 00:19:08         at org.apache.maven.surefire.junit4.JUnit4Provider.executeWithRerun(JUnit4Provider.java:173)
30-Mar-2020 00:19:08         at org.apache.maven.surefire.junit4.JUnit4Provider.executeTestSet(JUnit4Provider.java:153)
30-Mar-2020 00:19:08         at org.apache.maven.surefire.junit4.JUnit4Provider.invoke(JUnit4Provider.java:128)
30-Mar-2020 00:19:08         at org.apache.maven.surefire.booter.ForkedBooter.invokeProviderInSameClassLoader(ForkedBooter.java:203)
30-Mar-2020 00:19:08         at org.apache.maven.surefire.booter.ForkedBooter.runSuitesInProcess(ForkedBooter.java:155)
30-Mar-2020 00:19:08         at org.apache.maven.surefire.booter.ForkedBooter.main(ForkedBooter.java:103)
30-Mar-2020 00:19:08
30-Mar-2020 00:19:08 2020-03-30 00:19:08.738  INFO 25035 --- [           main] junit.logTestName                        : Finished Test ctrLaunch(org.springframework.cloud.dataflow.acceptance.test.ComposedTaskTests)
30-Mar-2020 00:19:08 Tests run: 3, Failures: 3, Errors: 0, Skipped: 0, Time elapsed: 541.783 sec <<< FAILURE! - in org.springframework.cloud.dataflow.acceptance.test.ComposedTaskTests
30-Mar-2020 00:19:08 ctrMultipleLaunchWithArguments(org.springframework.cloud.dataflow.acceptance.test.ComposedTaskTests)  Time elapsed: 180.537 sec  <<< FAILURE!
30-Mar-2020 00:19:08 java.lang.AssertionError: null
30-Mar-2020 00:19:08         at org.junit.Assert.fail(Assert.java:86)
30-Mar-2020 00:19:08         at org.junit.Assert.assertTrue(Assert.java:41)
30-Mar-2020 00:19:08         at org.junit.Assert.assertTrue(Assert.java:52)
30-Mar-2020 00:19:08         at org.springframework.cloud.dataflow.acceptance.test.ComposedTaskTests.assertTaskExecutions(ComposedTaskTests.java:65)
30-Mar-2020 00:19:08         at org.springframework.cloud.dataflow.acceptance.test.ComposedTaskTests.ctrMultipleLaunchWithArguments(ComposedTaskTests.java:57)
30-Mar-2020 00:19:08
30-Mar-2020 00:19:08 ctrMultipleLaunch(org.springframework.cloud.dataflow.acceptance.test.ComposedTaskTests)  Time elapsed: 180.471 sec  <<< FAILURE!
30-Mar-2020 00:19:08 java.lang.AssertionError: null
30-Mar-2020 00:19:08         at org.junit.Assert.fail(Assert.java:86)
30-Mar-2020 00:19:08         at org.junit.Assert.assertTrue(Assert.java:41)
30-Mar-2020 00:19:08         at org.junit.Assert.assertTrue(Assert.java:52)
30-Mar-2020 00:19:08         at org.springframework.cloud.dataflow.acceptance.test.ComposedTaskTests.assertTaskExecutions(ComposedTaskTests.java:65)
30-Mar-2020 00:19:08         at org.springframework.cloud.dataflow.acceptance.test.ComposedTaskTests.ctrMultipleLaunch(ComposedTaskTests.java:47)
30-Mar-2020 00:19:08
30-Mar-2020 00:19:08 ctrLaunch(org.springframework.cloud.dataflow.acceptance.test.ComposedTaskTests)  Time elapsed: 180.523 sec  <<< FAILURE!
30-Mar-2020 00:19:08 java.lang.AssertionError: null
30-Mar-2020 00:19:08         at org.junit.Assert.fail(Assert.java:86)
30-Mar-2020 00:19:08         at org.junit.Assert.assertTrue(Assert.java:41)
30-Mar-2020 00:19:08         at org.junit.Assert.assertTrue(Assert.java:52)
30-Mar-2020 00:19:08         at org.springframework.cloud.dataflow.acceptance.test.ComposedTaskTests.assertTaskExecutions(ComposedTaskTests.java:65)
30-Mar-2020 00:19:08         at org.springframework.cloud.dataflow.acceptance.test.ComposedTaskTests.ctrLaunch(ComposedTaskTests.java:41)
30-Mar-2020 00:19:08
30-Mar-2020 00:19:08 Running org.springframework.cloud.dataflow.acceptance.test.TransformTests
30-Mar-2020 00:19:08 2020-03-30 00:19:08.740  INFO 25035 --- [           main] .b.t.c.SpringBootTestContextBootstrapper : Neither @ContextConfiguration nor @ContextHierarchy found for test class [org.springframework.cloud.dataflow.acceptance.test.TransformTests], using SpringBootContextLoader
30-Mar-2020 00:19:08 2020-03-30 00:19:08.745  INFO 25035 --- [           main] .b.t.c.SpringBootTestContextBootstrapper : Loaded default TestExecutionListener class names from location [META-INF/spring.factories]: [org.springframework.boot.test.mock.mockito.MockitoTestExecutionListener, org.springframework.boot.test.mock.mockito.ResetMocksTestExecutionListener, org.springframework.boot.test.autoconfigure.restdocs.RestDocsTestExecutionListener, org.springframework.boot.test.autoconfigure.web.client.MockRestServiceServerResetTestExecutionListener, org.springframework.boot.test.autoconfigure.web.servlet.MockMvcPrintOnlyOnFailureTestExecutionListener, org.springframework.boot.test.autoconfigure.web.servlet.WebDriverTestExecutionListener, org.springframework.test.context.web.ServletTestExecutionListener, org.springframework.test.context.support.DirtiesContextBeforeModesTestExecutionListener, org.springframework.test.context.support.DependencyInjectionTestExecutionListener, org.springframework.test.context.support.DirtiesContextTestExecutionListener, org.springframework.test.context.transaction.TransactionalTestExecutionListener, org.springframework.test.context.jdbc.SqlScriptsTestExecutionListener]
30-Mar-2020 00:19:08 2020-03-30 00:19:08.756  INFO 25035 --- [           main] .b.t.c.SpringBootTestContextBootstrapper : Using TestExecutionListeners: [org.springframework.test.context.web.ServletTestExecutionListener@77ab22be, org.springframework.test.context.support.DirtiesContextBeforeModesTestExecutionListener@59fbb34, org.springframework.boot.test.autoconfigure.SpringBootDependencyInjectionTestExecutionListener@1b6924cb, org.springframework.test.context.support.DirtiesContextTestExecutionListener@3a8d467e, org.springframework.test.context.transaction.TransactionalTestExecutionListener@141d3d43, org.springframework.test.context.jdbc.SqlScriptsTestExecutionListener@6ca372ef, org.springframework.boot.test.mock.mockito.MockitoTestExecutionListener@3ebe4ccc, org.springframework.boot.test.autoconfigure.web.servlet.MockMvcPrintOnlyOnFailureTestExecutionListener@6ed043d3, org.springframework.boot.test.autoconfigure.web.client.MockRestServiceServerResetTestExecutionListener@135a8c6f, org.springframework.boot.test.mock.mockito.ResetMocksTestExecutionListener@6419a0e1, org.springframework.boot.test.autoconfigure.web.servlet.WebDriverTestExecutionListener@280d4882, org.springframework.boot.test.autoconfigure.restdocs.RestDocsTestExecutionListener@44af588b]
30-Mar-2020 00:19:08 2020-03-30 00:19:08.832  INFO 25035 --- [           main] junit.logTestName                        : Starting Test transformTests(org.springframework.cloud.dataflow.acceptance.test.TransformTests)
30-Mar-2020 00:19:08 2020-03-30 00:19:08.833  INFO 25035 --- [           main] o.s.c.d.acceptance.test.TransformTests   : Creating stream 'TRANSFORM-TEST'
30-Mar-2020 00:19:08 2020-03-30 00:19:08.867  INFO 25035 --- [           main] o.s.c.d.acceptance.test.TransformTests   : Deploying stream 'TRANSFORM-TEST' with properties: {app.*.spring.cloud.streamapp.security.enabled=false, app.*.logging.file=${PID}-test.log, app.*.endpoints.logfile.sensitive=false, app.*.management.endpoints.web.exposure.include=*}
30-Mar-2020 00:19:09 2020-03-30 00:19:09.593  INFO 25035 --- [           main] o.s.c.d.acceptance.test.TransformTests   : Checking: Stream=TRANSFORM-TEST, status = deploying, status description = The stream is being deployed.
30-Mar-2020 00:19:09 2020-03-30 00:19:09.593  INFO 25035 --- [           main] o.s.c.d.acceptance.test.TransformTests   : Sleeping to check status of Stream=TRANSFORM-TEST
30-Mar-2020 00:19:19 2020-03-30 00:19:19.626  INFO 25035 --- [           main] o.s.c.d.acceptance.test.TransformTests   : Checking: Stream=TRANSFORM-TEST, status = deploying, status description = The stream is being deployed.
30-Mar-2020 00:19:19 2020-03-30 00:19:19.626  INFO 25035 --- [           main] o.s.c.d.acceptance.test.TransformTests   : Sleeping to check status of Stream=TRANSFORM-TEST
30-Mar-2020 00:19:29 2020-03-30 00:19:29.656  INFO 25035 --- [           main] o.s.c.d.acceptance.test.TransformTests   : Checking: Stream=TRANSFORM-TEST, status = deployed, status description = The stream has been successfully deployed
30-Mar-2020 00:19:29 2020-03-30 00:19:29.689  INFO 25035 --- [           main] o.s.c.d.acceptance.test.TransformTests   : Sleeping to check status of Stream=TRANSFORM-TEST
30-Mar-2020 00:19:39 2020-03-30 00:19:39.689  INFO 25035 --- [           main] o.s.c.d.acceptance.test.TransformTests   : Stream 'TRANSFORM-TEST' started with status: deployed
30-Mar-2020 00:19:39 2020-03-30 00:19:39.689  INFO 25035 --- [           main] o.s.c.d.acceptance.test.TransformTests   : App 'transform' has instances: {TRANSFORM-TEST.transform-v1-0=http://10.194.6.127:35421}
30-Mar-2020 00:19:39 2020-03-30 00:19:39.689  INFO 25035 --- [           main] o.s.c.d.acceptance.test.TransformTests   : App 'log' has instances: {TRANSFORM-TEST.log-v1-0=http://10.194.6.127:46111}
30-Mar-2020 00:19:39 2020-03-30 00:19:39.690  INFO 25035 --- [           main] o.s.c.d.acceptance.test.TransformTests   : App 'http' has instances: {TRANSFORM-TEST.http-v1-0=http://10.194.6.127:36152}
30-Mar-2020 00:19:39 2020-03-30 00:19:39.690  INFO 25035 --- [           main] o.s.c.d.acceptance.test.TransformTests   : Looking for 'Started HttpSource' in logfile for http
30-Mar-2020 00:19:49 2020-03-30 00:19:49.690  INFO 25035 --- [           main] o.s.c.d.acceptance.test.TransformTests   : Requesting log for app TRANSFORM-TEST.http-v1-0
30-Mar-2020 00:19:49 2020-03-30 00:19:49.972  INFO 25035 --- [           main] o.s.c.d.acceptance.test.TransformTests   : Retrieved logfile from 'http://10.194.6.127:36152/actuator/logfile
30-Mar-2020 00:19:49 2020-03-30 00:19:49.972  INFO 25035 --- [           main] o.s.c.d.acceptance.test.TransformTests   : Matched all 'Started HttpSource' in logfile for app http (source TRANSFORM-TEST.http-v1-0)
30-Mar-2020 00:19:50 2020-03-30 00:19:50.109  INFO 25035 --- [           main] o.s.c.d.acceptance.test.TransformTests   : Looking for 'Started LogSink' in logfile for log
30-Mar-2020 00:20:00 2020-03-30 00:20:00.110  INFO 25035 --- [           main] o.s.c.d.acceptance.test.TransformTests   : Requesting log for app TRANSFORM-TEST.log-v1-0
30-Mar-2020 00:20:00 2020-03-30 00:20:00.236  INFO 25035 --- [           main] o.s.c.d.acceptance.test.TransformTests   : Retrieved logfile from 'http://10.194.6.127:46111/actuator/logfile
30-Mar-2020 00:20:00 2020-03-30 00:20:00.236  INFO 25035 --- [           main] o.s.c.d.acceptance.test.TransformTests   : Matched all 'Started LogSink' in logfile for app log (source TRANSFORM-TEST.log-v1-0)
30-Mar-2020 00:20:00 2020-03-30 00:20:00.236  INFO 25035 --- [           main] o.s.c.d.acceptance.test.TransformTests   : Looking for 'ABCDEFG' in logfile for log
30-Mar-2020 00:20:10 2020-03-30 00:20:10.236  INFO 25035 --- [           main] o.s.c.d.acceptance.test.TransformTests   : Requesting log for app TRANSFORM-TEST.log-v1-0
30-Mar-2020 00:20:10 2020-03-30 00:20:10.244  INFO 25035 --- [           main] o.s.c.d.acceptance.test.TransformTests   : Retrieved logfile from 'http://10.194.6.127:46111/actuator/logfile
30-Mar-2020 00:20:10 2020-03-30 00:20:10.244  INFO 25035 --- [           main] o.s.c.d.acceptance.test.TransformTests   : Matched all 'ABCDEFG' in logfile for app log (source TRANSFORM-TEST.log-v1-0)
30-Mar-2020 00:20:10 2020-03-30 00:20:10.246  INFO 25035 --- [           main] junit.logTestName                        : Test transformTests(org.springframework.cloud.dataflow.acceptance.test.TransformTests) Succeeded
30-Mar-2020 00:20:10 2020-03-30 00:20:10.246  INFO 25035 --- [           main] junit.logTestName                        : Finished Test transformTests(org.springframework.cloud.dataflow.acceptance.test.TransformTests)
30-Mar-2020 00:20:10 2020-03-30 00:20:10.246  INFO 25035 --- [           main] o.s.c.d.acceptance.test.TransformTests   : Destroy all streams
30-Mar-2020 00:20:10 Tests run: 1, Failures: 0, Errors: 0, Skipped: 0, Time elapsed: 61.763 sec - in org.springframework.cloud.dataflow.acceptance.test.TransformTests
30-Mar-2020 00:20:10 Running org.springframework.cloud.dataflow.acceptance.test.SchedulerTests
30-Mar-2020 00:20:10 2020-03-30 00:20:10.639  INFO 25035 --- [           main] s.c.a.AnnotationConfigApplicationContext : Refreshing org.springframework.context.annotation.AnnotationConfigApplicationContext@3b95a6db: startup date [Mon Mar 30 00:20:10 UTC 2020]; root of context hierarchy
30-Mar-2020 00:20:10 2020-03-30 00:20:10.661  INFO 25035 --- [           main] trationDelegate$BeanPostProcessorChecker : Bean 'configurationPropertiesRebinderAutoConfiguration' of type [class org.springframework.cloud.autoconfigure.ConfigurationPropertiesRebinderAutoConfiguration$$EnhancerBySpringCGLIB$$219d8b3d] is not eligible for getting processed by all BeanPostProcessors (for example: not eligible for auto-proxying)
30-Mar-2020 00:20:10
30-Mar-2020 00:20:10   .   ____          _            __ _ _
30-Mar-2020 00:20:10 /\\ / ___'_ __ _ _(_)_ __  __ _ \ \ \ \
30-Mar-2020 00:20:10 ( ( )\___ | '_ | '_| | '_ \/ _` | \ \ \ \
30-Mar-2020 00:20:10 \\/  ___)| |_)| | | | | || (_| |  ) ) ) )
30-Mar-2020 00:20:10   '  |____| .__|_| |_|_| |_\__, | / / / /
30-Mar-2020 00:20:10 =========|_|==============|___/=/_/_/_/
30-Mar-2020 00:20:10 :: Spring Boot ::        (v1.4.1.RELEASE)
30-Mar-2020 00:20:10
30-Mar-2020 00:20:10 2020-03-30 00:20:10.761  INFO 25035 --- [           main] c.c.c.ConfigServicePropertySourceLocator : Fetching config from server at: http://localhost:8888
30-Mar-2020 00:20:10 2020-03-30 00:20:10.763  WARN 25035 --- [           main] c.c.c.ConfigServicePropertySourceLocator : Could not locate PropertySource: I/O error on GET request for "http://localhost:8888//blah": Connection refused (Connection refused); nested exception is java.net.ConnectException: Connection refused (Connection refused)
30-Mar-2020 00:20:10 2020-03-30 00:20:10.764  INFO 25035 --- [           main] o.a.maven.surefire.booter.ForkedBooter   : The following profiles are active: blah
30-Mar-2020 00:20:10 2020-03-30 00:20:10.765  INFO 25035 --- [           main] s.c.a.AnnotationConfigApplicationContext : Refreshing org.springframework.context.annotation.AnnotationConfigApplicationContext@34d713a2: startup date [Mon Mar 30 00:20:10 UTC 2020]; parent: org.springframework.context.annotation.AnnotationConfigApplicationContext@3b95a6db
30-Mar-2020 00:20:10 2020-03-30 00:20:10.869  INFO 25035 --- [           main] o.a.maven.surefire.booter.ForkedBooter   : Started ForkedBooter in 0.326 seconds (JVM running for 991.579)
30-Mar-2020 00:20:10 2020-03-30 00:20:10.870  INFO 25035 --- [           main] s.c.a.AnnotationConfigApplicationContext : Closing org.springframework.context.annotation.AnnotationConfigApplicationContext@34d713a2: startup date [Mon Mar 30 00:20:10 UTC 2020]; parent: org.springframework.context.annotation.AnnotationConfigApplicationContext@3b95a6db
30-Mar-2020 00:20:10 2020-03-30 00:20:10.871 ERROR 25035 --- [           main] o.s.c.d.a.test.util.SchedulerRule        : SCHEDULER IS NOT AVAILABLE, SKIPPING TESTS
30-Mar-2020 00:20:10
30-Mar-2020 00:20:10 java.lang.IllegalArgumentException: no SchedulerOperations bean is available.  Skipping test.
30-Mar-2020 00:20:10         at org.springframework.util.Assert.notNull(Assert.java:115)
30-Mar-2020 00:20:10         at org.springframework.cloud.dataflow.acceptance.test.util.SchedulerRule.obtainResource(SchedulerRule.java:57)
30-Mar-2020 00:20:10         at org.springframework.cloud.scheduler.spi.junit.AbstractExternalResourceTestSupport.apply(AbstractExternalResourceTestSupport.java:58)
30-Mar-2020 00:20:10         at org.junit.rules.RunRules.applyAll(RunRules.java:26)
30-Mar-2020 00:20:10         at org.junit.rules.RunRules.<init>(RunRules.java:15)
30-Mar-2020 00:20:10         at org.junit.runners.ParentRunner.withClassRules(ParentRunner.java:245)
30-Mar-2020 00:20:10         at org.junit.runners.ParentRunner.classBlock(ParentRunner.java:194)
30-Mar-2020 00:20:10         at org.junit.runners.ParentRunner.run(ParentRunner.java:362)
30-Mar-2020 00:20:10         at org.springframework.test.context.junit4.SpringJUnit4ClassRunner.run(SpringJUnit4ClassRunner.java:191)
30-Mar-2020 00:20:10         at org.apache.maven.surefire.junit4.JUnit4Provider.execute(JUnit4Provider.java:283)
30-Mar-2020 00:20:10         at org.apache.maven.surefire.junit4.JUnit4Provider.executeWithRerun(JUnit4Provider.java:173)
30-Mar-2020 00:20:10         at org.apache.maven.surefire.junit4.JUnit4Provider.executeTestSet(JUnit4Provider.java:153)
30-Mar-2020 00:20:10         at org.apache.maven.surefire.junit4.JUnit4Provider.invoke(JUnit4Provider.java:128)
30-Mar-2020 00:20:10         at org.apache.maven.surefire.booter.ForkedBooter.invokeProviderInSameClassLoader(ForkedBooter.java:203)
30-Mar-2020 00:20:10         at org.apache.maven.surefire.booter.ForkedBooter.runSuitesInProcess(ForkedBooter.java:155)
30-Mar-2020 00:20:10         at org.apache.maven.surefire.booter.ForkedBooter.main(ForkedBooter.java:103)
30-Mar-2020 00:20:10
30-Mar-2020 00:20:10 Tests run: 1, Failures: 0, Errors: 0, Skipped: 1, Time elapsed: 0.334 sec - in org.springframework.cloud.dataflow.acceptance.test.SchedulerTests
30-Mar-2020 00:20:10 Running org.springframework.cloud.dataflow.acceptance.test.NamedChannelTests
30-Mar-2020 00:20:10 2020-03-30 00:20:10.874  INFO 25035 --- [           main] .b.t.c.SpringBootTestContextBootstrapper : Neither @ContextConfiguration nor @ContextHierarchy found for test class [org.springframework.cloud.dataflow.acceptance.test.NamedChannelTests], using SpringBootContextLoader
30-Mar-2020 00:20:10 2020-03-30 00:20:10.885  INFO 25035 --- [           main] .b.t.c.SpringBootTestContextBootstrapper : Loaded default TestExecutionListener class names from location [META-INF/spring.factories]: [org.springframework.boot.test.mock.mockito.MockitoTestExecutionListener, org.springframework.boot.test.mock.mockito.ResetMocksTestExecutionListener, org.springframework.boot.test.autoconfigure.restdocs.RestDocsTestExecutionListener, org.springframework.boot.test.autoconfigure.web.client.MockRestServiceServerResetTestExecutionListener, org.springframework.boot.test.autoconfigure.web.servlet.MockMvcPrintOnlyOnFailureTestExecutionListener, org.springframework.boot.test.autoconfigure.web.servlet.WebDriverTestExecutionListener, org.springframework.test.context.web.ServletTestExecutionListener, org.springframework.test.context.support.DirtiesContextBeforeModesTestExecutionListener, org.springframework.test.context.support.DependencyInjectionTestExecutionListener, org.springframework.test.context.support.DirtiesContextTestExecutionListener, org.springframework.test.context.transaction.TransactionalTestExecutionListener, org.springframework.test.context.jdbc.SqlScriptsTestExecutionListener]
30-Mar-2020 00:20:10 2020-03-30 00:20:10.888  INFO 25035 --- [           main] .b.t.c.SpringBootTestContextBootstrapper : Using TestExecutionListeners: [org.springframework.test.context.web.ServletTestExecutionListener@61ae0d43, org.springframework.test.context.support.DirtiesContextBeforeModesTestExecutionListener@ef718de, org.springframework.boot.test.autoconfigure.SpringBootDependencyInjectionTestExecutionListener@287ae90c, org.springframework.test.context.support.DirtiesContextTestExecutionListener@2e1b374c, org.springframework.test.context.transaction.TransactionalTestExecutionListener@3fcee3d9, org.springframework.test.context.jdbc.SqlScriptsTestExecutionListener@9c93d16, org.springframework.boot.test.mock.mockito.MockitoTestExecutionListener@760487aa, org.springframework.boot.test.autoconfigure.web.servlet.MockMvcPrintOnlyOnFailureTestExecutionListener@1526f71, org.springframework.boot.test.autoconfigure.web.client.MockRestServiceServerResetTestExecutionListener@49ca94a9, org.springframework.boot.test.mock.mockito.ResetMocksTestExecutionListener@9ab310b, org.springframework.boot.test.autoconfigure.web.servlet.WebDriverTestExecutionListener@5b40de43, org.springframework.boot.test.autoconfigure.restdocs.RestDocsTestExecutionListener@49fb0bbd]
30-Mar-2020 00:20:10 2020-03-30 00:20:10.963  INFO 25035 --- [           main] junit.logTestName                        : Starting Test testDestination(org.springframework.cloud.dataflow.acceptance.test.NamedChannelTests)
30-Mar-2020 00:20:10 2020-03-30 00:20:10.965  INFO 25035 --- [           main] o.s.c.d.a.test.NamedChannelTests         : Creating stream 'LOG-DESTINATION-SINK'
30-Mar-2020 00:20:11 2020-03-30 00:20:11.003  INFO 25035 --- [           main] o.s.c.d.a.test.NamedChannelTests         : Deploying stream 'LOG-DESTINATION-SINK' with properties: {app.*.spring.cloud.streamapp.security.enabled=false, app.*.logging.file=${PID}-test.log, app.*.endpoints.logfile.sensitive=false, app.*.management.endpoints.web.exposure.include=*}
30-Mar-2020 00:20:11 2020-03-30 00:20:11.374  INFO 25035 --- [           main] o.s.c.d.a.test.NamedChannelTests         : Checking: Stream=LOG-DESTINATION-SINK, status = deploying, status description = The stream is being deployed.
30-Mar-2020 00:20:11 2020-03-30 00:20:11.374  INFO 25035 --- [           main] o.s.c.d.a.test.NamedChannelTests         : Sleeping to check status of Stream=LOG-DESTINATION-SINK
30-Mar-2020 00:20:21 2020-03-30 00:20:21.406  INFO 25035 --- [           main] o.s.c.d.a.test.NamedChannelTests         : Checking: Stream=LOG-DESTINATION-SINK, status = deployed, status description = The stream has been successfully deployed
30-Mar-2020 00:20:21 2020-03-30 00:20:21.443  INFO 25035 --- [           main] o.s.c.d.a.test.NamedChannelTests         : Sleeping to check status of Stream=LOG-DESTINATION-SINK
30-Mar-2020 00:20:31 2020-03-30 00:20:31.444  INFO 25035 --- [           main] o.s.c.d.a.test.NamedChannelTests         : Stream 'LOG-DESTINATION-SINK' started with status: deployed
30-Mar-2020 00:20:31 2020-03-30 00:20:31.444  INFO 25035 --- [           main] o.s.c.d.a.test.NamedChannelTests         : App 'log' has instances: {LOG-DESTINATION-SINK.log-v1-0=http://10.194.6.127:20798}
30-Mar-2020 00:20:31 2020-03-30 00:20:31.444  INFO 25035 --- [           main] o.s.c.d.a.test.NamedChannelTests         : Looking for 'Started LogSink' in logfile for log
30-Mar-2020 00:20:41 2020-03-30 00:20:41.446  INFO 25035 --- [           main] o.s.c.d.a.test.NamedChannelTests         : Requesting log for app LOG-DESTINATION-SINK.log-v1-0
30-Mar-2020 00:20:41 2020-03-30 00:20:41.755  INFO 25035 --- [           main] o.s.c.d.a.test.NamedChannelTests         : Retrieved logfile from 'http://10.194.6.127:20798/actuator/logfile
30-Mar-2020 00:20:41 2020-03-30 00:20:41.755  INFO 25035 --- [           main] o.s.c.d.a.test.NamedChannelTests         : Matched all 'Started LogSink' in logfile for app log (source LOG-DESTINATION-SINK.log-v1-0)
30-Mar-2020 00:20:41 2020-03-30 00:20:41.756  INFO 25035 --- [           main] o.s.c.d.a.test.NamedChannelTests         : Creating stream 'HTTP-DESTINATION-SOURCE'
30-Mar-2020 00:20:41 2020-03-30 00:20:41.793  INFO 25035 --- [           main] o.s.c.d.a.test.NamedChannelTests         : Deploying stream 'HTTP-DESTINATION-SOURCE' with properties: {app.*.spring.cloud.streamapp.security.enabled=false, app.*.logging.file=${PID}-test.log, app.*.endpoints.logfile.sensitive=false, app.*.management.endpoints.web.exposure.include=*}
30-Mar-2020 00:20:42 2020-03-30 00:20:42.210  INFO 25035 --- [           main] o.s.c.d.a.test.NamedChannelTests         : Checking: Stream=HTTP-DESTINATION-SOURCE, status = deploying, status description = The stream is being deployed.
30-Mar-2020 00:20:42 2020-03-30 00:20:42.210  INFO 25035 --- [           main] o.s.c.d.a.test.NamedChannelTests         : Sleeping to check status of Stream=HTTP-DESTINATION-SOURCE
30-Mar-2020 00:20:52 2020-03-30 00:20:52.266  INFO 25035 --- [           main] o.s.c.d.a.test.NamedChannelTests         : Checking: Stream=HTTP-DESTINATION-SOURCE, status = deployed, status description = The stream has been successfully deployed
30-Mar-2020 00:20:52 2020-03-30 00:20:52.302  INFO 25035 --- [           main] o.s.c.d.a.test.NamedChannelTests         : Sleeping to check status of Stream=HTTP-DESTINATION-SOURCE
30-Mar-2020 00:21:02 2020-03-30 00:21:02.303  INFO 25035 --- [           main] o.s.c.d.a.test.NamedChannelTests         : Stream 'HTTP-DESTINATION-SOURCE' started with status: deployed
30-Mar-2020 00:21:02 2020-03-30 00:21:02.303  INFO 25035 --- [           main] o.s.c.d.a.test.NamedChannelTests         : App 'http' has instances: {HTTP-DESTINATION-SOURCE.http-v1-0=http://10.194.6.127:47200}
30-Mar-2020 00:21:02 2020-03-30 00:21:02.303  INFO 25035 --- [           main] o.s.c.d.a.test.NamedChannelTests         : Looking for 'Started HttpSource' in logfile for http
30-Mar-2020 00:21:12 2020-03-30 00:21:12.304  INFO 25035 --- [           main] o.s.c.d.a.test.NamedChannelTests         : Requesting log for app HTTP-DESTINATION-SOURCE.http-v1-0
30-Mar-2020 00:21:12 2020-03-30 00:21:12.594  INFO 25035 --- [           main] o.s.c.d.a.test.NamedChannelTests         : Retrieved logfile from 'http://10.194.6.127:47200/actuator/logfile
30-Mar-2020 00:21:12 2020-03-30 00:21:12.594  INFO 25035 --- [           main] o.s.c.d.a.test.NamedChannelTests         : Matched all 'Started HttpSource' in logfile for app http (source HTTP-DESTINATION-SOURCE.http-v1-0)
30-Mar-2020 00:21:12 2020-03-30 00:21:12.729  INFO 25035 --- [           main] o.s.c.d.a.test.NamedChannelTests         : Looking for 'abcdefg' in logfile for log
30-Mar-2020 00:21:22 2020-03-30 00:21:22.730  INFO 25035 --- [           main] o.s.c.d.a.test.NamedChannelTests         : Requesting log for app LOG-DESTINATION-SINK.log-v1-0
30-Mar-2020 00:21:22 2020-03-30 00:21:22.737  INFO 25035 --- [           main] o.s.c.d.a.test.NamedChannelTests         : Retrieved logfile from 'http://10.194.6.127:20798/actuator/logfile
30-Mar-2020 00:21:22 2020-03-30 00:21:22.737  INFO 25035 --- [           main] o.s.c.d.a.test.NamedChannelTests         : Matched all 'abcdefg' in logfile for app log (source LOG-DESTINATION-SINK.log-v1-0)
30-Mar-2020 00:21:22 2020-03-30 00:21:22.738  INFO 25035 --- [           main] junit.logTestName                        : Test testDestination(org.springframework.cloud.dataflow.acceptance.test.NamedChannelTests) Succeeded
30-Mar-2020 00:21:22 2020-03-30 00:21:22.738  INFO 25035 --- [           main] junit.logTestName                        : Finished Test testDestination(org.springframework.cloud.dataflow.acceptance.test.NamedChannelTests)
30-Mar-2020 00:21:22 2020-03-30 00:21:22.738  INFO 25035 --- [           main] o.s.c.d.a.test.NamedChannelTests         : Destroy all streams
30-Mar-2020 00:21:23 2020-03-30 00:21:23.049  INFO 25035 --- [           main] junit.logTestName                        : Starting Test testTap(org.springframework.cloud.dataflow.acceptance.test.NamedChannelTests)
30-Mar-2020 00:21:23 2020-03-30 00:21:23.051  INFO 25035 --- [           main] o.s.c.d.a.test.NamedChannelTests         : Creating stream 'TAPHTTP'
30-Mar-2020 00:21:23 2020-03-30 00:21:23.076  INFO 25035 --- [           main] o.s.c.d.a.test.NamedChannelTests         : Deploying stream 'TAPHTTP' with properties: {app.*.spring.cloud.streamapp.security.enabled=false, app.*.logging.file=${PID}-test.log, app.*.endpoints.logfile.sensitive=false, app.*.management.endpoints.web.exposure.include=*}
30-Mar-2020 00:21:23 2020-03-30 00:21:23.588  INFO 25035 --- [           main] o.s.c.d.a.test.NamedChannelTests         : Checking: Stream=TAPHTTP, status = deploying, status description = The stream is being deployed.
30-Mar-2020 00:21:23 2020-03-30 00:21:23.588  INFO 25035 --- [           main] o.s.c.d.a.test.NamedChannelTests         : Sleeping to check status of Stream=TAPHTTP
30-Mar-2020 00:21:33 2020-03-30 00:21:33.627  INFO 25035 --- [           main] o.s.c.d.a.test.NamedChannelTests         : Checking: Stream=TAPHTTP, status = deploying, status description = The stream is being deployed.
30-Mar-2020 00:21:33 2020-03-30 00:21:33.627  INFO 25035 --- [           main] o.s.c.d.a.test.NamedChannelTests         : Sleeping to check status of Stream=TAPHTTP
30-Mar-2020 00:21:43 2020-03-30 00:21:43.664  INFO 25035 --- [           main] o.s.c.d.a.test.NamedChannelTests         : Checking: Stream=TAPHTTP, status = deployed, status description = The stream has been successfully deployed
30-Mar-2020 00:21:43 2020-03-30 00:21:43.692  INFO 25035 --- [           main] o.s.c.d.a.test.NamedChannelTests         : Sleeping to check status of Stream=TAPHTTP
30-Mar-2020 00:21:53 2020-03-30 00:21:53.693  INFO 25035 --- [           main] o.s.c.d.a.test.NamedChannelTests         : Stream 'TAPHTTP' started with status: deployed
30-Mar-2020 00:21:53 2020-03-30 00:21:53.693  INFO 25035 --- [           main] o.s.c.d.a.test.NamedChannelTests         : App 'log' has instances: {TAPHTTP.log-v1-0=http://10.194.6.127:38266}
30-Mar-2020 00:21:53 2020-03-30 00:21:53.693  INFO 25035 --- [           main] o.s.c.d.a.test.NamedChannelTests         : App 'http' has instances: {TAPHTTP.http-v1-0=http://10.194.6.127:56269}
30-Mar-2020 00:21:53 2020-03-30 00:21:53.693  INFO 25035 --- [           main] o.s.c.d.a.test.NamedChannelTests         : Looking for 'Started HttpSource' in logfile for http
30-Mar-2020 00:22:03 2020-03-30 00:22:03.693  INFO 25035 --- [           main] o.s.c.d.a.test.NamedChannelTests         : Requesting log for app TAPHTTP.http-v1-0
30-Mar-2020 00:22:03 2020-03-30 00:22:03.977  INFO 25035 --- [           main] o.s.c.d.a.test.NamedChannelTests         : Retrieved logfile from 'http://10.194.6.127:56269/actuator/logfile
30-Mar-2020 00:22:03 2020-03-30 00:22:03.977  INFO 25035 --- [           main] o.s.c.d.a.test.NamedChannelTests         : Matched all 'Started HttpSource' in logfile for app http (source TAPHTTP.http-v1-0)
30-Mar-2020 00:22:03 2020-03-30 00:22:03.977  INFO 25035 --- [           main] o.s.c.d.a.test.NamedChannelTests         : Looking for 'Started LogSink' in logfile for log
30-Mar-2020 00:22:13 2020-03-30 00:22:13.977  INFO 25035 --- [           main] o.s.c.d.a.test.NamedChannelTests         : Requesting log for app TAPHTTP.log-v1-0
30-Mar-2020 00:22:14 2020-03-30 00:22:14.096  INFO 25035 --- [           main] o.s.c.d.a.test.NamedChannelTests         : Retrieved logfile from 'http://10.194.6.127:38266/actuator/logfile
30-Mar-2020 00:22:14 2020-03-30 00:22:14.096  INFO 25035 --- [           main] o.s.c.d.a.test.NamedChannelTests         : Matched all 'Started LogSink' in logfile for app log (source TAPHTTP.log-v1-0)
30-Mar-2020 00:22:14 2020-03-30 00:22:14.096  INFO 25035 --- [           main] o.s.c.d.a.test.NamedChannelTests         : Creating stream 'TAPSTREAM'
30-Mar-2020 00:22:14 2020-03-30 00:22:14.120  INFO 25035 --- [           main] o.s.c.d.a.test.NamedChannelTests         : Deploying stream 'TAPSTREAM' with properties: {app.*.spring.cloud.streamapp.security.enabled=false, app.*.logging.file=${PID}-test.log, app.*.endpoints.logfile.sensitive=false, app.*.management.endpoints.web.exposure.include=*}
30-Mar-2020 00:22:14 2020-03-30 00:22:14.511  INFO 25035 --- [           main] o.s.c.d.a.test.NamedChannelTests         : Checking: Stream=TAPSTREAM, status = deploying, status description = The stream is being deployed.
30-Mar-2020 00:22:14 2020-03-30 00:22:14.511  INFO 25035 --- [           main] o.s.c.d.a.test.NamedChannelTests         : Sleeping to check status of Stream=TAPSTREAM
30-Mar-2020 00:22:24 2020-03-30 00:22:24.548  INFO 25035 --- [           main] o.s.c.d.a.test.NamedChannelTests         : Checking: Stream=TAPSTREAM, status = deployed, status description = The stream has been successfully deployed
30-Mar-2020 00:22:24 2020-03-30 00:22:24.588  INFO 25035 --- [           main] o.s.c.d.a.test.NamedChannelTests         : Sleeping to check status of Stream=TAPSTREAM
30-Mar-2020 00:22:34 2020-03-30 00:22:34.588  INFO 25035 --- [           main] o.s.c.d.a.test.NamedChannelTests         : Stream 'TAPSTREAM' started with status: deployed
30-Mar-2020 00:22:34 2020-03-30 00:22:34.588  INFO 25035 --- [           main] o.s.c.d.a.test.NamedChannelTests         : App 'log' has instances: {TAPSTREAM.log-v1-0=http://10.194.6.127:23740}
30-Mar-2020 00:22:34 2020-03-30 00:22:34.588  INFO 25035 --- [           main] o.s.c.d.a.test.NamedChannelTests         : Looking for 'Started LogSink' in logfile for log
30-Mar-2020 00:22:44 2020-03-30 00:22:44.589  INFO 25035 --- [           main] o.s.c.d.a.test.NamedChannelTests         : Requesting log for app TAPSTREAM.log-v1-0
30-Mar-2020 00:22:44 2020-03-30 00:22:44.872  INFO 25035 --- [           main] o.s.c.d.a.test.NamedChannelTests         : Retrieved logfile from 'http://10.194.6.127:23740/actuator/logfile
30-Mar-2020 00:22:44 2020-03-30 00:22:44.872  INFO 25035 --- [           main] o.s.c.d.a.test.NamedChannelTests         : Matched all 'Started LogSink' in logfile for app log (source TAPSTREAM.log-v1-0)
30-Mar-2020 00:22:45 2020-03-30 00:22:45.019  INFO 25035 --- [           main] o.s.c.d.a.test.NamedChannelTests         : Looking for 'abcdefg' in logfile for log
30-Mar-2020 00:22:55 2020-03-30 00:22:55.019  INFO 25035 --- [           main] o.s.c.d.a.test.NamedChannelTests         : Requesting log for app TAPSTREAM.log-v1-0
30-Mar-2020 00:22:55 2020-03-30 00:22:55.027  INFO 25035 --- [           main] o.s.c.d.a.test.NamedChannelTests         : Retrieved logfile from 'http://10.194.6.127:23740/actuator/logfile
30-Mar-2020 00:22:55 2020-03-30 00:22:55.027  INFO 25035 --- [           main] o.s.c.d.a.test.NamedChannelTests         : Matched all 'abcdefg' in logfile for app log (source TAPSTREAM.log-v1-0)
30-Mar-2020 00:22:55 2020-03-30 00:22:55.028  INFO 25035 --- [           main] junit.logTestName                        : Test testTap(org.springframework.cloud.dataflow.acceptance.test.NamedChannelTests) Succeeded
30-Mar-2020 00:22:55 2020-03-30 00:22:55.028  INFO 25035 --- [           main] junit.logTestName                        : Finished Test testTap(org.springframework.cloud.dataflow.acceptance.test.NamedChannelTests)
30-Mar-2020 00:22:55 2020-03-30 00:22:55.028  INFO 25035 --- [           main] o.s.c.d.a.test.NamedChannelTests         : Destroy all streams
30-Mar-2020 00:22:55 2020-03-30 00:22:55.422  INFO 25035 --- [           main] junit.logTestName                        : Starting Test manyToOneTest(org.springframework.cloud.dataflow.acceptance.test.NamedChannelTests)
30-Mar-2020 00:22:55 2020-03-30 00:22:55.423  INFO 25035 --- [           main] o.s.c.d.a.test.NamedChannelTests         : Creating stream 'MANY-TO-ONE'
30-Mar-2020 00:22:55 2020-03-30 00:22:55.450  INFO 25035 --- [           main] o.s.c.d.a.test.NamedChannelTests         : Deploying stream 'MANY-TO-ONE' with properties: {app.*.spring.cloud.streamapp.security.enabled=false, app.*.logging.file=${PID}-test.log, app.*.endpoints.logfile.sensitive=false, app.*.management.endpoints.web.exposure.include=*}
30-Mar-2020 00:22:55 2020-03-30 00:22:55.840  INFO 25035 --- [           main] o.s.c.d.a.test.NamedChannelTests         : Checking: Stream=MANY-TO-ONE, status = deploying, status description = The stream is being deployed.
30-Mar-2020 00:22:55 2020-03-30 00:22:55.840  INFO 25035 --- [           main] o.s.c.d.a.test.NamedChannelTests         : Sleeping to check status of Stream=MANY-TO-ONE
30-Mar-2020 00:23:05 2020-03-30 00:23:05.862  INFO 25035 --- [           main] o.s.c.d.a.test.NamedChannelTests         : Checking: Stream=MANY-TO-ONE, status = deployed, status description = The stream has been successfully deployed
30-Mar-2020 00:23:05 2020-03-30 00:23:05.893  INFO 25035 --- [           main] o.s.c.d.a.test.NamedChannelTests         : Sleeping to check status of Stream=MANY-TO-ONE
30-Mar-2020 00:23:15 2020-03-30 00:23:15.893  INFO 25035 --- [           main] o.s.c.d.a.test.NamedChannelTests         : Stream 'MANY-TO-ONE' started with status: deployed
30-Mar-2020 00:23:15 2020-03-30 00:23:15.894  INFO 25035 --- [           main] o.s.c.d.a.test.NamedChannelTests         : App 'log' has instances: {MANY-TO-ONE.log-v1-0=http://10.194.6.127:27770}
30-Mar-2020 00:23:15 2020-03-30 00:23:15.894  INFO 25035 --- [           main] o.s.c.d.a.test.NamedChannelTests         : Looking for 'Started LogSink' in logfile for log
30-Mar-2020 00:23:25 2020-03-30 00:23:25.894  INFO 25035 --- [           main] o.s.c.d.a.test.NamedChannelTests         : Requesting log for app MANY-TO-ONE.log-v1-0
30-Mar-2020 00:23:26 2020-03-30 00:23:26.184  INFO 25035 --- [           main] o.s.c.d.a.test.NamedChannelTests         : Retrieved logfile from 'http://10.194.6.127:27770/actuator/logfile
30-Mar-2020 00:23:26 2020-03-30 00:23:26.185  INFO 25035 --- [           main] o.s.c.d.a.test.NamedChannelTests         : Matched all 'Started LogSink' in logfile for app log (source MANY-TO-ONE.log-v1-0)
30-Mar-2020 00:23:26 2020-03-30 00:23:26.185  INFO 25035 --- [           main] o.s.c.d.a.test.NamedChannelTests         : Creating stream 'HTTP-SOURCE-1'
30-Mar-2020 00:23:26 2020-03-30 00:23:26.215  INFO 25035 --- [           main] o.s.c.d.a.test.NamedChannelTests         : Deploying stream 'HTTP-SOURCE-1' with properties: {app.*.spring.cloud.streamapp.security.enabled=false, app.*.logging.file=${PID}-test.log, app.*.endpoints.logfile.sensitive=false, app.*.management.endpoints.web.exposure.include=*}
30-Mar-2020 00:23:26 2020-03-30 00:23:26.580  INFO 25035 --- [           main] o.s.c.d.a.test.NamedChannelTests         : Checking: Stream=HTTP-SOURCE-1, status = deploying, status description = The stream is being deployed.
30-Mar-2020 00:23:26 2020-03-30 00:23:26.580  INFO 25035 --- [           main] o.s.c.d.a.test.NamedChannelTests         : Sleeping to check status of Stream=HTTP-SOURCE-1
30-Mar-2020 00:23:36 2020-03-30 00:23:36.625  INFO 25035 --- [           main] o.s.c.d.a.test.NamedChannelTests         : Checking: Stream=HTTP-SOURCE-1, status = deployed, status description = The stream has been successfully deployed
30-Mar-2020 00:23:36 2020-03-30 00:23:36.654  INFO 25035 --- [           main] o.s.c.d.a.test.NamedChannelTests         : Sleeping to check status of Stream=HTTP-SOURCE-1
30-Mar-2020 00:23:46 2020-03-30 00:23:46.655  INFO 25035 --- [           main] o.s.c.d.a.test.NamedChannelTests         : Stream 'HTTP-SOURCE-1' started with status: deployed
30-Mar-2020 00:23:46 2020-03-30 00:23:46.655  INFO 25035 --- [           main] o.s.c.d.a.test.NamedChannelTests         : App 'http' has instances: {HTTP-SOURCE-1.http-v1-0=http://10.194.6.127:50156}
30-Mar-2020 00:23:46 2020-03-30 00:23:46.655  INFO 25035 --- [           main] o.s.c.d.a.test.NamedChannelTests         : Looking for 'Started HttpSource' in logfile for http
30-Mar-2020 00:23:56 2020-03-30 00:23:56.655  INFO 25035 --- [           main] o.s.c.d.a.test.NamedChannelTests         : Requesting log for app HTTP-SOURCE-1.http-v1-0
30-Mar-2020 00:23:56 2020-03-30 00:23:56.951  INFO 25035 --- [           main] o.s.c.d.a.test.NamedChannelTests         : Retrieved logfile from 'http://10.194.6.127:50156/actuator/logfile
30-Mar-2020 00:23:56 2020-03-30 00:23:56.951  INFO 25035 --- [           main] o.s.c.d.a.test.NamedChannelTests         : Matched all 'Started HttpSource' in logfile for app http (source HTTP-SOURCE-1.http-v1-0)
30-Mar-2020 00:23:56 2020-03-30 00:23:56.951  INFO 25035 --- [           main] o.s.c.d.a.test.NamedChannelTests         : Creating stream 'HTTP-SOURCE-2'
30-Mar-2020 00:23:56 2020-03-30 00:23:56.976  INFO 25035 --- [           main] o.s.c.d.a.test.NamedChannelTests         : Deploying stream 'HTTP-SOURCE-2' with properties: {app.*.spring.cloud.streamapp.security.enabled=false, app.*.logging.file=${PID}-test.log, app.*.endpoints.logfile.sensitive=false, app.*.management.endpoints.web.exposure.include=*}
30-Mar-2020 00:23:57 2020-03-30 00:23:57.422  INFO 25035 --- [           main] o.s.c.d.a.test.NamedChannelTests         : Checking: Stream=HTTP-SOURCE-2, status = deploying, status description = The stream is being deployed.
30-Mar-2020 00:23:57 2020-03-30 00:23:57.423  INFO 25035 --- [           main] o.s.c.d.a.test.NamedChannelTests         : Sleeping to check status of Stream=HTTP-SOURCE-2
30-Mar-2020 00:24:07 2020-03-30 00:24:07.486  INFO 25035 --- [           main] o.s.c.d.a.test.NamedChannelTests         : Checking: Stream=HTTP-SOURCE-2, status = deployed, status description = The stream has been successfully deployed
30-Mar-2020 00:24:07 2020-03-30 00:24:07.525  INFO 25035 --- [           main] o.s.c.d.a.test.NamedChannelTests         : Sleeping to check status of Stream=HTTP-SOURCE-2
30-Mar-2020 00:24:17 2020-03-30 00:24:17.525  INFO 25035 --- [           main] o.s.c.d.a.test.NamedChannelTests         : Stream 'HTTP-SOURCE-2' started with status: deployed
30-Mar-2020 00:24:17 2020-03-30 00:24:17.525  INFO 25035 --- [           main] o.s.c.d.a.test.NamedChannelTests         : App 'http' has instances: {HTTP-SOURCE-2.http-v1-0=http://10.194.6.127:43659}
30-Mar-2020 00:24:17 2020-03-30 00:24:17.525  INFO 25035 --- [           main] o.s.c.d.a.test.NamedChannelTests         : Looking for 'Started HttpSource' in logfile for http
30-Mar-2020 00:24:27 2020-03-30 00:24:27.525  INFO 25035 --- [           main] o.s.c.d.a.test.NamedChannelTests         : Requesting log for app HTTP-SOURCE-2.http-v1-0
30-Mar-2020 00:24:27 2020-03-30 00:24:27.820  INFO 25035 --- [           main] o.s.c.d.a.test.NamedChannelTests         : Retrieved logfile from 'http://10.194.6.127:43659/actuator/logfile
30-Mar-2020 00:24:27 2020-03-30 00:24:27.820  INFO 25035 --- [           main] o.s.c.d.a.test.NamedChannelTests         : Matched all 'Started HttpSource' in logfile for app http (source HTTP-SOURCE-2.http-v1-0)
30-Mar-2020 00:24:28 2020-03-30 00:24:28.012  INFO 25035 --- [           main] o.s.c.d.a.test.NamedChannelTests         : Looking for 'abcdefg' in logfile for log
30-Mar-2020 00:24:38 2020-03-30 00:24:38.012  INFO 25035 --- [           main] o.s.c.d.a.test.NamedChannelTests         : Requesting log for app MANY-TO-ONE.log-v1-0
30-Mar-2020 00:24:38 2020-03-30 00:24:38.020  INFO 25035 --- [           main] o.s.c.d.a.test.NamedChannelTests         : Retrieved logfile from 'http://10.194.6.127:27770/actuator/logfile
30-Mar-2020 00:24:38 2020-03-30 00:24:38.020  INFO 25035 --- [           main] o.s.c.d.a.test.NamedChannelTests         : Matched all 'abcdefg' in logfile for app log (source MANY-TO-ONE.log-v1-0)
30-Mar-2020 00:24:38 2020-03-30 00:24:38.164  INFO 25035 --- [           main] o.s.c.d.a.test.NamedChannelTests         : Looking for 'hijklmn' in logfile for log
30-Mar-2020 00:24:48 2020-03-30 00:24:48.164  INFO 25035 --- [           main] o.s.c.d.a.test.NamedChannelTests         : Requesting log for app MANY-TO-ONE.log-v1-0
30-Mar-2020 00:24:48 2020-03-30 00:24:48.171  INFO 25035 --- [           main] o.s.c.d.a.test.NamedChannelTests         : Retrieved logfile from 'http://10.194.6.127:27770/actuator/logfile
30-Mar-2020 00:24:48 2020-03-30 00:24:48.171  INFO 25035 --- [           main] o.s.c.d.a.test.NamedChannelTests         : Matched all 'hijklmn' in logfile for app log (source MANY-TO-ONE.log-v1-0)
30-Mar-2020 00:24:48 2020-03-30 00:24:48.172  INFO 25035 --- [           main] junit.logTestName                        : Test manyToOneTest(org.springframework.cloud.dataflow.acceptance.test.NamedChannelTests) Succeeded
30-Mar-2020 00:24:48 2020-03-30 00:24:48.173  INFO 25035 --- [           main] junit.logTestName                        : Finished Test manyToOneTest(org.springframework.cloud.dataflow.acceptance.test.NamedChannelTests)
30-Mar-2020 00:24:48 2020-03-30 00:24:48.173  INFO 25035 --- [           main] o.s.c.d.a.test.NamedChannelTests         : Destroy all streams
30-Mar-2020 00:24:48 Tests run: 4, Failures: 0, Errors: 0, Skipped: 1, Time elapsed: 277.728 sec - in org.springframework.cloud.dataflow.acceptance.test.NamedChannelTests
30-Mar-2020 00:24:48 Running org.springframework.cloud.dataflow.acceptance.test.util.PlatformHelperTests
30-Mar-2020 00:24:48 Tests run: 3, Failures: 0, Errors: 0, Skipped: 0, Time elapsed: 0.098 sec - in org.springframework.cloud.dataflow.acceptance.test.util.PlatformHelperTests
30-Mar-2020 00:24:48 Running org.springframework.cloud.dataflow.acceptance.test.util.ApplicationTests
30-Mar-2020 00:24:48 Tests run: 2, Failures: 0, Errors: 0, Skipped: 0, Time elapsed: 0.002 sec - in org.springframework.cloud.dataflow.acceptance.test.util.ApplicationTests
30-Mar-2020 00:24:48 2020-03-30 00:24:48.715  INFO 25035 --- [       Thread-6] o.s.c.support.GenericApplicationContext  : Closing org.springframework.context.support.GenericApplicationContext@7e446d92: startup date [Mon Mar 30 00:06:20 UTC 2020]; root of context hierarchy
30-Mar-2020 00:24:48
30-Mar-2020 00:24:48 Results :
30-Mar-2020 00:24:48
30-Mar-2020 00:24:48 Failed tests:
30-Mar-2020 00:24:48   ComposedTaskTests.ctrLaunch:41->assertTaskExecutions:65 null
30-Mar-2020 00:24:48   ComposedTaskTests.ctrMultipleLaunch:47->assertTaskExecutions:65 null
30-Mar-2020 00:24:48   ComposedTaskTests.ctrMultipleLaunchWithArguments:57->assertTaskExecutions:65 null
30-Mar-2020 00:24:48
30-Mar-2020 00:24:48 Tests run: 22, Failures: 3, Errors: 0, Skipped: 4
30-Mar-2020 00:24:48
30-Mar-2020 00:24:48 [INFO] ------------------------------------------------------------------------
30-Mar-2020 00:24:48 [INFO] BUILD FAILURE
30-Mar-2020 00:24:48 [INFO] ------------------------------------------------------------------------
30-Mar-2020 00:24:48 [INFO] Total time: 21:14 min
30-Mar-2020 00:24:48 [INFO] Finished at: 2020-03-30T00:24:48+00:00
30-Mar-2020 00:24:48 [INFO] Final Memory: 51M/452M
30-Mar-2020 00:24:48 [INFO] ------------------------------------------------------------------------
30-Mar-2020 00:24:48 [ERROR] Failed to execute goal org.apache.maven.plugins:maven-surefire-plugin:2.18.1:test (default-test) on project spring-cloud-dataflow-acceptance-tests: There are test failures.
30-Mar-2020 00:24:48 [ERROR]
30-Mar-2020 00:24:48 [ERROR] Please refer to /opt/bamboo-home/xml-data/build-dir/SCDT-LOCAL20XSKIPPER20X-KAFKA/target/surefire-reports for the individual test results.
30-Mar-2020 00:24:48 [ERROR] -> [Help 1]
30-Mar-2020 00:24:48 [ERROR]
30-Mar-2020 00:24:48 [ERROR] To see the full stack trace of the errors, re-run Maven with the -e switch.
30-Mar-2020 00:24:48 [ERROR] Re-run Maven using the -X switch to enable full debug logging.
30-Mar-2020 00:24:48 [ERROR]
30-Mar-2020 00:24:48 [ERROR] For more information about the errors and possible solutions, please read the following articles:
30-Mar-2020 00:24:48 [ERROR] [Help 1] http://cwiki.apache.org/confluence/display/MAVEN/MojoFailureException
30-Mar-2020 00:24:48 Clean up, clean up, everybody everywhere; clean up clean up, everybody do your share!
30-Mar-2020 00:24:48 Clean up servers
30-Mar-2020 00:24:49 Killing process PID [24925]
30-Mar-2020 00:24:49 Killing process PID [24838]
30-Mar-2020 00:24:49 No stopped containers
30-Mar-2020 00:24:50 Stopping mysql_mysql_1 ...
30-Mar-2020 00:24:52
30-Mar-2020 00:24:52 Stopping mysql_mysql_1 ... done
30-Mar-2020 00:24:52 Removing mysql_mysql_1 ...
30-Mar-2020 00:24:52
30-Mar-2020 00:24:52 Removing mysql_mysql_1 ... done
30-Mar-2020 00:24:52 Going to remove mysql_mysql_1
30-Mar-2020 00:24:53 Stopping kafka_kafka_1     ...
30-Mar-2020 00:24:53 Stopping kafka_zookeeper_1 ...
30-Mar-2020 00:24:56
30-Mar-2020 00:24:56 Stopping kafka_kafka_1     ... done
30-Mar-2020 00:25:03
30-Mar-2020 00:25:03 Stopping kafka_zookeeper_1 ... done
30-Mar-2020 00:25:03 Removing kafka_kafka_1     ...
30-Mar-2020 00:25:03 Removing kafka_zookeeper_1 ...
30-Mar-2020 00:25:03
30-Mar-2020 00:25:03 Removing kafka_zookeeper_1 ... done
30-Mar-2020 00:25:03
30-Mar-2020 00:25:03 Removing kafka_kafka_1     ... done
30-Mar-2020 00:25:03 Going to remove kafka_kafka_1, kafka_zookeeper_1
30-Mar-2020 00:25:03
30-Mar-2020 00:25:03 Finished task 'Execute Acceptance Tests' with result: Success
30-Mar-2020 00:25:03 Starting task 'JUnit Parser' of type 'com.atlassian.bamboo.plugins.testresultparser:task.testresultparser.junit'
30-Mar-2020 00:25:03 Parsing test results under /opt/bamboo-home/xml-data/build-dir/SCDT-LOCAL20XSKIPPER20X-KAFKA...
30-Mar-2020 00:25:03 Failing task since 3 failing test cases were found.
30-Mar-2020 00:25:03 Finished task 'JUnit Parser' with result: Failed
30-Mar-2020 00:25:03 Starting task 'clean up' of type 'com.atlassian.bamboo.plugins.scripttask:task.builder.script'
30-Mar-2020 00:25:03
Beginning to execute external process for build 'Spring Cloud Data Flow Acceptance Tests - Local + SCDF-2.0.4.BS + Skipper 2.0.4.BS (12 am) - Run Data Flow Acceptance Tests for Kafka #303 (SCDT-LOCAL20XSKIPPER20X-KAFKA-303)'
... running command line:
/opt/bamboo-home/temp/SCDT-LOCAL20XSKIPPER20X-KAFKA-303-ScriptBuildTask-6427711458953648896.sh
... in: /opt/bamboo-home/xml-data/build-dir/SCDT-LOCAL20XSKIPPER20X-KAFKA
... using extra environment variables:
bamboo_planRepository_1_branch=master
bamboo_********_username_password=********
bamboo_signing_store_password=********
bamboo_capability_system_builder_ant_Ant_1_9=/opt/ant-1.9
bamboo_capability_system_builder_ant_Ant_1_8=/opt/ant-1.8
bamboo_planRepository_1_branchDisplayName=master
bamboo_repository_274694331_git_username=spring-buildmaster
bamboo_artifactory_override_resolve_repo=libs-milestone
bamboo_capability_system_builder_node_Node_js_10_16=/opt/node-10.16/bin/node
bamboo_repository_revision_number=dd41fb40bc32a7a65c2616a8ca39a0a5c2402ad1
bamboo_RIAK_BIN=/usr/sbin/riak
bamboo_buildKey=SCDT-LOCAL20XSKIPPER20X-KAFKA
bamboo_repository_274694331_branch_name=master
bamboo_ge_cache_username=ci
bamboo_bintray_password=********
bamboo_gradle_enterprise_cache_user=ci
bamboo_sonar_token_password=********
bamboo_shortJobName=Run Data Flow Acceptance Tests for Kafka
bamboo_artifactory_override_resolver_password=********
bamboo_sonatype_token=RSJChaox
bamboo_capability_system_builder_gradle___gradlew=./gradlew
bamboo_buildResultsUrl=https://build.spring.io/browse/SCDT-LOCAL20XSKIPPER20X-KAFKA-303
bamboo_capability_system_builder_mvn3_Maven_3_3=/opt/maven-3.3
bamboo_capability_system_builder_mvn3_Maven_3_2=/opt/maven-3.2
bamboo_capability_system_builder_mvn3_Maven_3_1=/opt/maven-3.1
bamboo_planRepository_repositoryUrl=https://github.com/spring-cloud/spring-cloud-dataflow-acceptance-tests.git
bamboo_capability_system_builder_mvn3_Maven_3_6=/opt/maven-3.6
bamboo_agentId=286195718
bamboo_capability_system_builder_mvn3_Maven_3_5=/opt/maven-3.5
bamboo_capability_system_builder_mvn3_Maven_3_0=/opt/maven-3.0
bamboo_planRepository_revision=dd41fb40bc32a7a65c2616a8ca39a0a5c2402ad1
bamboo_planRepository_previousRevision=dd41fb40bc32a7a65c2616a8ca39a0a5c2402ad1
bamboo_capability_remote_build=true
bamboo_repository_branch_name=master
bamboo_sonatype_token_password=********
bamboo_sonatype_user=springsource
bamboo_gradle_enterprise_cache_password=********
bamboo_repository_274694331_name=Git
bamboo_scdf_acceptance_tests_password=********
bamboo_APPLE_AC_PASSWORD=********
bamboo_repository_274694331_git_branch=master
bamboo_gradle_enterprise_secret_access_key=********
bamboo_planRepository_branch=master
bamboo_capability_system_jdk_JDK_15=/opt/jdk-15
bamboo_capability_system_jdk_JDK_13=/opt/jdk-13
bamboo_capability_system_jdk_JDK_14=/opt/jdk-14
bamboo_planRepository_1_type=gitv2
bamboo_planRepository_branchName=master
bamboo_capability_system_jdk_JDK_12=/opt/jdk-12
bamboo_capability_system_builder_gradlew_gradlew=./
bamboo_capability_system_builder_ant_Ant_1_10=/opt/ant-1.10
bamboo_sonar_password=********
bamboo_hg_cache_directory=/opt/bamboo-home/xml-data/build-dir/_hg-repositories-cache
bamboo_planRepository_1_username=spring-buildmaster
bamboo_repository_274694331_git_repositoryUrl=https://github.com/spring-cloud/spring-cloud-dataflow-acceptance-tests.git
bamboo_planRepository_type=gitv2
bamboo_git_cache_directory=/opt/bamboo-home/xml-data/build-dir/_git-repositories-cache
bamboo_artifactory_username=buildmaster
bamboo_tmp_directory=/opt/bamboo-home/temp
bamboo_planKey=SCDT-LOCAL20XSKIPPER20X
bamboo_planRepository_username=spring-buildmaster
bamboo_JDK8_HOME=/opt/jdk-8
bamboo_repository_274694331_previous_revision_number=dd41fb40bc32a7a65c2616a8ca39a0a5c2402ad1
bamboo_planRepository_1_branchName=master
bamboo_sonar_version=6.7.7
bamboo_sonar_jdbc_password=********
bamboo_bintray_api_key_password=********
bamboo_capability_system_jdk_JDK_1_11=/opt/jdk-11
bamboo_resultsUrl=https://build.spring.io/browse/SCDT-LOCAL20XSKIPPER20X-KAFKA-303
bamboo_APPLE_AC_USERNAME_PASSWORD=********
bamboo_capability_system_jdk_JDK_1_10=/opt/jdk-10
bamboo_build_working_directory=/opt/bamboo-home/xml-data/build-dir/SCDT-LOCAL20XSKIPPER20X-KAFKA
bamboo_planRepository_1_name=Git
bamboo_capability_system_os=ubuntu1804
bamboo_nexusPush_stagingProfile=buildmaster
bamboo_shortPlanName=Local + SCDF-2.0.4.BS + Skipper 2.0.4.BS (12 am)
bamboo_planRepository_name=Git
bamboo_buildNumber=303
bamboo_planName=Spring Cloud Data Flow Acceptance Tests - Local + SCDF-2.0.4.BS + Skipper 2.0.4.BS (12 am)
bamboo_JDK7_HOME=/opt/jdk-7
bamboo_build_commandline_com_atlassian_bamboo_plugins_scripttask_task_builder_script_7=/opt/bamboo-home/temp/SCDT-LOCAL20XSKIPPER20X-KAFKA-303-ScriptBuildTask-4078652244734576054.sh
bamboo_shortPlanKey=LOCAL20XSKIPPER20X
bamboo_shortJobKey=KAFKA
bamboo_artifactory_password=********
bamboo_buildTimeStamp=2020-03-30T00:00:03.790Z
bamboo_repository_previous_revision_number=dd41fb40bc32a7a65c2616a8ca39a0a5c2402ad1
bamboo_sonar_username=buildmaster
bamboo_********_password=********
bamboo_repository_git_branch=master
bamboo_buildResultKey=SCDT-LOCAL20XSKIPPER20X-KAFKA-303
bamboo_nexusPush_close=true
bamboo_artifactory_override_resolver_username=buildmaster
bamboo_buildPlanName=Spring Cloud Data Flow Acceptance Tests - Local + SCDF-2.0.4.BS + Skipper 2.0.4.BS (12 am) - Run Data Flow Acceptance Tests for Kafka
bamboo_repository_274694331_revision_number=dd41fb40bc32a7a65c2616a8ca39a0a5c2402ad1
bamboo_planRepository_1_revision=dd41fb40bc32a7a65c2616a8ca39a0a5c2402ad1
bamboo_repository_name=Git
bamboo_signing_key_password=********
bamboo_capability_system_builder_groovy_Groovy_2_5=/opt/groovy-2.5
bamboo_buildFailed=true
bamboo_capability_system_docker_executable=/usr/bin/docker
bamboo_capability_system_jdk_OpenJDK_7=/opt/jdk-7
bamboo_capability_system_builder_groovy_Groovy_2_4=/opt/groovy-2.4
bamboo_artifactory_override_deployer_username=buildmaster
bamboo_capability_system_builder_command_Bash=/bin/bash
bamboo_jobFailed=true
bamboo_agentWorkingDirectory=/opt/bamboo-home/xml-data/build-dir
bamboo_capability_system_git_executable=/usr/bin/git
bamboo_repository_git_username=spring-buildmaster
bamboo_planRepository_1_previousRevision=dd41fb40bc32a7a65c2616a8ca39a0a5c2402ad1
bamboo_capability_os_family=unix
bamboo_planRepository_branchDisplayName=master
bamboo_capability_system_builder_maven_Artifactory_Maven_3_6=/opt/maven-3.6
bamboo_capability_system_builder_maven_Artifactory_Maven_3_5=/opt/maven-3.5
bamboo_capability_system_builder_maven_Artifactory_Maven_3_3=/opt/maven-3.3
bamboo_capability_system_builder_maven_Artifactory_Maven_3_2=/opt/maven-3.2
bamboo_s3_properties=/home/bamboo/tools/s3.properties
bamboo_capability_system_builder_maven_Artifactory_Maven_3_1=/opt/maven-3.1
bamboo_artifactory_override_deploy_repo=libs-snapshot-local
bamboo_capability_system_builder_maven_Artifactory_Maven_3_0=/opt/maven-3.0
bamboo_plan_storageTag=plan-274497908
bamboo_bintray_username_password=********
bamboo_repository_git_repositoryUrl=https://github.com/spring-cloud/spring-cloud-dataflow-acceptance-tests.git
bamboo_working_directory=/opt/bamboo-home/xml-data/build-dir/SCDT-LOCAL20XSKIPPER20X-KAFKA
bamboo_planRepository_1_repositoryUrl=https://github.com/spring-cloud/spring-cloud-dataflow-acceptance-tests.git
bamboo_capability_system_jdk_JDK_1_8=/opt/jdk-8
bamboo_artifactory_override_deployer_password=********
bamboo_capability_system_jdk_JDK_1_9=/opt/jdk-9
bamboo_capability_system_jdk_JDK_1_6=/opt/jdk-6
bamboo_sonatype_password=********
bamboo_capability_system_jdk_JDK_1_7=/opt/jdk-7
bamboo_sonar_ip=10.194.6.9
bamboo_ge_cache_password=********
30-Mar-2020 00:25:03 CLEANING UP RESOURCES AFTER RUNNING TESTS
30-Mar-2020 00:25:04 Environment variable JAVA_HOME must be set
30-Mar-2020 00:25:04 FINISHED CLEANING UP RESOURCES
30-Mar-2020 00:25:04 Finished task 'clean up' with result: Success
30-Mar-2020 00:25:04 Running post build plugin 'Docker Container Cleanup'
30-Mar-2020 00:25:04 Running post build plugin 'NCover Results Collector'
30-Mar-2020 00:25:04 Running post build plugin 'Artifactory Release Management Staging'
30-Mar-2020 00:25:04 Running post build plugin 'Artifactory Build Info Copier'
30-Mar-2020 00:25:04 Running post build plugin 'Artifactory Gradle Properties Info Copier'
30-Mar-2020 00:25:04 Running post build plugin 'Clover Results Collector'
30-Mar-2020 00:25:04 Running post build plugin 'npm Cache Cleanup'
30-Mar-2020 00:25:04 Running post build plugin 'Artifact Copier'
30-Mar-2020 00:25:04 Publishing an artifact: App and Server Logs
30-Mar-2020 00:25:04 Finished publishing of artifact Non required job artifact: [App and Server Logs], pattern: [**/*.log] anchored at: [local] in 41.84 ms
30-Mar-2020 00:25:04 Publishing an artifact: Test Results
30-Mar-2020 00:25:04 Finished publishing of artifact Non required job artifact: [Test Results], pattern: [**/target/surefire-reports/**/*.*] in 57.19 ms
30-Mar-2020 00:25:04 Successfully removed working directory at '/opt/bamboo-home/xml-data/build-dir/SCDT-LOCAL20XSKIPPER20X-KAFKA'
30-Mar-2020 00:25:04 Finalising the build...
30-Mar-2020 00:25:04 Stopping timer.
30-Mar-2020 00:25:04 Build SCDT-LOCAL20XSKIPPER20X-KAFKA-303 completed.
30-Mar-2020 00:25:04 Running on server: post build plugin 'NCover Results Collector'
30-Mar-2020 00:25:04 Running on server: post build plugin 'Build Hanging Detection Configuration'
30-Mar-2020 00:25:04 Running on server: post build plugin 'Bamboo project link creator'
30-Mar-2020 00:25:04 Running on server: post build plugin 'Clover Delta Calculator'
30-Mar-2020 00:25:04 Running on server: post build plugin 'Maven Dependencies Postprocessor'
30-Mar-2020 00:25:04 All post build plugins have finished
30-Mar-2020 00:25:04 Generating build results summary...
30-Mar-2020 00:25:04 Saving build results to disk...
30-Mar-2020 00:25:04 Logging substituted variables...
30-Mar-2020 00:25:04 Indexing build results...
30-Mar-2020 00:25:04 Finished building SCDT-LOCAL20XSKIPPER20X-KAFKA-303.