Build: #31 failed

Job: Run Data Flow Acceptance Tests for Kafka failed

Stages & jobs

  1. Test Stage - Kafka

  2. Test Stage - Rabbit

Build log

The build generated 850 lines of output. Download or view full build log

22-Feb-2019 06:20:09 Build Spring Cloud Data Flow Acceptance Tests - Local + SCDF-2.0.0.BS + Skipper 2.0.0.BS - Run Data Flow Acceptance Tests for Kafka #31 (SCDT-LOCAL20XSKIPPER20X-KAFKA-31) started building on agent bamboo-04.af.pivotal.io
22-Feb-2019 06:20:09 Remote agent on host bamboo-04.af.pivotal.io
22-Feb-2019 06:20:09 Build working directory is /opt/bamboo-home/xml-data/build-dir/SCDT-LOCAL20XSKIPPER20X-KAFKA
22-Feb-2019 06:20:09 Executing build Spring Cloud Data Flow Acceptance Tests - Local + SCDF-2.0.0.BS + Skipper 2.0.0.BS - Run Data Flow Acceptance Tests for Kafka #31 (SCDT-LOCAL20XSKIPPER20X-KAFKA-31)
22-Feb-2019 06:20:09 Starting task 'Checkout Default Repository' of type 'com.atlassian.bamboo.plugins.vcs:task.vcs.checkout'
22-Feb-2019 06:20:09 Checking out into /opt/bamboo-home/xml-data/build-dir/SCDT-LOCAL20XSKIPPER20X-KAFKA
22-Feb-2019 06:20:09 Updating source code to revision: 2f9a4f593c5a25a98239fa34c1388049f2ed6120
22-Feb-2019 06:20:09 Creating local git repository in '/opt/bamboo-home/xml-data/build-dir/SCDT-LOCAL20XSKIPPER20X-KAFKA/.git'.
22-Feb-2019 06:20:09 Initialized empty Git repository in /opt/bamboo-home/xml-data/build-dir/SCDT-LOCAL20XSKIPPER20X-KAFKA/.git/
22-Feb-2019 06:20:10 Fetching 'refs/heads/master' from 'https://github.com/spring-cloud/spring-cloud-dataflow-acceptance-tests.git'.
22-Feb-2019 06:20:11 From https://github.com/spring-cloud/spring-cloud-dataflow-acceptance-tests
22-Feb-2019 06:20:11 * [new branch]      master     -> master
22-Feb-2019 06:20:11 Checking out revision 2f9a4f593c5a25a98239fa34c1388049f2ed6120.
22-Feb-2019 06:20:11 Already on 'master'
22-Feb-2019 06:20:11 Updated source code to revision: 2f9a4f593c5a25a98239fa34c1388049f2ed6120
22-Feb-2019 06:20:11 Finished task 'Checkout Default Repository' with result: Success
22-Feb-2019 06:20:11 Running pre-build action: Artifactory Release Staging
22-Feb-2019 06:20:11 Running pre-build action: VCS Version Collector
22-Feb-2019 06:20:11 Starting task 'Execute Acceptance Tests' of type 'com.atlassian.bamboo.plugins.scripttask:task.builder.script'
22-Feb-2019 06:20:11
Beginning to execute external process for build 'Spring Cloud Data Flow Acceptance Tests - Local + SCDF-2.0.0.BS + Skipper 2.0.0.BS - Run Data Flow Acceptance Tests for Kafka #31 (SCDT-LOCAL20XSKIPPER20X-KAFKA-31)'
... running command line:
/opt/bamboo-home/temp/SCDT-LOCAL20XSKIPPER20X-KAFKA-31-ScriptBuildTask-5755158628657531977.sh
... in: /opt/bamboo-home/xml-data/build-dir/SCDT-LOCAL20XSKIPPER20X-KAFKA
... using extra environment variables:
bamboo_planRepository_1_branch=master
bamboo_********_username_password=********
bamboo_signing_store_password=********
bamboo_capability_system_builder_ant_Ant_1_9=/opt/ant-1.9
bamboo_capability_system_builder_ant_Ant_1_8=/opt/ant-1.8
bamboo_planRepository_1_branchDisplayName=master
bamboo_repository_274694331_git_username=spring-buildmaster
bamboo_capability_system_jdk_OpenJDK_7u181=/opt/openjdk-7
bamboo_repository_revision_number=2f9a4f593c5a25a98239fa34c1388049f2ed6120
bamboo_capability_system_builder_node_Node_js_6=/usr/bin/node
bamboo_RIAK_BIN=/usr/sbin/riak
bamboo_buildKey=SCDT-LOCAL20XSKIPPER20X-KAFKA
bamboo_repository_274694331_branch_name=master
bamboo_bintray_password=********
bamboo_sonar_token_password=********
bamboo_shortJobName=Run Data Flow Acceptance Tests for Kafka
bamboo_capability_system_builder_gradle___gradlew=./gradlew
bamboo_buildResultsUrl=https://build.spring.io/browse/SCDT-LOCAL20XSKIPPER20X-KAFKA-31
bamboo_capability_system_builder_mvn3_Maven_3_3=/opt/maven-3.3
bamboo_capability_system_builder_mvn3_Maven_3_2=/opt/maven-3.2
bamboo_capability_system_builder_mvn3_Maven_3_1=/opt/maven-3.1
bamboo_planRepository_repositoryUrl=https://github.com/spring-cloud/spring-cloud-dataflow-acceptance-tests.git
bamboo_agentId=208568323
bamboo_capability_system_builder_mvn3_Maven_3_5=/opt/maven-3.5
bamboo_capability_system_builder_mvn3_Maven_3_0=/opt/maven-3.0
bamboo_planRepository_revision=2f9a4f593c5a25a98239fa34c1388049f2ed6120
bamboo_planRepository_previousRevision=e71b1f3a017c833d2e206c6c351d519adb5801fc
bamboo_capability_remote_build=true
bamboo_repository_branch_name=master
bamboo_sonatype_token_password=********
bamboo_repository_274694331_name=Git
bamboo_scdf_acceptance_tests_password=********
JAVA_HOME=/opt/jdk-8
bamboo_dependenciesDisabled=false
bamboo_repository_274694331_git_branch=master
bamboo_capability_Agent=bamboo-04.af.pivotal.io
bamboo_planRepository_branch=master
bamboo_planRepository_1_type=gitv2
bamboo_planRepository_branchName=master
bamboo_sonar_password=********
bamboo_hg_cache_directory=/opt/bamboo-home/xml-data/build-dir/_hg-repositories-cache
bamboo_planRepository_1_username=spring-buildmaster
bamboo_repository_274694331_git_repositoryUrl=https://github.com/spring-cloud/spring-cloud-dataflow-acceptance-tests.git
bamboo_planRepository_type=gitv2
bamboo_ManualBuildTriggerReason_userName=igopinathan
bamboo_git_cache_directory=/opt/bamboo-home/xml-data/build-dir/_git-repositories-cache
bamboo_artifactory_username=buildmaster
bamboo_tmp_directory=/opt/bamboo-home/temp
bamboo_planKey=SCDT-LOCAL20XSKIPPER20X
bamboo_planRepository_username=spring-buildmaster
bamboo_JDK8_HOME=/opt/jdk-8
bamboo_repository_274694331_previous_revision_number=e71b1f3a017c833d2e206c6c351d519adb5801fc
bamboo_planRepository_1_branchName=master
bamboo_sonar_version=5.6.3
bamboo_capability_system_jdk_JDK_1_11=/opt/jdk-11
bamboo_resultsUrl=https://build.spring.io/browse/SCDT-LOCAL20XSKIPPER20X-KAFKA-31
bamboo_capability_system_jdk_JDK_1_10=/opt/jdk-10
bamboo_build_working_directory=/opt/bamboo-home/xml-data/build-dir/SCDT-LOCAL20XSKIPPER20X-KAFKA
bamboo_planRepository_1_name=Git
bamboo_capability_system_os=ubuntu1604
bamboo_nexusPush_stagingProfile=buildmaster
bamboo_shortPlanName=Local + SCDF-2.0.0.BS + Skipper 2.0.0.BS
bamboo_planRepository_name=Git
bamboo_buildNumber=31
bamboo_planName=Spring Cloud Data Flow Acceptance Tests - Local + SCDF-2.0.0.BS + Skipper 2.0.0.BS
bamboo_JDK7_HOME=/opt/jdk-7
bamboo_shortPlanKey=LOCAL20XSKIPPER20X
bamboo_shortJobKey=KAFKA
bamboo_artifactory_password=********
bamboo_buildTimeStamp=2019-02-22T06:20:09.878Z
bamboo_repository_previous_revision_number=e71b1f3a017c833d2e206c6c351d519adb5801fc
bamboo_sonar_username=buildmaster
bamboo_********_password=********
bamboo_repository_git_branch=master
bamboo_buildResultKey=SCDT-LOCAL20XSKIPPER20X-KAFKA-31
bamboo_nexusPush_close=true
bamboo_buildPlanName=Spring Cloud Data Flow Acceptance Tests - Local + SCDF-2.0.0.BS + Skipper 2.0.0.BS - Run Data Flow Acceptance Tests for Kafka
bamboo_repository_274694331_revision_number=2f9a4f593c5a25a98239fa34c1388049f2ed6120
bamboo_planRepository_1_revision=2f9a4f593c5a25a98239fa34c1388049f2ed6120
bamboo_repository_name=Git
bamboo_signing_key_password=********
bamboo_buildFailed=false
bamboo_capability_system_docker_executable=/usr/bin/docker
bamboo_capability_system_builder_groovy_Groovy_2_4=/opt/groovy-2.4
bamboo_capability_system_builder_command_Bash=/bin/bash
bamboo_agentWorkingDirectory=/opt/bamboo-home/xml-data/build-dir
bamboo_capability_system_git_executable=/usr/bin/git
bamboo_repository_git_username=spring-buildmaster
bamboo_planRepository_1_previousRevision=e71b1f3a017c833d2e206c6c351d519adb5801fc
bamboo_capability_os_family=unix
bamboo_planRepository_branchDisplayName=master
bamboo_capability_system_builder_maven_Artifactory_Maven_3_5=/opt/maven-3.5
bamboo_capability_system_builder_maven_Artifactory_Maven_3_3=/opt/maven-3.3
bamboo_capability_system_builder_maven_Artifactory_Maven_3_2=/opt/maven-3.2
bamboo_s3_properties=/home/bamboo/tools/s3.properties
bamboo_capability_system_builder_maven_Artifactory_Maven_3_1=/opt/maven-3.1
bamboo_capability_system_builder_maven_Artifactory_Maven_3_0=/opt/maven-3.0
bamboo_plan_storageTag=plan-274497908
bamboo_bintray_username_password=********
bamboo_repository_git_repositoryUrl=https://github.com/spring-cloud/spring-cloud-dataflow-acceptance-tests.git
bamboo_working_directory=/opt/bamboo-home/xml-data/build-dir/SCDT-LOCAL20XSKIPPER20X-KAFKA
bamboo_planRepository_1_repositoryUrl=https://github.com/spring-cloud/spring-cloud-dataflow-acceptance-tests.git
bamboo_capability_system_jdk_JDK_1_8=/opt/jdk-8
bamboo_capability_system_jdk_JDK_1_9=/opt/jdk-9
bamboo_capability_system_jdk_JDK_1_6=/opt/jdk-6
bamboo_sonatype_password=********
bamboo_capability_system_jdk_JDK_1_7=/opt/jdk-7
bamboo_sonar_ip=10.194.6.9
22-Feb-2019 06:20:11 CLEANING UP RESOURCES BEFORE TESTS
22-Feb-2019 06:20:11 Setting the environment variables
22-Feb-2019 06:20:11 Export the unset env. variables from /opt/bamboo-home/xml-data/build-dir/SCDT-LOCAL20XSKIPPER20X-KAFKA/local/init/env.properties :
22-Feb-2019 06:20:11    SPRING_CLOUD_DATAFLOW_SERVER_DOWNLOAD_URL = http://repo.spring.io/libs-snapshot/org/springframework/cloud/spring-cloud-dataflow-server-local//spring-cloud-dataflow-server-local-.jar
22-Feb-2019 06:20:11    SPRING_CLOUD_SKIPPER_SERVER_DOWNLOAD_URL = http://repo.spring.io/libs-snapshot/org/springframework/cloud/spring-cloud-skipper-server//spring-cloud-skipper-server-.jar
22-Feb-2019 06:20:11    SPRING_DATASOURCE_USERNAME = spring
22-Feb-2019 06:20:11    SPRING_DATASOURCE_PASSWORD = cloud
22-Feb-2019 06:20:11    SPRING_SCHEMA_NAME = dataflow
22-Feb-2019 06:20:11    DOCKER_SERVER = localhost
22-Feb-2019 06:20:11 Setting retries to 60 and WAIT_TIME to 5
22-Feb-2019 06:20:11 Export the unset env. variables from /opt/bamboo-home/xml-data/build-dir/SCDT-LOCAL20XSKIPPER20X-KAFKA/local/binder/rabbit/env.properties :
22-Feb-2019 06:20:11    STREAM_REGISTRATION_RESOURCE = http://repo.spring.io/libs-release/org/springframework/cloud/stream/app/spring-cloud-stream-app-descriptor/Celsius.SR3/spring-cloud-stream-app-descriptor-Celsius.SR3.stream-apps-rabbit-maven
22-Feb-2019 06:20:11    TASK_REGISTRATION_RESOURCE = http://repo.spring.io/libs-release/org/springframework/cloud/task/app/spring-cloud-task-app-descriptor/Clark.RELEASE/spring-cloud-task-app-descriptor-Clark.RELEASE.task-apps-maven
22-Feb-2019 06:20:11 SCDF SERVER URI: http://localhost:9393
22-Feb-2019 06:20:11 Clean up, clean up, everybody everywhere; clean up clean up, everybody do your share!
22-Feb-2019 06:20:12 No stopped containers
22-Feb-2019 06:20:12 No stopped containers
22-Feb-2019 06:20:13 No stopped containers
22-Feb-2019 06:20:13 FINISHED CLEANING UP RESOURCES
22-Feb-2019 06:20:13 Setting the environment variables
22-Feb-2019 06:20:13 Export the unset env. variables from /opt/bamboo-home/xml-data/build-dir/SCDT-LOCAL20XSKIPPER20X-KAFKA/local/init/env.properties :
22-Feb-2019 06:20:13    SPRING_CLOUD_DATAFLOW_SERVER_DOWNLOAD_URL = http://repo.spring.io/libs-snapshot/org/springframework/cloud/spring-cloud-dataflow-server/2.0.0.BUILD-SNAPSHOT/spring-cloud-dataflow-server-2.0.0.BUILD-SNAPSHOT.jar
22-Feb-2019 06:20:13    SPRING_CLOUD_SKIPPER_SERVER_DOWNLOAD_URL = http://repo.spring.io/libs-snapshot/org/springframework/cloud/spring-cloud-skipper-server/2.0.0.BUILD-SNAPSHOT/spring-cloud-skipper-server-2.0.0.BUILD-SNAPSHOT.jar
22-Feb-2019 06:20:13    SPRING_DATASOURCE_USERNAME = spring
22-Feb-2019 06:20:13    SPRING_DATASOURCE_PASSWORD = cloud
22-Feb-2019 06:20:13    SPRING_SCHEMA_NAME = dataflow
22-Feb-2019 06:20:13    DOCKER_SERVER = localhost
22-Feb-2019 06:20:13 Setting retries to 60 and WAIT_TIME to 5
22-Feb-2019 06:20:13 cleaning up any previous mysql docker containers...
22-Feb-2019 06:20:13 done cleaning up.
22-Feb-2019 06:20:13 Could not find a local mysql server, trying docker.
22-Feb-2019 06:20:13 Creating mysql_mysql_1
22-Feb-2019 06:20:13 mysql running on localhost:3306
22-Feb-2019 06:20:13 Service host is localhost
22-Feb-2019 06:20:13 Creating kafka compose file on /opt/bamboo-home/xml-data/build-dir/SCDT-LOCAL20XSKIPPER20X-KAFKA/local/binder/kafka/docker-compose.yml
22-Feb-2019 06:20:13 cleaning up any previous kafka docker containers...
22-Feb-2019 06:20:13 done cleaning up
22-Feb-2019 06:20:13 Could not find a local kafka server, trying docker.
22-Feb-2019 06:20:14 Creating kafka_zookeeper_1
22-Feb-2019 06:20:14 Creating kafka_kafka_1
22-Feb-2019 06:20:14 kafka running on localhost:9092
22-Feb-2019 06:20:14 Export the unset env. variables from /opt/bamboo-home/xml-data/build-dir/SCDT-LOCAL20XSKIPPER20X-KAFKA/local/binder/kafka/env.properties :
22-Feb-2019 06:20:14    STREAM_REGISTRATION_RESOURCE = http://repo.spring.io/libs-release/org/springframework/cloud/stream/app/spring-cloud-stream-app-descriptor/Celsius.SR3/spring-cloud-stream-app-descriptor-Celsius.SR3.stream-apps-kafka-10-maven
22-Feb-2019 06:20:14    TASK_REGISTRATION_RESOURCE = http://repo.spring.io/libs-release/org/springframework/cloud/task/app/spring-cloud-task-app-descriptor/Clark.RELEASE/spring-cloud-task-app-descriptor-Clark.RELEASE.task-apps-maven
22-Feb-2019 06:20:14 cleaning up any previous redis docker containers...
22-Feb-2019 06:20:14 done cleaning up.
22-Feb-2019 06:20:15 redis found on localhost
22-Feb-2019 06:20:15 SKIPPER SERVER URI: http://localhost:7577
22-Feb-2019 06:20:15 Downloading server from http://repo.spring.io/libs-snapshot/org/springframework/cloud/spring-cloud-skipper-server/2.0.0.BUILD-SNAPSHOT/spring-cloud-skipper-server-2.0.0.BUILD-SNAPSHOT.jar
22-Feb-2019 06:20:52 2019-02-22 06:20:52 URL:http://repo.spring.io/libs-snapshot/org/springframework/cloud/spring-cloud-skipper-server/2.0.0.BUILD-SNAPSHOT/spring-cloud-skipper-server-2.0.0.BUILD-SNAPSHOT.jar [80093989/80093989] -> "/opt/bamboo-home/xml-data/build-dir/SCDT-LOCAL20XSKIPPER20X-KAFKA/local/skipper-server/skipper-server.jar" [1]
22-Feb-2019 06:20:52 executing [nohup /opt/jdk-8/bin/java  -Dlogging.level.org.springframework.cloud.deployer.spi.local.LocalAppDeployer=DEBUG -Xmx1024m -Xss1024k -jar /opt/bamboo-home/xml-data/build-dir/SCDT-LOCAL20XSKIPPER20X-KAFKA/local/skipper-server/skipper-server.jar  --spring.datasource.driver-class-name=org.mariadb.jdbc.Driver --spring.datasource.url=jdbc:mysql://localhost/dataflow --spring.datasource.username=spring --spring.datasource.password=cloud  --spring.cloud.dataflow.applicationProperties.stream.spring.cloud.stream.kafka.binder.brokers=localhost --spring.cloud.dataflow.applicationProperties.stream.spring.cloud.stream.kafka.binder.zkNodes=localhost  --spring.redis.host=127.0.0.1 --spring.cloud.skipper.server.platform.local.accounts.default.workingDirectoriesRoot=/opt/bamboo-home/xml-data/build-dir/SCDT-LOCAL20XSKIPPER20X-KAFKA/local/skipper-server/app-logs > /opt/bamboo-home/xml-data/build-dir/SCDT-LOCAL20XSKIPPER20X-KAFKA/local/skipper-server/skipper-server.log &]
22-Feb-2019 06:20:52 [/opt/bamboo-home/xml-data/build-dir/SCDT-LOCAL20XSKIPPER20X-KAFKA/local/skipper-server] process pid is [22059]
22-Feb-2019 06:20:52 System props are []
22-Feb-2019 06:20:52 Logs are under [/opt/bamboo-home/xml-data/build-dir/SCDT-LOCAL20XSKIPPER20X-KAFKA/local/skipper-server/skipper-server.log] or from nohup [/opt/bamboo-home/xml-data/build-dir/SCDT-LOCAL20XSKIPPER20X-KAFKA/local/skipper-server/nohup.log]
22-Feb-2019 06:20:52 Failed to connect to localhost:7577. Attempt  #1/60... will try again in [5] seconds
22-Feb-2019 06:20:57 Failed to connect to localhost:7577. Attempt  #2/60... will try again in [5] seconds
22-Feb-2019 06:21:02 Failed to connect to localhost:7577. Attempt  #3/60... will try again in [5] seconds
22-Feb-2019 06:21:07 SCDF SERVER URI: http://localhost:9393
22-Feb-2019 06:21:07 Downloading server from http://repo.spring.io/libs-snapshot/org/springframework/cloud/spring-cloud-dataflow-server/2.0.0.BUILD-SNAPSHOT/spring-cloud-dataflow-server-2.0.0.BUILD-SNAPSHOT.jar
22-Feb-2019 06:22:06 2019-02-22 06:22:06 URL:http://repo.spring.io/libs-snapshot/org/springframework/cloud/spring-cloud-dataflow-server/2.0.0.BUILD-SNAPSHOT/spring-cloud-dataflow-server-2.0.0.BUILD-SNAPSHOT.jar [86769371/86769371] -> "/opt/bamboo-home/xml-data/build-dir/SCDT-LOCAL20XSKIPPER20X-KAFKA/local/server/scdf-server.jar" [1]
22-Feb-2019 06:22:06 SPRING_PROFILES_ACTIVE []
22-Feb-2019 06:22:06 executing [nohup /opt/jdk-8/bin/java  -Xmx1024m -Xss1024k -jar /opt/bamboo-home/xml-data/build-dir/SCDT-LOCAL20XSKIPPER20X-KAFKA/local/server/scdf-server.jar  --spring.datasource.driver-class-name=org.mariadb.jdbc.Driver --spring.datasource.url=jdbc:mysql://localhost/dataflow --spring.datasource.username=spring --spring.datasource.password=cloud  --spring.cloud.dataflow.applicationProperties.stream.spring.cloud.stream.kafka.binder.brokers=localhost --spring.cloud.dataflow.applicationProperties.stream.spring.cloud.stream.kafka.binder.zkNodes=localhost  --spring.redis.host=127.0.0.1 --spring.cloud.skipper.server.platform.local.accounts.default.workingDirectoriesRoot=/opt/bamboo-home/xml-data/build-dir/SCDT-LOCAL20XSKIPPER20X-KAFKA/local/skipper-server/app-logs --spring.cloud.dataflow.features.skipper-enabled=true > /opt/bamboo-home/xml-data/build-dir/SCDT-LOCAL20XSKIPPER20X-KAFKA/local/server/scdf-server.log &]
22-Feb-2019 06:22:06 [/opt/bamboo-home/xml-data/build-dir/SCDT-LOCAL20XSKIPPER20X-KAFKA/local/server] process pid is [22220]
22-Feb-2019 06:22:06 System props are []
22-Feb-2019 06:22:06 Logs are under [/opt/bamboo-home/xml-data/build-dir/SCDT-LOCAL20XSKIPPER20X-KAFKA/local/server/scdf-server.log] or from nohup [/opt/bamboo-home/xml-data/build-dir/SCDT-LOCAL20XSKIPPER20X-KAFKA/local/server/nohup.log]
22-Feb-2019 06:22:06 Failed to connect to localhost:9393. Attempt  #1/60... will try again in [5] seconds
22-Feb-2019 06:22:11 Failed to connect to localhost:9393. Attempt  #2/60... will try again in [5] seconds
22-Feb-2019 06:22:16 Failed to connect to localhost:9393. Attempt  #3/60... will try again in [5] seconds
22-Feb-2019 06:22:21 SCDF SERVER ABOUT:
22-Feb-2019 06:22:21 {
22-Feb-2019 06:22:21     "_links": {
22-Feb-2019 06:22:21         "self": {
22-Feb-2019 06:22:21             "href": "http://localhost:9393/about"
22-Feb-2019 06:22:21         }
22-Feb-2019 06:22:21     },
22-Feb-2019 06:22:21     "featureInfo": {
22-Feb-2019 06:22:21         "analyticsEnabled": true,
22-Feb-2019 06:22:21         "grafanaEnabled": false,
22-Feb-2019 06:22:21         "schedulerEnabled": false,
22-Feb-2019 06:22:21         "streamsEnabled": true,
22-Feb-2019 06:22:21         "tasksEnabled": true
22-Feb-2019 06:22:21     },
22-Feb-2019 06:22:21     "grafanaInfo": {
22-Feb-2019 06:22:21         "refreshInterval": 15,
22-Feb-2019 06:22:21         "url": ""
22-Feb-2019 06:22:21     },
22-Feb-2019 06:22:21     "runtimeEnvironment": {
22-Feb-2019 06:22:21         "appDeployer": {
22-Feb-2019 06:22:21             "deployerImplementationVersion": "2.0.0.BUILD-SNAPSHOT",
22-Feb-2019 06:22:21             "deployerName": "Spring Cloud Skipper Server",
22-Feb-2019 06:22:21             "deployerSpiVersion": "2.0.0.RC1",
22-Feb-2019 06:22:21             "javaVersion": "1.8.0_144",
22-Feb-2019 06:22:21             "platformApiVersion": "",
22-Feb-2019 06:22:21             "platformClientVersion": "",
22-Feb-2019 06:22:21             "platformHostVersion": "",
22-Feb-2019 06:22:21             "platformSpecificInfo": {
22-Feb-2019 06:22:21                 "default": "local"
22-Feb-2019 06:22:21             },
22-Feb-2019 06:22:21             "platformType": "Skipper Managed",
22-Feb-2019 06:22:21             "springBootVersion": "2.1.2.RELEASE",
22-Feb-2019 06:22:21             "springVersion": "5.1.4.RELEASE"
22-Feb-2019 06:22:21         },
22-Feb-2019 06:22:21         "taskLaunchers": [
22-Feb-2019 06:22:21             {
22-Feb-2019 06:22:21                 "deployerImplementationVersion": "2.0.0.RELEASE",
22-Feb-2019 06:22:21                 "deployerName": "LocalTaskLauncher",
22-Feb-2019 06:22:21                 "deployerSpiVersion": "2.0.0.RELEASE",
22-Feb-2019 06:22:21                 "javaVersion": "1.8.0_144",
22-Feb-2019 06:22:21                 "platformApiVersion": "Linux 4.4.0-141-generic",
22-Feb-2019 06:22:21                 "platformClientVersion": "4.4.0-141-generic",
22-Feb-2019 06:22:21                 "platformHostVersion": "4.4.0-141-generic",
22-Feb-2019 06:22:21                 "platformSpecificInfo": {},
22-Feb-2019 06:22:21                 "platformType": "Local",
22-Feb-2019 06:22:21                 "springBootVersion": "2.1.2.RELEASE",
22-Feb-2019 06:22:21                 "springVersion": "5.1.4.RELEASE"
22-Feb-2019 06:22:21             }
22-Feb-2019 06:22:21         ]
22-Feb-2019 06:22:21     },
22-Feb-2019 06:22:21     "securityInfo": {
22-Feb-2019 06:22:21         "authenticated": false,
22-Feb-2019 06:22:21         "authenticationEnabled": false,
22-Feb-2019 06:22:21         "roles": [],
22-Feb-2019 06:22:21         "username": null
22-Feb-2019 06:22:21     },
22-Feb-2019 06:22:21     "versionInfo": {
22-Feb-2019 06:22:21         "core": {
22-Feb-2019 06:22:21             "name": "Spring Cloud Data Flow Core",
22-Feb-2019 06:22:21             "version": "2.0.0.BUILD-SNAPSHOT"
22-Feb-2019 06:22:21         },
22-Feb-2019 06:22:21         "dashboard": {
22-Feb-2019 06:22:21             "name": "Spring Cloud Dataflow UI",
22-Feb-2019 06:22:21             "version": "2.0.0.RC1"
22-Feb-2019 06:22:21         },
22-Feb-2019 06:22:21         "implementation": {
22-Feb-2019 06:22:21             "name": "spring-cloud-dataflow-server",
22-Feb-2019 06:22:21             "version": "2.0.0.BUILD-SNAPSHOT"
22-Feb-2019 06:22:21         },
22-Feb-2019 06:22:21         "shell": {
22-Feb-2019 06:22:21             "name": "Spring Cloud Data Flow Shell",
22-Feb-2019 06:22:21             "url": "https://repo.spring.io/libs-snapshot/org/springframework/cloud/spring-cloud-dataflow-shell/2.0.0.BUILD-SNAPSHOT/spring-cloud-dataflow-shell-2.0.0.BUILD-SNAPSHOT.jar",
22-Feb-2019 06:22:21             "version": "2.0.0.BUILD-SNAPSHOT"
22-Feb-2019 06:22:21         }
22-Feb-2019 06:22:21     }
22-Feb-2019 06:22:21 }
22-Feb-2019 06:22:21 SKIPPER SERVER ABOUT:
22-Feb-2019 06:22:21 {
22-Feb-2019 06:22:21     "versionInfo": {
22-Feb-2019 06:22:21         "server": {
22-Feb-2019 06:22:21             "name": "Spring Cloud Skipper Server",
22-Feb-2019 06:22:21             "version": "2.0.0.BUILD-SNAPSHOT"
22-Feb-2019 06:22:21         },
22-Feb-2019 06:22:21         "shell": {
22-Feb-2019 06:22:21             "name": "Spring Cloud Skipper Shell",
22-Feb-2019 06:22:21             "url": "https://repo.spring.io/libs-snapshot/org/springframework/cloud/spring-cloud-skipper-shell/2.0.0.BUILD-SNAPSHOT/spring-cloud-skipper-shell-2.0.0.BUILD-SNAPSHOT.jar",
22-Feb-2019 06:22:21             "version": "2.0.0.BUILD-SNAPSHOT"
22-Feb-2019 06:22:21         }
22-Feb-2019 06:22:21     }
22-Feb-2019 06:22:21 }
22-Feb-2019 06:22:22 [INFO] Scanning for projects...
22-Feb-2019 06:22:23 [INFO]                                                                         
22-Feb-2019 06:22:23 [INFO] ------------------------------------------------------------------------
22-Feb-2019 06:22:23 [INFO] Building Data Flow Acceptance Tests 1.1.0.BUILD-SNAPSHOT
22-Feb-2019 06:22:23 [INFO] ------------------------------------------------------------------------
22-Feb-2019 06:22:23 [INFO]
22-Feb-2019 06:22:23 [INFO] --- maven-checkstyle-plugin:2.17:check (checkstyle-validation) @ spring-cloud-dataflow-acceptance-tests ---
22-Feb-2019 06:22:24 [INFO]
22-Feb-2019 06:22:24 [INFO] --- maven-resources-plugin:2.6:resources (default-resources) @ spring-cloud-dataflow-acceptance-tests ---
22-Feb-2019 06:22:24 [INFO] Using 'UTF-8' encoding to copy filtered resources.
22-Feb-2019 06:22:24 [INFO] skip non existing resourceDirectory /opt/bamboo-home/xml-data/build-dir/SCDT-LOCAL20XSKIPPER20X-KAFKA/src/main/resources
22-Feb-2019 06:22:24 [INFO] skip non existing resourceDirectory /opt/bamboo-home/xml-data/build-dir/SCDT-LOCAL20XSKIPPER20X-KAFKA/src/main/resources
22-Feb-2019 06:22:24 [INFO]
22-Feb-2019 06:22:24 [INFO] --- maven-compiler-plugin:3.1:compile (default-compile) @ spring-cloud-dataflow-acceptance-tests ---
22-Feb-2019 06:22:24 [INFO] Changes detected - recompiling the module!
22-Feb-2019 06:22:24 [INFO] Compiling 8 source files to /opt/bamboo-home/xml-data/build-dir/SCDT-LOCAL20XSKIPPER20X-KAFKA/target/classes
22-Feb-2019 06:22:25 [INFO]
22-Feb-2019 06:22:25 [INFO] --- maven-resources-plugin:2.6:testResources (default-testResources) @ spring-cloud-dataflow-acceptance-tests ---
22-Feb-2019 06:22:25 [INFO] Using 'UTF-8' encoding to copy filtered resources.
22-Feb-2019 06:22:25 [INFO] Copying 1 resource
22-Feb-2019 06:22:25 [INFO]
22-Feb-2019 06:22:25 [INFO] --- maven-compiler-plugin:3.1:testCompile (default-testCompile) @ spring-cloud-dataflow-acceptance-tests ---
22-Feb-2019 06:22:25 [INFO] Changes detected - recompiling the module!
22-Feb-2019 06:22:25 [INFO] Compiling 15 source files to /opt/bamboo-home/xml-data/build-dir/SCDT-LOCAL20XSKIPPER20X-KAFKA/target/test-classes
22-Feb-2019 06:22:25 [WARNING] /opt/bamboo-home/xml-data/build-dir/SCDT-LOCAL20XSKIPPER20X-KAFKA/src/test/java/org/springframework/cloud/dataflow/acceptance/test/AbstractTaskTests.java: Some input files use unchecked or unsafe operations.
22-Feb-2019 06:22:25 [WARNING] /opt/bamboo-home/xml-data/build-dir/SCDT-LOCAL20XSKIPPER20X-KAFKA/src/test/java/org/springframework/cloud/dataflow/acceptance/test/AbstractTaskTests.java: Recompile with -Xlint:unchecked for details.
22-Feb-2019 06:22:25 [INFO]
22-Feb-2019 06:22:25 [INFO] --- maven-surefire-plugin:2.18.1:test (default-test) @ spring-cloud-dataflow-acceptance-tests ---
22-Feb-2019 06:22:25 [INFO] Surefire report directory: /opt/bamboo-home/xml-data/build-dir/SCDT-LOCAL20XSKIPPER20X-KAFKA/target/surefire-reports
22-Feb-2019 06:22:25
22-Feb-2019 06:22:25 -------------------------------------------------------
22-Feb-2019 06:22:25 T E S T S
22-Feb-2019 06:22:25 -------------------------------------------------------
22-Feb-2019 06:22:26 2019-02-22 06:22:26.276  INFO   --- [           main] .b.t.c.SpringBootTestContextBootstrapper : Neither @ContextConfiguration nor @ContextHierarchy found for test class [org.springframework.cloud.dataflow.acceptance.test.AnalyticsTests], using SpringBootContextLoader
22-Feb-2019 06:22:26 2019-02-22 06:22:26.321  INFO   --- [           main] .b.t.c.SpringBootTestContextBootstrapper : Loaded default TestExecutionListener class names from location [META-INF/spring.factories]: [org.springframework.boot.test.mock.mockito.MockitoTestExecutionListener, org.springframework.boot.test.mock.mockito.ResetMocksTestExecutionListener, org.springframework.boot.test.autoconfigure.restdocs.RestDocsTestExecutionListener, org.springframework.boot.test.autoconfigure.web.client.MockRestServiceServerResetTestExecutionListener, org.springframework.boot.test.autoconfigure.web.servlet.MockMvcPrintOnlyOnFailureTestExecutionListener, org.springframework.boot.test.autoconfigure.web.servlet.WebDriverTestExecutionListener, org.springframework.test.context.web.ServletTestExecutionListener, org.springframework.test.context.support.DirtiesContextBeforeModesTestExecutionListener, org.springframework.test.context.support.DependencyInjectionTestExecutionListener, org.springframework.test.context.support.DirtiesContextTestExecutionListener, org.springframework.test.context.transaction.TransactionalTestExecutionListener, org.springframework.test.context.jdbc.SqlScriptsTestExecutionListener]
22-Feb-2019 06:22:26 2019-02-22 06:22:26.337  INFO   --- [           main] .b.t.c.SpringBootTestContextBootstrapper : Using TestExecutionListeners: [org.springframework.test.context.web.ServletTestExecutionListener@636be97c, org.springframework.test.context.support.DirtiesContextBeforeModesTestExecutionListener@50a638b5, org.springframework.boot.test.autoconfigure.SpringBootDependencyInjectionTestExecutionListener@1817d444, org.springframework.test.context.support.DirtiesContextTestExecutionListener@6ca8564a, org.springframework.test.context.transaction.TransactionalTestExecutionListener@50b472aa, org.springframework.test.context.jdbc.SqlScriptsTestExecutionListener@31368b99, org.springframework.boot.test.autoconfigure.web.servlet.MockMvcPrintOnlyOnFailureTestExecutionListener@1725dc0f, org.springframework.boot.test.autoconfigure.web.client.MockRestServiceServerResetTestExecutionListener@3911c2a7, org.springframework.boot.test.mock.mockito.ResetMocksTestExecutionListener@4ac3c60d, org.springframework.boot.test.autoconfigure.web.servlet.WebDriverTestExecutionListener@4facf68f, org.springframework.boot.test.autoconfigure.restdocs.RestDocsTestExecutionListener@76508ed1, org.springframework.boot.test.mock.mockito.MockitoTestExecutionListener@41e36e46]
22-Feb-2019 06:22:26 2019-02-22 06:22:26.339  INFO   --- [           main] .b.t.c.SpringBootTestContextBootstrapper : Neither @ContextConfiguration nor @ContextHierarchy found for test class [org.springframework.cloud.dataflow.acceptance.test.WoodChuckTests], using SpringBootContextLoader
22-Feb-2019 06:22:26 2019-02-22 06:22:26.352  INFO   --- [           main] .b.t.c.SpringBootTestContextBootstrapper : Loaded default TestExecutionListener class names from location [META-INF/spring.factories]: [org.springframework.boot.test.mock.mockito.MockitoTestExecutionListener, org.springframework.boot.test.mock.mockito.ResetMocksTestExecutionListener, org.springframework.boot.test.autoconfigure.restdocs.RestDocsTestExecutionListener, org.springframework.boot.test.autoconfigure.web.client.MockRestServiceServerResetTestExecutionListener, org.springframework.boot.test.autoconfigure.web.servlet.MockMvcPrintOnlyOnFailureTestExecutionListener, org.springframework.boot.test.autoconfigure.web.servlet.WebDriverTestExecutionListener, org.springframework.test.context.web.ServletTestExecutionListener, org.springframework.test.context.support.DirtiesContextBeforeModesTestExecutionListener, org.springframework.test.context.support.DependencyInjectionTestExecutionListener, org.springframework.test.context.support.DirtiesContextTestExecutionListener, org.springframework.test.context.transaction.TransactionalTestExecutionListener, org.springframework.test.context.jdbc.SqlScriptsTestExecutionListener]
22-Feb-2019 06:22:26 2019-02-22 06:22:26.356  INFO   --- [           main] .b.t.c.SpringBootTestContextBootstrapper : Using TestExecutionListeners: [org.springframework.test.context.web.ServletTestExecutionListener@49139829, org.springframework.test.context.support.DirtiesContextBeforeModesTestExecutionListener@9597028, org.springframework.boot.test.autoconfigure.SpringBootDependencyInjectionTestExecutionListener@6069db50, org.springframework.test.context.support.DirtiesContextTestExecutionListener@4efbca5a, org.springframework.test.context.transaction.TransactionalTestExecutionListener@1b7cc17c, org.springframework.test.context.jdbc.SqlScriptsTestExecutionListener@59662a0b, org.springframework.boot.test.autoconfigure.web.servlet.MockMvcPrintOnlyOnFailureTestExecutionListener@77fbd92c, org.springframework.boot.test.autoconfigure.web.client.MockRestServiceServerResetTestExecutionListener@67c27493, org.springframework.boot.test.mock.mockito.ResetMocksTestExecutionListener@1a482e36, org.springframework.boot.test.autoconfigure.web.servlet.WebDriverTestExecutionListener@72967906, org.springframework.boot.test.autoconfigure.restdocs.RestDocsTestExecutionListener@5b8dfcc1, org.springframework.boot.test.mock.mockito.MockitoTestExecutionListener@2f9f7dcf]
22-Feb-2019 06:22:26 2019-02-22 06:22:26.357  INFO   --- [           main] .b.t.c.SpringBootTestContextBootstrapper : Neither @ContextConfiguration nor @ContextHierarchy found for test class [org.springframework.cloud.dataflow.acceptance.test.HttpSourceTests], using SpringBootContextLoader
22-Feb-2019 06:22:26 2019-02-22 06:22:26.367  INFO   --- [           main] .b.t.c.SpringBootTestContextBootstrapper : Loaded default TestExecutionListener class names from location [META-INF/spring.factories]: [org.springframework.boot.test.mock.mockito.MockitoTestExecutionListener, org.springframework.boot.test.mock.mockito.ResetMocksTestExecutionListener, org.springframework.boot.test.autoconfigure.restdocs.RestDocsTestExecutionListener, org.springframework.boot.test.autoconfigure.web.client.MockRestServiceServerResetTestExecutionListener, org.springframework.boot.test.autoconfigure.web.servlet.MockMvcPrintOnlyOnFailureTestExecutionListener, org.springframework.boot.test.autoconfigure.web.servlet.WebDriverTestExecutionListener, org.springframework.test.context.web.ServletTestExecutionListener, org.springframework.test.context.support.DirtiesContextBeforeModesTestExecutionListener, org.springframework.test.context.support.DependencyInjectionTestExecutionListener, org.springframework.test.context.support.DirtiesContextTestExecutionListener, org.springframework.test.context.transaction.TransactionalTestExecutionListener, org.springframework.test.context.jdbc.SqlScriptsTestExecutionListener]
22-Feb-2019 06:22:26 2019-02-22 06:22:26.370  INFO   --- [           main] .b.t.c.SpringBootTestContextBootstrapper : Using TestExecutionListeners: [org.springframework.test.context.web.ServletTestExecutionListener@1a677343, org.springframework.test.context.support.DirtiesContextBeforeModesTestExecutionListener@15de0b3c, org.springframework.boot.test.autoconfigure.SpringBootDependencyInjectionTestExecutionListener@489115ef, org.springframework.test.context.support.DirtiesContextTestExecutionListener@3857f613, org.springframework.test.context.transaction.TransactionalTestExecutionListener@198b6731, org.springframework.test.context.jdbc.SqlScriptsTestExecutionListener@7c6908d7, org.springframework.boot.test.autoconfigure.web.servlet.MockMvcPrintOnlyOnFailureTestExecutionListener@3c9754d8, org.springframework.boot.test.autoconfigure.web.client.MockRestServiceServerResetTestExecutionListener@3bf7ca37, org.springframework.boot.test.mock.mockito.ResetMocksTestExecutionListener@79079097, org.springframework.boot.test.autoconfigure.web.servlet.WebDriverTestExecutionListener@4d1c00d0, org.springframework.boot.test.autoconfigure.restdocs.RestDocsTestExecutionListener@4b2bac3f, org.springframework.boot.test.mock.mockito.MockitoTestExecutionListener@4e08711f]
22-Feb-2019 06:22:26 2019-02-22 06:22:26.387  INFO   --- [           main] .b.t.c.SpringBootTestContextBootstrapper : Neither @ContextConfiguration nor @ContextHierarchy found for test class [org.springframework.cloud.dataflow.acceptance.test.TickTockTests], using SpringBootContextLoader
22-Feb-2019 06:22:26 2019-02-22 06:22:26.396  INFO   --- [           main] .b.t.c.SpringBootTestContextBootstrapper : Loaded default TestExecutionListener class names from location [META-INF/spring.factories]: [org.springframework.boot.test.mock.mockito.MockitoTestExecutionListener, org.springframework.boot.test.mock.mockito.ResetMocksTestExecutionListener, org.springframework.boot.test.autoconfigure.restdocs.RestDocsTestExecutionListener, org.springframework.boot.test.autoconfigure.web.client.MockRestServiceServerResetTestExecutionListener, org.springframework.boot.test.autoconfigure.web.servlet.MockMvcPrintOnlyOnFailureTestExecutionListener, org.springframework.boot.test.autoconfigure.web.servlet.WebDriverTestExecutionListener, org.springframework.test.context.web.ServletTestExecutionListener, org.springframework.test.context.support.DirtiesContextBeforeModesTestExecutionListener, org.springframework.test.context.support.DependencyInjectionTestExecutionListener, org.springframework.test.context.support.DirtiesContextTestExecutionListener, org.springframework.test.context.transaction.TransactionalTestExecutionListener, org.springframework.test.context.jdbc.SqlScriptsTestExecutionListener]
22-Feb-2019 06:22:26 2019-02-22 06:22:26.400  INFO   --- [           main] .b.t.c.SpringBootTestContextBootstrapper : Using TestExecutionListeners: [org.springframework.test.context.web.ServletTestExecutionListener@67080771, org.springframework.test.context.support.DirtiesContextBeforeModesTestExecutionListener@72cde7cc, org.springframework.boot.test.autoconfigure.SpringBootDependencyInjectionTestExecutionListener@5fd4f8f5, org.springframework.test.context.support.DirtiesContextTestExecutionListener@696da30b, org.springframework.test.context.transaction.TransactionalTestExecutionListener@4e7912d8, org.springframework.test.context.jdbc.SqlScriptsTestExecutionListener@53976f5c, org.springframework.boot.test.autoconfigure.web.servlet.MockMvcPrintOnlyOnFailureTestExecutionListener@2bfc268b, org.springframework.boot.test.autoconfigure.web.client.MockRestServiceServerResetTestExecutionListener@2f8dad04, org.springframework.boot.test.mock.mockito.ResetMocksTestExecutionListener@29e495ff, org.springframework.boot.test.autoconfigure.web.servlet.WebDriverTestExecutionListener@41e1e210, org.springframework.boot.test.autoconfigure.restdocs.RestDocsTestExecutionListener@be35cd9, org.springframework.boot.test.mock.mockito.MockitoTestExecutionListener@4944252c]
22-Feb-2019 06:22:26 2019-02-22 06:22:26.401  INFO   --- [           main] .b.t.c.SpringBootTestContextBootstrapper : Neither @ContextConfiguration nor @ContextHierarchy found for test class [org.springframework.cloud.dataflow.acceptance.test.TransformTests], using SpringBootContextLoader
22-Feb-2019 06:22:26 2019-02-22 06:22:26.411  INFO   --- [           main] .b.t.c.SpringBootTestContextBootstrapper : Loaded default TestExecutionListener class names from location [META-INF/spring.factories]: [org.springframework.boot.test.mock.mockito.MockitoTestExecutionListener, org.springframework.boot.test.mock.mockito.ResetMocksTestExecutionListener, org.springframework.boot.test.autoconfigure.restdocs.RestDocsTestExecutionListener, org.springframework.boot.test.autoconfigure.web.client.MockRestServiceServerResetTestExecutionListener, org.springframework.boot.test.autoconfigure.web.servlet.MockMvcPrintOnlyOnFailureTestExecutionListener, org.springframework.boot.test.autoconfigure.web.servlet.WebDriverTestExecutionListener, org.springframework.test.context.web.ServletTestExecutionListener, org.springframework.test.context.support.DirtiesContextBeforeModesTestExecutionListener, org.springframework.test.context.support.DependencyInjectionTestExecutionListener, org.springframework.test.context.support.DirtiesContextTestExecutionListener, org.springframework.test.context.transaction.TransactionalTestExecutionListener, org.springframework.test.context.jdbc.SqlScriptsTestExecutionListener]
22-Feb-2019 06:22:26 2019-02-22 06:22:26.414  INFO   --- [           main] .b.t.c.SpringBootTestContextBootstrapper : Using TestExecutionListeners: [org.springframework.test.context.web.ServletTestExecutionListener@306e95ec, org.springframework.test.context.support.DirtiesContextBeforeModesTestExecutionListener@52af26ee, org.springframework.boot.test.autoconfigure.SpringBootDependencyInjectionTestExecutionListener@6fd83fc1, org.springframework.test.context.support.DirtiesContextTestExecutionListener@4f2b503c, org.springframework.test.context.transaction.TransactionalTestExecutionListener@bae7dc0, org.springframework.test.context.jdbc.SqlScriptsTestExecutionListener@209da20d, org.springframework.boot.test.autoconfigure.web.servlet.MockMvcPrintOnlyOnFailureTestExecutionListener@e15b7e8, org.springframework.boot.test.autoconfigure.web.client.MockRestServiceServerResetTestExecutionListener@1b2abca6, org.springframework.boot.test.mock.mockito.ResetMocksTestExecutionListener@6392827e, org.springframework.boot.test.autoconfigure.web.servlet.WebDriverTestExecutionListener@2ed2d9cb, org.springframework.boot.test.autoconfigure.restdocs.RestDocsTestExecutionListener@d5b810e, org.springframework.boot.test.mock.mockito.MockitoTestExecutionListener@43dac38f]
22-Feb-2019 06:22:26 2019-02-22 06:22:26.425  INFO   --- [           main] .b.t.c.SpringBootTestContextBootstrapper : Neither @ContextConfiguration nor @ContextHierarchy found for test class [org.springframework.cloud.dataflow.acceptance.test.NamedChannelTests], using SpringBootContextLoader
22-Feb-2019 06:22:26 2019-02-22 06:22:26.435  INFO   --- [           main] .b.t.c.SpringBootTestContextBootstrapper : Loaded default TestExecutionListener class names from location [META-INF/spring.factories]: [org.springframework.boot.test.mock.mockito.MockitoTestExecutionListener, org.springframework.boot.test.mock.mockito.ResetMocksTestExecutionListener, org.springframework.boot.test.autoconfigure.restdocs.RestDocsTestExecutionListener, org.springframework.boot.test.autoconfigure.web.client.MockRestServiceServerResetTestExecutionListener, org.springframework.boot.test.autoconfigure.web.servlet.MockMvcPrintOnlyOnFailureTestExecutionListener, org.springframework.boot.test.autoconfigure.web.servlet.WebDriverTestExecutionListener, org.springframework.test.context.web.ServletTestExecutionListener, org.springframework.test.context.support.DirtiesContextBeforeModesTestExecutionListener, org.springframework.test.context.support.DependencyInjectionTestExecutionListener, org.springframework.test.context.support.DirtiesContextTestExecutionListener, org.springframework.test.context.transaction.TransactionalTestExecutionListener, org.springframework.test.context.jdbc.SqlScriptsTestExecutionListener]
22-Feb-2019 06:22:26 2019-02-22 06:22:26.437  INFO   --- [           main] .b.t.c.SpringBootTestContextBootstrapper : Using TestExecutionListeners: [org.springframework.test.context.web.ServletTestExecutionListener@31ea9581, org.springframework.test.context.support.DirtiesContextBeforeModesTestExecutionListener@231f98ef, org.springframework.boot.test.autoconfigure.SpringBootDependencyInjectionTestExecutionListener@7c137fd5, org.springframework.test.context.support.DirtiesContextTestExecutionListener@183ec003, org.springframework.test.context.transaction.TransactionalTestExecutionListener@7d9d0818, org.springframework.test.context.jdbc.SqlScriptsTestExecutionListener@221a3fa4, org.springframework.boot.test.autoconfigure.web.servlet.MockMvcPrintOnlyOnFailureTestExecutionListener@451001e5, org.springframework.boot.test.autoconfigure.web.client.MockRestServiceServerResetTestExecutionListener@2b40ff9c, org.springframework.boot.test.mock.mockito.ResetMocksTestExecutionListener@3e08ff24, org.springframework.boot.test.autoconfigure.web.servlet.WebDriverTestExecutionListener@4d1c005e, org.springframework.boot.test.autoconfigure.restdocs.RestDocsTestExecutionListener@8462f31, org.springframework.boot.test.mock.mockito.MockitoTestExecutionListener@24569dba]
22-Feb-2019 06:22:26 Running org.springframework.cloud.dataflow.acceptance.test.AnalyticsTests
22-Feb-2019 06:22:26 2019-02-22 06:22:26.462  INFO   --- [           main] .b.t.c.SpringBootTestContextBootstrapper : Neither @ContextConfiguration nor @ContextHierarchy found for test class [org.springframework.cloud.dataflow.acceptance.test.AnalyticsTests], using SpringBootContextLoader
22-Feb-2019 06:22:26 2019-02-22 06:22:26.470  INFO   --- [           main] .b.t.c.SpringBootTestContextBootstrapper : Loaded default TestExecutionListener class names from location [META-INF/spring.factories]: [org.springframework.boot.test.mock.mockito.MockitoTestExecutionListener, org.springframework.boot.test.mock.mockito.ResetMocksTestExecutionListener, org.springframework.boot.test.autoconfigure.restdocs.RestDocsTestExecutionListener, org.springframework.boot.test.autoconfigure.web.client.MockRestServiceServerResetTestExecutionListener, org.springframework.boot.test.autoconfigure.web.servlet.MockMvcPrintOnlyOnFailureTestExecutionListener, org.springframework.boot.test.autoconfigure.web.servlet.WebDriverTestExecutionListener, org.springframework.test.context.web.ServletTestExecutionListener, org.springframework.test.context.support.DirtiesContextBeforeModesTestExecutionListener, org.springframework.test.context.support.DependencyInjectionTestExecutionListener, org.springframework.test.context.support.DirtiesContextTestExecutionListener, org.springframework.test.context.transaction.TransactionalTestExecutionListener, org.springframework.test.context.jdbc.SqlScriptsTestExecutionListener]
22-Feb-2019 06:22:26 2019-02-22 06:22:26.486  INFO   --- [           main] .b.t.c.SpringBootTestContextBootstrapper : Using TestExecutionListeners: [org.springframework.test.context.web.ServletTestExecutionListener@4b86805d, org.springframework.test.context.support.DirtiesContextBeforeModesTestExecutionListener@5852c06f, org.springframework.boot.test.autoconfigure.SpringBootDependencyInjectionTestExecutionListener@4149c063, org.springframework.test.context.support.DirtiesContextTestExecutionListener@9cb8225, org.springframework.test.context.transaction.TransactionalTestExecutionListener@76b07f29, org.springframework.test.context.jdbc.SqlScriptsTestExecutionListener@38af9828, org.springframework.boot.test.autoconfigure.web.servlet.MockMvcPrintOnlyOnFailureTestExecutionListener@376a0d86, org.springframework.boot.test.autoconfigure.web.client.MockRestServiceServerResetTestExecutionListener@62656be4, org.springframework.boot.test.mock.mockito.ResetMocksTestExecutionListener@17d919b6, org.springframework.boot.test.autoconfigure.web.servlet.WebDriverTestExecutionListener@53f3bdbd, org.springframework.boot.test.autoconfigure.restdocs.RestDocsTestExecutionListener@34129c78, org.springframework.boot.test.mock.mockito.MockitoTestExecutionListener@7d61eb55]
22-Feb-2019 06:22:27 2019-02-22 06:22:27.129  INFO 22325 --- [           main] s.c.a.AnnotationConfigApplicationContext : Refreshing org.springframework.context.annotation.AnnotationConfigApplicationContext@3228d990: startup date [Fri Feb 22 06:22:27 UTC 2019]; root of context hierarchy
22-Feb-2019 06:22:27 2019-02-22 06:22:27.452  INFO 22325 --- [           main] trationDelegate$BeanPostProcessorChecker : Bean 'configurationPropertiesRebinderAutoConfiguration' of type [class org.springframework.cloud.autoconfigure.ConfigurationPropertiesRebinderAutoConfiguration$$EnhancerBySpringCGLIB$$778358fe] is not eligible for getting processed by all BeanPostProcessors (for example: not eligible for auto-proxying)
22-Feb-2019 06:22:27
22-Feb-2019 06:22:27   .   ____          _            __ _ _
22-Feb-2019 06:22:27 /\\ / ___'_ __ _ _(_)_ __  __ _ \ \ \ \
22-Feb-2019 06:22:27 ( ( )\___ | '_ | '_| | '_ \/ _` | \ \ \ \
22-Feb-2019 06:22:27 \\/  ___)| |_)| | | | | || (_| |  ) ) ) )
22-Feb-2019 06:22:27   '  |____| .__|_| |_|_| |_\__, | / / / /
22-Feb-2019 06:22:27 =========|_|==============|___/=/_/_/_/
22-Feb-2019 06:22:27 :: Spring Boot ::        (v1.4.1.RELEASE)
22-Feb-2019 06:22:27
22-Feb-2019 06:22:27 2019-02-22 06:22:27.760  INFO 22325 --- [           main] c.c.c.ConfigServicePropertySourceLocator : Fetching config from server at: http://localhost:8888
22-Feb-2019 06:22:27 2019-02-22 06:22:27.848  WARN 22325 --- [           main] c.c.c.ConfigServicePropertySourceLocator : Could not locate PropertySource: I/O error on GET request for "http://localhost:8888//blah": Connection refused (Connection refused); nested exception is java.net.ConnectException: Connection refused (Connection refused)
22-Feb-2019 06:22:27 2019-02-22 06:22:27.857  INFO 22325 --- [           main] o.s.c.d.acceptance.test.AnalyticsTests   : The following profiles are active: blah
22-Feb-2019 06:22:28 2019-02-22 06:22:28.074  INFO 22325 --- [           main] o.s.c.d.acceptance.test.AnalyticsTests   : Started AnalyticsTests in 1.5 seconds (JVM running for 2.228)
22-Feb-2019 06:22:28 2019-02-22 06:22:28.365  INFO 22325 --- [           main] junit.logTestName                        : Starting Test analyticsTest(org.springframework.cloud.dataflow.acceptance.test.AnalyticsTests)
22-Feb-2019 06:22:28 2019-02-22 06:22:28.375  INFO 22325 --- [           main] o.s.c.d.acceptance.test.AnalyticsTests   : Importing stream apps from uri resource: http://repo.spring.io/libs-release/org/springframework/cloud/stream/app/spring-cloud-stream-app-descriptor/Celsius.SR3/spring-cloud-stream-app-descriptor-Celsius.SR3.stream-apps-kafka-10-maven
22-Feb-2019 06:22:29 2019-02-22 06:22:29.473  INFO 22325 --- [           main] o.s.c.d.acceptance.test.AnalyticsTests   : Creating stream 'httpCounter'
22-Feb-2019 06:22:29 2019-02-22 06:22:29.666  INFO 22325 --- [           main] o.s.c.d.acceptance.test.AnalyticsTests   : Deploying stream 'httpCounter' with properties: {app.*.logging.file=${PID}-test.log, app.*.endpoints.logfile.sensitive=false, app.*.management.endpoints.web.exposure.include=*}
22-Feb-2019 06:22:31 2019-02-22 06:22:31.144  INFO 22325 --- [           main] o.s.c.d.acceptance.test.AnalyticsTests   : Checking: Stream=httpCounter, status = deploying, status description = The stream is being deployed.
22-Feb-2019 06:22:31 2019-02-22 06:22:31.144  INFO 22325 --- [           main] o.s.c.d.acceptance.test.AnalyticsTests   : Sleeping to check status of Stream=httpCounter
22-Feb-2019 06:22:41 2019-02-22 06:22:41.212  INFO 22325 --- [           main] o.s.c.d.acceptance.test.AnalyticsTests   : Checking: Stream=httpCounter, status = deploying, status description = The stream is being deployed.
22-Feb-2019 06:22:41 2019-02-22 06:22:41.212  INFO 22325 --- [           main] o.s.c.d.acceptance.test.AnalyticsTests   : Sleeping to check status of Stream=httpCounter
22-Feb-2019 06:22:51 2019-02-22 06:22:51.308  INFO 22325 --- [           main] o.s.c.d.acceptance.test.AnalyticsTests   : Checking: Stream=httpCounter, status = deployed, status description = The stream has been successfully deployed
22-Feb-2019 06:22:51 2019-02-22 06:22:51.373  INFO 22325 --- [           main] o.s.c.d.acceptance.test.AnalyticsTests   : Sleeping to check status of Stream=httpCounter
22-Feb-2019 06:23:01 2019-02-22 06:23:01.374  INFO 22325 --- [           main] o.s.c.d.acceptance.test.AnalyticsTests   : Stream 'httpCounter' started with status: deployed
22-Feb-2019 06:23:01 2019-02-22 06:23:01.374  INFO 22325 --- [           main] o.s.c.d.acceptance.test.AnalyticsTests   : App 'http' has instances: {httpCounter.http-v1-0=http://10.194.6.14:51998}
22-Feb-2019 06:23:01 2019-02-22 06:23:01.374  INFO 22325 --- [           main] o.s.c.d.acceptance.test.AnalyticsTests   : App 'counter' has instances: {httpCounter.counter-v1-0=http://10.194.6.14:31348}
22-Feb-2019 06:23:01 2019-02-22 06:23:01.374  INFO 22325 --- [           main] o.s.c.d.acceptance.test.AnalyticsTests   : Looking for 'Started HttpSource' in logfile for http
22-Feb-2019 06:23:11 2019-02-22 06:23:11.375  INFO 22325 --- [           main] o.s.c.d.acceptance.test.AnalyticsTests   : Requesting log for app httpCounter.http-v1-0
22-Feb-2019 06:23:11 2019-02-22 06:23:11.555  INFO 22325 --- [           main] o.s.c.d.acceptance.test.AnalyticsTests   : Retrieved logfile from 'http://10.194.6.14:51998/logfile
22-Feb-2019 06:23:11 2019-02-22 06:23:11.559  INFO 22325 --- [           main] o.s.c.d.acceptance.test.AnalyticsTests   : Matched all 'Started HttpSource' in logfile for instance httpCounter.http-v1-0 of app http
22-Feb-2019 06:23:11 2019-02-22 06:23:11.560  INFO 22325 --- [           main] o.s.c.d.acceptance.test.AnalyticsTests   : Looking for 'Started CounterSink' in logfile for counter
22-Feb-2019 06:23:21 2019-02-22 06:23:21.560  INFO 22325 --- [           main] o.s.c.d.acceptance.test.AnalyticsTests   : Requesting log for app httpCounter.counter-v1-0
22-Feb-2019 06:23:21 2019-02-22 06:23:21.713  INFO 22325 --- [           main] o.s.c.d.acceptance.test.AnalyticsTests   : Retrieved logfile from 'http://10.194.6.14:31348/logfile
22-Feb-2019 06:23:21 2019-02-22 06:23:21.713  INFO 22325 --- [           main] o.s.c.d.acceptance.test.AnalyticsTests   : Matched all 'Started CounterSink' in logfile for instance httpCounter.counter-v1-0 of app counter
22-Feb-2019 06:23:31 2019-02-22 06:23:31.903 ERROR 22325 --- [           main] junit.logTestName                        : !!! Test analyticsTest(org.springframework.cloud.dataflow.acceptance.test.AnalyticsTests) Failed !!!
22-Feb-2019 06:23:31
22-Feb-2019 06:23:31 java.lang.NullPointerException: null
22-Feb-2019 06:23:31         at org.springframework.cloud.dataflow.acceptance.test.AnalyticsTests.analyticsTest(AnalyticsTests.java:62)
22-Feb-2019 06:23:31         at sun.reflect.NativeMethodAccessorImpl.invoke0(Native Method)
22-Feb-2019 06:23:31         at sun.reflect.NativeMethodAccessorImpl.invoke(NativeMethodAccessorImpl.java:62)
22-Feb-2019 06:23:31         at sun.reflect.DelegatingMethodAccessorImpl.invoke(DelegatingMethodAccessorImpl.java:43)
22-Feb-2019 06:23:31         at java.lang.reflect.Method.invoke(Method.java:498)
22-Feb-2019 06:23:31         at org.junit.runners.model.FrameworkMethod$1.runReflectiveCall(FrameworkMethod.java:50)
22-Feb-2019 06:23:31         at org.junit.internal.runners.model.ReflectiveCallable.run(ReflectiveCallable.java:12)
22-Feb-2019 06:23:31         at org.junit.runners.model.FrameworkMethod.invokeExplosively(FrameworkMethod.java:47)
22-Feb-2019 06:23:31         at org.junit.internal.runners.statements.InvokeMethod.evaluate(InvokeMethod.java:17)
22-Feb-2019 06:23:31         at org.junit.internal.runners.statements.RunBefores.evaluate(RunBefores.java:26)
22-Feb-2019 06:23:31         at org.springframework.test.context.junit4.statements.RunBeforeTestMethodCallbacks.evaluate(RunBeforeTestMethodCallbacks.java:75)
22-Feb-2019 06:23:31         at org.springframework.test.context.junit4.statements.RunAfterTestMethodCallbacks.evaluate(RunAfterTestMethodCallbacks.java:86)
22-Feb-2019 06:23:31         at org.springframework.cloud.stream.test.junit.AbstractExternalResourceTestSupport$1.evaluate(AbstractExternalResourceTestSupport.java:72)
22-Feb-2019 06:23:31         at org.junit.rules.TestWatcher$1.evaluate(TestWatcher.java:55)
22-Feb-2019 06:23:31         at org.junit.rules.ExternalResource$1.evaluate(ExternalResource.java:48)
22-Feb-2019 06:23:31         at org.junit.rules.RunRules.evaluate(RunRules.java:20)
22-Feb-2019 06:23:31         at org.springframework.test.context.junit4.statements.SpringRepeat.evaluate(SpringRepeat.java:84)
22-Feb-2019 06:23:31         at org.junit.runners.ParentRunner.runLeaf(ParentRunner.java:325)
22-Feb-2019 06:23:31         at org.springframework.test.context.junit4.SpringJUnit4ClassRunner.runChild(SpringJUnit4ClassRunner.java:252)
22-Feb-2019 06:23:31         at org.springframework.test.context.junit4.SpringJUnit4ClassRunner.runChild(SpringJUnit4ClassRunner.java:94)
22-Feb-2019 06:23:31         at org.junit.runners.ParentRunner$3.run(ParentRunner.java:290)
22-Feb-2019 06:23:31         at org.junit.runners.ParentRunner$1.schedule(ParentRunner.java:71)
22-Feb-2019 06:23:31         at org.junit.runners.ParentRunner.runChildren(ParentRunner.java:288)
22-Feb-2019 06:23:31         at org.junit.runners.ParentRunner.access$000(ParentRunner.java:58)
22-Feb-2019 06:23:31         at org.junit.runners.ParentRunner$2.evaluate(ParentRunner.java:268)
22-Feb-2019 06:23:31         at org.springframework.test.context.junit4.statements.RunBeforeTestClassCallbacks.evaluate(RunBeforeTestClassCallbacks.java:61)
22-Feb-2019 06:23:31         at org.springframework.test.context.junit4.statements.RunAfterTestClassCallbacks.evaluate(RunAfterTestClassCallbacks.java:70)
22-Feb-2019 06:23:31         at org.junit.runners.ParentRunner.run(ParentRunner.java:363)
22-Feb-2019 06:23:31         at org.springframework.test.context.junit4.SpringJUnit4ClassRunner.run(SpringJUnit4ClassRunner.java:191)
22-Feb-2019 06:23:31         at org.apache.maven.surefire.junit4.JUnit4Provider.execute(JUnit4Provider.java:283)
22-Feb-2019 06:23:31         at org.apache.maven.surefire.junit4.JUnit4Provider.executeWithRerun(JUnit4Provider.java:173)
22-Feb-2019 06:23:31         at org.apache.maven.surefire.junit4.JUnit4Provider.executeTestSet(JUnit4Provider.java:153)
22-Feb-2019 06:23:31         at org.apache.maven.surefire.junit4.JUnit4Provider.invoke(JUnit4Provider.java:128)
22-Feb-2019 06:23:31         at org.apache.maven.surefire.booter.ForkedBooter.invokeProviderInSameClassLoader(ForkedBooter.java:203)
22-Feb-2019 06:23:31         at org.apache.maven.surefire.booter.ForkedBooter.runSuitesInProcess(ForkedBooter.java:155)
22-Feb-2019 06:23:31         at org.apache.maven.surefire.booter.ForkedBooter.main(ForkedBooter.java:103)
22-Feb-2019 06:23:31
22-Feb-2019 06:23:31 2019-02-22 06:23:31.903  INFO 22325 --- [           main] junit.logTestName                        : Finished Test analyticsTest(org.springframework.cloud.dataflow.acceptance.test.AnalyticsTests)
22-Feb-2019 06:23:31 2019-02-22 06:23:31.904  INFO 22325 --- [           main] o.s.c.d.acceptance.test.AnalyticsTests   : Destroy all streams
22-Feb-2019 06:23:32 Tests run: 1, Failures: 0, Errors: 1, Skipped: 0, Time elapsed: 65.728 sec <<< FAILURE! - in org.springframework.cloud.dataflow.acceptance.test.AnalyticsTests
22-Feb-2019 06:23:32 analyticsTest(org.springframework.cloud.dataflow.acceptance.test.AnalyticsTests)  Time elapsed: 63.822 sec  <<< ERROR!
22-Feb-2019 06:23:32 java.lang.NullPointerException: null
22-Feb-2019 06:23:32         at org.springframework.cloud.dataflow.acceptance.test.AnalyticsTests.analyticsTest(AnalyticsTests.java:62)
22-Feb-2019 06:23:32
22-Feb-2019 06:23:32 Running org.springframework.cloud.dataflow.acceptance.test.WoodChuckTests
22-Feb-2019 06:23:32 2019-02-22 06:23:32.195  INFO 22325 --- [           main] .b.t.c.SpringBootTestContextBootstrapper : Neither @ContextConfiguration nor @ContextHierarchy found for test class [org.springframework.cloud.dataflow.acceptance.test.WoodChuckTests], using SpringBootContextLoader
22-Feb-2019 06:23:32 2019-02-22 06:23:32.211  INFO 22325 --- [           main] .b.t.c.SpringBootTestContextBootstrapper : Loaded default TestExecutionListener class names from location [META-INF/spring.factories]: [org.springframework.boot.test.mock.mockito.MockitoTestExecutionListener, org.springframework.boot.test.mock.mockito.ResetMocksTestExecutionListener, org.springframework.boot.test.autoconfigure.restdocs.RestDocsTestExecutionListener, org.springframework.boot.test.autoconfigure.web.client.MockRestServiceServerResetTestExecutionListener, org.springframework.boot.test.autoconfigure.web.servlet.MockMvcPrintOnlyOnFailureTestExecutionListener, org.springframework.boot.test.autoconfigure.web.servlet.WebDriverTestExecutionListener, org.springframework.test.context.web.ServletTestExecutionListener, org.springframework.test.context.support.DirtiesContextBeforeModesTestExecutionListener, org.springframework.test.context.support.DependencyInjectionTestExecutionListener, org.springframework.test.context.support.DirtiesContextTestExecutionListener, org.springframework.test.context.transaction.TransactionalTestExecutionListener, org.springframework.test.context.jdbc.SqlScriptsTestExecutionListener]
22-Feb-2019 06:23:32 2019-02-22 06:23:32.218  INFO 22325 --- [           main] .b.t.c.SpringBootTestContextBootstrapper : Using TestExecutionListeners: [org.springframework.test.context.web.ServletTestExecutionListener@6dcc40f5, org.springframework.test.context.support.DirtiesContextBeforeModesTestExecutionListener@2b680207, org.springframework.boot.test.autoconfigure.SpringBootDependencyInjectionTestExecutionListener@70887727, org.springframework.test.context.support.DirtiesContextTestExecutionListener@56da7487, org.springframework.test.context.transaction.TransactionalTestExecutionListener@599e4d41, org.springframework.test.context.jdbc.SqlScriptsTestExecutionListener@328d044f, org.springframework.boot.test.autoconfigure.web.servlet.MockMvcPrintOnlyOnFailureTestExecutionListener@10f7c76, org.springframework.boot.test.autoconfigure.web.client.MockRestServiceServerResetTestExecutionListener@4745e9c, org.springframework.boot.test.mock.mockito.ResetMocksTestExecutionListener@2f2bff16, org.springframework.boot.test.autoconfigure.web.servlet.WebDriverTestExecutionListener@75de29c0, org.springframework.boot.test.autoconfigure.restdocs.RestDocsTestExecutionListener@fc807c1, org.springframework.boot.test.mock.mockito.MockitoTestExecutionListener@296e281a]
22-Feb-2019 06:23:32 2019-02-22 06:23:32.317  INFO 22325 --- [           main] junit.logTestName                        : Starting Test testPartitioning(org.springframework.cloud.dataflow.acceptance.test.WoodChuckTests)
22-Feb-2019 06:23:32 2019-02-22 06:23:32.318  INFO 22325 --- [           main] o.s.c.d.acceptance.test.WoodChuckTests   : Creating stream 'WOODCHUCK-TEST'
22-Feb-2019 06:23:32 2019-02-22 06:23:32.353  INFO 22325 --- [           main] o.s.c.d.acceptance.test.WoodChuckTests   : Deploying stream 'WOODCHUCK-TEST' with properties: {app.log.logging.pattern.level=WOODCHUCK-${INSTANCE_INDEX:${CF_INSTANCE_INDEX:${spring.cloud.stream.instanceIndex:0}}} %5p, app.*.logging.file=${PID}-test.log, app.splitter.producer.partitionKeyExpression=payload, app.*.endpoints.logfile.sensitive=false, app.log.spring.cloud.stream.kafka.bindings.input.consumer.autoRebalanceEnabled=false, app.*.management.endpoints.web.exposure.include=*, deployer.log.count=2}
22-Feb-2019 06:23:33 2019-02-22 06:23:33.208  INFO 22325 --- [           main] o.s.c.d.acceptance.test.WoodChuckTests   : Checking: Stream=WOODCHUCK-TEST, status = deploying, status description = The stream is being deployed.
22-Feb-2019 06:23:33 2019-02-22 06:23:33.208  INFO 22325 --- [           main] o.s.c.d.acceptance.test.WoodChuckTests   : Sleeping to check status of Stream=WOODCHUCK-TEST
22-Feb-2019 06:23:43 2019-02-22 06:23:43.284  INFO 22325 --- [           main] o.s.c.d.acceptance.test.WoodChuckTests   : Checking: Stream=WOODCHUCK-TEST, status = deploying, status description = The stream is being deployed.
22-Feb-2019 06:23:43 2019-02-22 06:23:43.284  INFO 22325 --- [           main] o.s.c.d.acceptance.test.WoodChuckTests   : Sleeping to check status of Stream=WOODCHUCK-TEST
22-Feb-2019 06:23:53 2019-02-22 06:23:53.385  INFO 22325 --- [           main] o.s.c.d.acceptance.test.WoodChuckTests   : Checking: Stream=WOODCHUCK-TEST, status = deploying, status description = The stream is being deployed.
22-Feb-2019 06:23:53 2019-02-22 06:23:53.385  INFO 22325 --- [           main] o.s.c.d.acceptance.test.WoodChuckTests   : Sleeping to check status of Stream=WOODCHUCK-TEST
22-Feb-2019 06:24:03 2019-02-22 06:24:03.477  INFO 22325 --- [           main] o.s.c.d.acceptance.test.WoodChuckTests   : Checking: Stream=WOODCHUCK-TEST, status = deployed, status description = The stream has been successfully deployed
22-Feb-2019 06:24:03 2019-02-22 06:24:03.584  INFO 22325 --- [           main] o.s.c.d.acceptance.test.WoodChuckTests   : Sleeping to check status of Stream=WOODCHUCK-TEST
22-Feb-2019 06:24:13 2019-02-22 06:24:13.584  INFO 22325 --- [           main] o.s.c.d.acceptance.test.WoodChuckTests   : Stream 'WOODCHUCK-TEST' started with status: deployed
22-Feb-2019 06:24:13 2019-02-22 06:24:13.584  INFO 22325 --- [           main] o.s.c.d.acceptance.test.WoodChuckTests   : App 'log' has instances: {WOODCHUCK-TEST.log-v1-0=http://10.194.6.14:59647, WOODCHUCK-TEST.log-v1-1=http://10.194.6.14:58458}
22-Feb-2019 06:24:13 2019-02-22 06:24:13.584  INFO 22325 --- [           main] o.s.c.d.acceptance.test.WoodChuckTests   : App 'http' has instances: {WOODCHUCK-TEST.http-v1-0=http://10.194.6.14:36286}
22-Feb-2019 06:24:13 2019-02-22 06:24:13.584  INFO 22325 --- [           main] o.s.c.d.acceptance.test.WoodChuckTests   : App 'splitter' has instances: {WOODCHUCK-TEST.splitter-v1-0=http://10.194.6.14:32436}
22-Feb-2019 06:24:13 2019-02-22 06:24:13.585  INFO 22325 --- [           main] o.s.c.d.acceptance.test.WoodChuckTests   : Looking for 'Started HttpSource' in logfile for http
22-Feb-2019 06:24:23 2019-02-22 06:24:23.585  INFO 22325 --- [           main] o.s.c.d.acceptance.test.WoodChuckTests   : Requesting log for app WOODCHUCK-TEST.http-v1-0
22-Feb-2019 06:24:23 2019-02-22 06:24:23.751  INFO 22325 --- [           main] o.s.c.d.acceptance.test.WoodChuckTests   : Retrieved logfile from 'http://10.194.6.14:36286/logfile
22-Feb-2019 06:24:23 2019-02-22 06:24:23.751  INFO 22325 --- [           main] o.s.c.d.acceptance.test.WoodChuckTests   : Matched all 'Started HttpSource' in logfile for instance WOODCHUCK-TEST.http-v1-0 of app http
22-Feb-2019 06:24:23 2019-02-22 06:24:23.751  INFO 22325 --- [           main] o.s.c.d.acceptance.test.WoodChuckTests   : Looking for 'Started SplitterProcessor' in logfile for splitter
22-Feb-2019 06:24:33 2019-02-22 06:24:33.751  INFO 22325 --- [           main] o.s.c.d.acceptance.test.WoodChuckTests   : Requesting log for app WOODCHUCK-TEST.splitter-v1-0
22-Feb-2019 06:24:33 2019-02-22 06:24:33.898  INFO 22325 --- [           main] o.s.c.d.acceptance.test.WoodChuckTests   : Retrieved logfile from 'http://10.194.6.14:32436/logfile
22-Feb-2019 06:24:33 2019-02-22 06:24:33.898  INFO 22325 --- [           main] o.s.c.d.acceptance.test.WoodChuckTests   : Matched all 'Started SplitterProcessor' in logfile for instance WOODCHUCK-TEST.splitter-v1-0 of app splitter
22-Feb-2019 06:24:33 2019-02-22 06:24:33.898  INFO 22325 --- [           main] o.s.c.d.acceptance.test.WoodChuckTests   : Looking for 'Started LogSink' in logfile for log
22-Feb-2019 06:24:43 2019-02-22 06:24:43.899  INFO 22325 --- [           main] o.s.c.d.acceptance.test.WoodChuckTests   : Requesting log for app WOODCHUCK-TEST.log-v1-0
22-Feb-2019 06:24:44 2019-02-22 06:24:44.050  INFO 22325 --- [           main] o.s.c.d.acceptance.test.WoodChuckTests   : Retrieved logfile from 'http://10.194.6.14:59647/logfile
22-Feb-2019 06:24:44 2019-02-22 06:24:44.050  INFO 22325 --- [           main] o.s.c.d.acceptance.test.WoodChuckTests   : Matched all 'Started LogSink' in logfile for instance WOODCHUCK-TEST.log-v1-0 of app log
22-Feb-2019 06:24:44 2019-02-22 06:24:44.209  INFO 22325 --- [           main] o.s.c.d.acceptance.test.WoodChuckTests   : Looking for 'WOODCHUCK-0,How,chuck' in logfile for log
22-Feb-2019 06:24:54 2019-02-22 06:24:54.210  INFO 22325 --- [           main] o.s.c.d.acceptance.test.WoodChuckTests   : Requesting log for app WOODCHUCK-TEST.log-v1-0
22-Feb-2019 06:24:54 2019-02-22 06:24:54.226  INFO 22325 --- [           main] o.s.c.d.acceptance.test.WoodChuckTests   : Retrieved logfile from 'http://10.194.6.14:59647/logfile
22-Feb-2019 06:24:54 2019-02-22 06:24:54.227  INFO 22325 --- [           main] o.s.c.d.acceptance.test.WoodChuckTests   : Matched all 'WOODCHUCK-0,How,chuck' in logfile for instance WOODCHUCK-TEST.log-v1-0 of app log
22-Feb-2019 06:24:54 2019-02-22 06:24:54.227  INFO 22325 --- [           main] o.s.c.d.acceptance.test.WoodChuckTests   : Looking for 'WOODCHUCK-1,much,wood,would,if,a,woodchuck,could' in logfile for log
22-Feb-2019 06:25:04 2019-02-22 06:25:04.227  INFO 22325 --- [           main] o.s.c.d.acceptance.test.WoodChuckTests   : Requesting log for app WOODCHUCK-TEST.log-v1-0
22-Feb-2019 06:25:04 2019-02-22 06:25:04.241  INFO 22325 --- [           main] o.s.c.d.acceptance.test.WoodChuckTests   : Retrieved logfile from 'http://10.194.6.14:59647/logfile
22-Feb-2019 06:25:04 2019-02-22 06:25:04.241  INFO 22325 --- [           main] o.s.c.d.acceptance.test.WoodChuckTests   : Requesting log for app WOODCHUCK-TEST.log-v1-1
22-Feb-2019 06:25:04 2019-02-22 06:25:04.419  INFO 22325 --- [           main] o.s.c.d.acceptance.test.WoodChuckTests   : Retrieved logfile from 'http://10.194.6.14:58458/logfile
22-Feb-2019 06:25:04 2019-02-22 06:25:04.420  INFO 22325 --- [           main] o.s.c.d.acceptance.test.WoodChuckTests   : Matched all 'WOODCHUCK-1,much,wood,would,if,a,woodchuck,could' in logfile for instance WOODCHUCK-TEST.log-v1-1 of app log
22-Feb-2019 06:25:04 2019-02-22 06:25:04.422  INFO 22325 --- [           main] junit.logTestName                        : Test testPartitioning(org.springframework.cloud.dataflow.acceptance.test.WoodChuckTests) Succeeded
22-Feb-2019 06:25:04 2019-02-22 06:25:04.422  INFO 22325 --- [           main] junit.logTestName                        : Finished Test testPartitioning(org.springframework.cloud.dataflow.acceptance.test.WoodChuckTests)
22-Feb-2019 06:25:04 2019-02-22 06:25:04.422  INFO 22325 --- [           main] o.s.c.d.acceptance.test.WoodChuckTests   : Destroy all streams
22-Feb-2019 06:25:04 Tests run: 1, Failures: 0, Errors: 0, Skipped: 0, Time elapsed: 92.34 sec - in org.springframework.cloud.dataflow.acceptance.test.WoodChuckTests
22-Feb-2019 06:25:04 Running org.springframework.cloud.dataflow.acceptance.test.HttpSourceTests
22-Feb-2019 06:25:04 2019-02-22 06:25:04.628  INFO 22325 --- [           main] .b.t.c.SpringBootTestContextBootstrapper : Neither @ContextConfiguration nor @ContextHierarchy found for test class [org.springframework.cloud.dataflow.acceptance.test.HttpSourceTests], using SpringBootContextLoader
22-Feb-2019 06:25:04 2019-02-22 06:25:04.636  INFO 22325 --- [           main] .b.t.c.SpringBootTestContextBootstrapper : Loaded default TestExecutionListener class names from location [META-INF/spring.factories]: [org.springframework.boot.test.mock.mockito.MockitoTestExecutionListener, org.springframework.boot.test.mock.mockito.ResetMocksTestExecutionListener, org.springframework.boot.test.autoconfigure.restdocs.RestDocsTestExecutionListener, org.springframework.boot.test.autoconfigure.web.client.MockRestServiceServerResetTestExecutionListener, org.springframework.boot.test.autoconfigure.web.servlet.MockMvcPrintOnlyOnFailureTestExecutionListener, org.springframework.boot.test.autoconfigure.web.servlet.WebDriverTestExecutionListener, org.springframework.test.context.web.ServletTestExecutionListener, org.springframework.test.context.support.DirtiesContextBeforeModesTestExecutionListener, org.springframework.test.context.support.DependencyInjectionTestExecutionListener, org.springframework.test.context.support.DirtiesContextTestExecutionListener, org.springframework.test.context.transaction.TransactionalTestExecutionListener, org.springframework.test.context.jdbc.SqlScriptsTestExecutionListener]
22-Feb-2019 06:25:04 2019-02-22 06:25:04.638  INFO 22325 --- [           main] .b.t.c.SpringBootTestContextBootstrapper : Using TestExecutionListeners: [org.springframework.test.context.web.ServletTestExecutionListener@7e53339, org.springframework.test.context.support.DirtiesContextBeforeModesTestExecutionListener@58fef7f7, org.springframework.boot.test.autoconfigure.SpringBootDependencyInjectionTestExecutionListener@31ddb930, org.springframework.test.context.support.DirtiesContextTestExecutionListener@12eedfee, org.springframework.test.context.transaction.TransactionalTestExecutionListener@3c3c4a71, org.springframework.test.context.jdbc.SqlScriptsTestExecutionListener@1352434e, org.springframework.boot.test.autoconfigure.web.servlet.MockMvcPrintOnlyOnFailureTestExecutionListener@4f9a6c2d, org.springframework.boot.test.autoconfigure.web.client.MockRestServiceServerResetTestExecutionListener@2b6fcb9f, org.springframework.boot.test.mock.mockito.ResetMocksTestExecutionListener@75de6341, org.springframework.boot.test.autoconfigure.web.servlet.WebDriverTestExecutionListener@74170687, org.springframework.boot.test.autoconfigure.restdocs.RestDocsTestExecutionListener@68f0f72c, org.springframework.boot.test.mock.mockito.MockitoTestExecutionListener@3d96fa9e]
22-Feb-2019 06:25:04 2019-02-22 06:25:04.715  INFO 22325 --- [           main] junit.logTestName                        : Starting Test httpSourceTests(org.springframework.cloud.dataflow.acceptance.test.HttpSourceTests)
22-Feb-2019 06:25:04 2019-02-22 06:25:04.717  INFO 22325 --- [           main] o.s.c.d.acceptance.test.HttpSourceTests  : Creating stream 'HTTP-TEST'
22-Feb-2019 06:25:04 2019-02-22 06:25:04.740  INFO 22325 --- [           main] o.s.c.d.acceptance.test.HttpSourceTests  : Deploying stream 'HTTP-TEST' with properties: {app.*.logging.file=${PID}-test.log, app.*.endpoints.logfile.sensitive=false, app.*.management.endpoints.web.exposure.include=*}
22-Feb-2019 06:25:05 2019-02-22 06:25:05.519  INFO 22325 --- [           main] o.s.c.d.acceptance.test.HttpSourceTests  : Checking: Stream=HTTP-TEST, status = deploying, status description = The stream is being deployed.
22-Feb-2019 06:25:05 2019-02-22 06:25:05.519  INFO 22325 --- [           main] o.s.c.d.acceptance.test.HttpSourceTests  : Sleeping to check status of Stream=HTTP-TEST
22-Feb-2019 06:25:15 2019-02-22 06:25:15.581  INFO 22325 --- [           main] o.s.c.d.acceptance.test.HttpSourceTests  : Checking: Stream=HTTP-TEST, status = deploying, status description = The stream is being deployed.
22-Feb-2019 06:25:15 2019-02-22 06:25:15.582  INFO 22325 --- [           main] o.s.c.d.acceptance.test.HttpSourceTests  : Sleeping to check status of Stream=HTTP-TEST
22-Feb-2019 06:25:25 2019-02-22 06:25:25.623  INFO 22325 --- [           main] o.s.c.d.acceptance.test.HttpSourceTests  : Checking: Stream=HTTP-TEST, status = deployed, status description = The stream has been successfully deployed
22-Feb-2019 06:25:25 2019-02-22 06:25:25.693  INFO 22325 --- [           main] o.s.c.d.acceptance.test.HttpSourceTests  : Sleeping to check status of Stream=HTTP-TEST
22-Feb-2019 06:25:35 2019-02-22 06:25:35.694  INFO 22325 --- [           main] o.s.c.d.acceptance.test.HttpSourceTests  : Stream 'HTTP-TEST' started with status: deployed
22-Feb-2019 06:25:35 2019-02-22 06:25:35.695  INFO 22325 --- [           main] o.s.c.d.acceptance.test.HttpSourceTests  : App 'log' has instances: {HTTP-TEST.log-v1-0=http://10.194.6.14:20921}
22-Feb-2019 06:25:35 2019-02-22 06:25:35.695  INFO 22325 --- [           main] o.s.c.d.acceptance.test.HttpSourceTests  : App 'http' has instances: {HTTP-TEST.http-v1-0=http://10.194.6.14:26056}
22-Feb-2019 06:25:35 2019-02-22 06:25:35.700  INFO 22325 --- [           main] o.s.c.d.acceptance.test.HttpSourceTests  : Looking for 'Started HttpSource' in logfile for http
22-Feb-2019 06:25:45 2019-02-22 06:25:45.701  INFO 22325 --- [           main] o.s.c.d.acceptance.test.HttpSourceTests  : Requesting log for app HTTP-TEST.http-v1-0
22-Feb-2019 06:25:45 2019-02-22 06:25:45.879  INFO 22325 --- [           main] o.s.c.d.acceptance.test.HttpSourceTests  : Retrieved logfile from 'http://10.194.6.14:26056/logfile
22-Feb-2019 06:25:45 2019-02-22 06:25:45.879  INFO 22325 --- [           main] o.s.c.d.acceptance.test.HttpSourceTests  : Matched all 'Started HttpSource' in logfile for instance HTTP-TEST.http-v1-0 of app http
22-Feb-2019 06:25:45 2019-02-22 06:25:45.879  INFO 22325 --- [           main] o.s.c.d.acceptance.test.HttpSourceTests  : Looking for 'Started LogSink' in logfile for log
22-Feb-2019 06:25:55 2019-02-22 06:25:55.880  INFO 22325 --- [           main] o.s.c.d.acceptance.test.HttpSourceTests  : Requesting log for app HTTP-TEST.log-v1-0
22-Feb-2019 06:25:56 2019-02-22 06:25:56.018  INFO 22325 --- [           main] o.s.c.d.acceptance.test.HttpSourceTests  : Retrieved logfile from 'http://10.194.6.14:20921/logfile
22-Feb-2019 06:25:56 2019-02-22 06:25:56.018  INFO 22325 --- [           main] o.s.c.d.acceptance.test.HttpSourceTests  : Matched all 'Started LogSink' in logfile for instance HTTP-TEST.log-v1-0 of app log
22-Feb-2019 06:25:56 2019-02-22 06:25:56.166  INFO 22325 --- [           main] o.s.c.d.acceptance.test.HttpSourceTests  : Looking for '13a12f6f-53ad-4283-82d1-b60a9fcb6991' in logfile for log
22-Feb-2019 06:26:06 2019-02-22 06:26:06.166  INFO 22325 --- [           main] o.s.c.d.acceptance.test.HttpSourceTests  : Requesting log for app HTTP-TEST.log-v1-0
22-Feb-2019 06:26:06 2019-02-22 06:26:06.179  INFO 22325 --- [           main] o.s.c.d.acceptance.test.HttpSourceTests  : Retrieved logfile from 'http://10.194.6.14:20921/logfile
22-Feb-2019 06:26:06 2019-02-22 06:26:06.179  INFO 22325 --- [           main] o.s.c.d.acceptance.test.HttpSourceTests  : Matched all '13a12f6f-53ad-4283-82d1-b60a9fcb6991' in logfile for instance HTTP-TEST.log-v1-0 of app log
22-Feb-2019 06:26:06 2019-02-22 06:26:06.181  INFO 22325 --- [           main] junit.logTestName                        : Test httpSourceTests(org.springframework.cloud.dataflow.acceptance.test.HttpSourceTests) Succeeded
22-Feb-2019 06:26:06 2019-02-22 06:26:06.181  INFO 22325 --- [           main] junit.logTestName                        : Finished Test httpSourceTests(org.springframework.cloud.dataflow.acceptance.test.HttpSourceTests)
22-Feb-2019 06:26:06 2019-02-22 06:26:06.181  INFO 22325 --- [           main] o.s.c.d.acceptance.test.HttpSourceTests  : Destroy all streams
22-Feb-2019 06:26:06 Tests run: 1, Failures: 0, Errors: 0, Skipped: 0, Time elapsed: 61.697 sec - in org.springframework.cloud.dataflow.acceptance.test.HttpSourceTests
22-Feb-2019 06:26:06 Running org.springframework.cloud.dataflow.acceptance.test.TimestampTaskTests
22-Feb-2019 06:26:06 2019-02-22 06:26:06.322  INFO 22325 --- [           main] o.s.c.support.GenericApplicationContext  : Refreshing org.springframework.context.support.GenericApplicationContext@2f4e40d7: startup date [Fri Feb 22 06:26:06 UTC 2019]; root of context hierarchy
22-Feb-2019 06:26:06 2019-02-22 06:26:06.438  INFO 22325 --- [           main] junit.logTestName                        : Starting Test timeStampTests(org.springframework.cloud.dataflow.acceptance.test.TimestampTaskTests)
22-Feb-2019 06:26:06 2019-02-22 06:26:06.439  INFO 22325 --- [           main] o.s.c.d.a.test.AbstractTaskTests         : Importing task apps from uri resource: http://repo.spring.io/libs-release/org/springframework/cloud/task/app/spring-cloud-task-app-descriptor/Clark.RELEASE/spring-cloud-task-app-descriptor-Clark.RELEASE.task-apps-maven
22-Feb-2019 06:26:06 2019-02-22 06:26:06.595  INFO 22325 --- [           main] o.s.c.d.a.test.AbstractTaskTests         : Done importing task apps.
22-Feb-2019 06:26:16 2019-02-22 06:26:16.958  INFO 22325 --- [           main] junit.logTestName                        : Test timeStampTests(org.springframework.cloud.dataflow.acceptance.test.TimestampTaskTests) Succeeded
22-Feb-2019 06:26:16 2019-02-22 06:26:16.958  INFO 22325 --- [           main] junit.logTestName                        : Finished Test timeStampTests(org.springframework.cloud.dataflow.acceptance.test.TimestampTaskTests)
22-Feb-2019 06:26:17 2019-02-22 06:26:17.018  INFO 22325 --- [           main] junit.logTestName                        : Starting Test timeStampTestsMultipleLaunch(org.springframework.cloud.dataflow.acceptance.test.TimestampTaskTests)
22-Feb-2019 06:26:37 2019-02-22 06:26:37.393  INFO 22325 --- [           main] junit.logTestName                        : Test timeStampTestsMultipleLaunch(org.springframework.cloud.dataflow.acceptance.test.TimestampTaskTests) Succeeded
22-Feb-2019 06:26:37 2019-02-22 06:26:37.394  INFO 22325 --- [           main] junit.logTestName                        : Finished Test timeStampTestsMultipleLaunch(org.springframework.cloud.dataflow.acceptance.test.TimestampTaskTests)
22-Feb-2019 06:26:37 Tests run: 2, Failures: 0, Errors: 0, Skipped: 0, Time elapsed: 31.071 sec - in org.springframework.cloud.dataflow.acceptance.test.TimestampTaskTests
22-Feb-2019 06:26:37 Running org.springframework.cloud.dataflow.acceptance.test.TickTockTests
22-Feb-2019 06:26:37 2019-02-22 06:26:37.394  INFO 22325 --- [           main] .b.t.c.SpringBootTestContextBootstrapper : Neither @ContextConfiguration nor @ContextHierarchy found for test class [org.springframework.cloud.dataflow.acceptance.test.TickTockTests], using SpringBootContextLoader
22-Feb-2019 06:26:37 2019-02-22 06:26:37.400  INFO 22325 --- [           main] .b.t.c.SpringBootTestContextBootstrapper : Loaded default TestExecutionListener class names from location [META-INF/spring.factories]: [org.springframework.boot.test.mock.mockito.MockitoTestExecutionListener, org.springframework.boot.test.mock.mockito.ResetMocksTestExecutionListener, org.springframework.boot.test.autoconfigure.restdocs.RestDocsTestExecutionListener, org.springframework.boot.test.autoconfigure.web.client.MockRestServiceServerResetTestExecutionListener, org.springframework.boot.test.autoconfigure.web.servlet.MockMvcPrintOnlyOnFailureTestExecutionListener, org.springframework.boot.test.autoconfigure.web.servlet.WebDriverTestExecutionListener, org.springframework.test.context.web.ServletTestExecutionListener, org.springframework.test.context.support.DirtiesContextBeforeModesTestExecutionListener, org.springframework.test.context.support.DependencyInjectionTestExecutionListener, org.springframework.test.context.support.DirtiesContextTestExecutionListener, org.springframework.test.context.transaction.TransactionalTestExecutionListener, org.springframework.test.context.jdbc.SqlScriptsTestExecutionListener]
22-Feb-2019 06:26:37 2019-02-22 06:26:37.402  INFO 22325 --- [           main] .b.t.c.SpringBootTestContextBootstrapper : Using TestExecutionListeners: [org.springframework.test.context.web.ServletTestExecutionListener@24a86066, org.springframework.test.context.support.DirtiesContextBeforeModesTestExecutionListener@54402c04, org.springframework.boot.test.autoconfigure.SpringBootDependencyInjectionTestExecutionListener@5b3bb1f7, org.springframework.test.context.support.DirtiesContextTestExecutionListener@58d6b7b9, org.springframework.test.context.transaction.TransactionalTestExecutionListener@3f1a4795, org.springframework.test.context.jdbc.SqlScriptsTestExecutionListener@6a6f6c7e, org.springframework.boot.test.autoconfigure.web.servlet.MockMvcPrintOnlyOnFailureTestExecutionListener@6c5ddccd, org.springframework.boot.test.autoconfigure.web.client.MockRestServiceServerResetTestExecutionListener@1dbd580, org.springframework.boot.test.mock.mockito.ResetMocksTestExecutionListener@6c101cc1, org.springframework.boot.test.autoconfigure.web.servlet.WebDriverTestExecutionListener@7d0d91a1, org.springframework.boot.test.autoconfigure.restdocs.RestDocsTestExecutionListener@7fb48179, org.springframework.boot.test.mock.mockito.MockitoTestExecutionListener@201c3cda]
22-Feb-2019 06:26:37 2019-02-22 06:26:37.454  INFO 22325 --- [           main] junit.logTestName                        : Starting Test tickTockUpdateRollbackTests(org.springframework.cloud.dataflow.acceptance.test.TickTockTests)
22-Feb-2019 06:26:37 2019-02-22 06:26:37.472  INFO 22325 --- [           main] o.s.c.d.acceptance.test.TickTockTests    : Creating stream 'TICKTOCK'
22-Feb-2019 06:26:37 2019-02-22 06:26:37.491  INFO 22325 --- [           main] o.s.c.d.acceptance.test.TickTockTests    : Deploying stream 'TICKTOCK' with properties: {app.*.logging.file=${PID}-test.log, app.*.endpoints.logfile.sensitive=false, app.log.log.expression='TICKTOCK - TIMESTAMP: '.concat(payload), app.*.management.endpoints.web.exposure.include=*}
22-Feb-2019 06:26:38 2019-02-22 06:26:38.022  INFO 22325 --- [           main] o.s.c.d.acceptance.test.TickTockTests    : Checking: Stream=TICKTOCK, status = deploying, status description = The stream is being deployed.
22-Feb-2019 06:26:38 2019-02-22 06:26:38.022  INFO 22325 --- [           main] o.s.c.d.acceptance.test.TickTockTests    : Sleeping to check status of Stream=TICKTOCK
22-Feb-2019 06:26:48 2019-02-22 06:26:48.068  INFO 22325 --- [           main] o.s.c.d.acceptance.test.TickTockTests    : Checking: Stream=TICKTOCK, status = deploying, status description = The stream is being deployed.
22-Feb-2019 06:26:48 2019-02-22 06:26:48.068  INFO 22325 --- [           main] o.s.c.d.acceptance.test.TickTockTests    : Sleeping to check status of Stream=TICKTOCK
22-Feb-2019 06:26:58 2019-02-22 06:26:58.106  INFO 22325 --- [           main] o.s.c.d.acceptance.test.TickTockTests    : Checking: Stream=TICKTOCK, status = deployed, status description = The stream has been successfully deployed
22-Feb-2019 06:26:58 2019-02-22 06:26:58.144  INFO 22325 --- [           main] o.s.c.d.acceptance.test.TickTockTests    : Sleeping to check status of Stream=TICKTOCK
22-Feb-2019 06:27:08 2019-02-22 06:27:08.144  INFO 22325 --- [           main] o.s.c.d.acceptance.test.TickTockTests    : Stream 'TICKTOCK' started with status: deployed
22-Feb-2019 06:27:08 2019-02-22 06:27:08.145  INFO 22325 --- [           main] o.s.c.d.acceptance.test.TickTockTests    : App 'log' has instances: {TICKTOCK.log-v1-0=http://10.194.6.14:35808}
22-Feb-2019 06:27:08 2019-02-22 06:27:08.145  INFO 22325 --- [           main] o.s.c.d.acceptance.test.TickTockTests    : App 'time' has instances: {TICKTOCK.time-v1-0=http://10.194.6.14:25165}
22-Feb-2019 06:27:08 2019-02-22 06:27:08.145  INFO 22325 --- [           main] o.s.c.d.acceptance.test.TickTockTests    : Looking for 'Started TimeSource' in logfile for time
22-Feb-2019 06:27:18 2019-02-22 06:27:18.145  INFO 22325 --- [           main] o.s.c.d.acceptance.test.TickTockTests    : Requesting log for app TICKTOCK.time-v1-0
22-Feb-2019 06:27:18 2019-02-22 06:27:18.311  INFO 22325 --- [           main] o.s.c.d.acceptance.test.TickTockTests    : Retrieved logfile from 'http://10.194.6.14:25165/logfile
22-Feb-2019 06:27:18 2019-02-22 06:27:18.312  INFO 22325 --- [           main] o.s.c.d.acceptance.test.TickTockTests    : Matched all 'Started TimeSource' in logfile for instance TICKTOCK.time-v1-0 of app time
22-Feb-2019 06:27:18 2019-02-22 06:27:18.312  INFO 22325 --- [           main] o.s.c.d.acceptance.test.TickTockTests    : Looking for 'Started LogSink' in logfile for log
22-Feb-2019 06:27:28 2019-02-22 06:27:28.312  INFO 22325 --- [           main] o.s.c.d.acceptance.test.TickTockTests    : Requesting log for app TICKTOCK.log-v1-0
22-Feb-2019 06:27:28 2019-02-22 06:27:28.455  INFO 22325 --- [           main] o.s.c.d.acceptance.test.TickTockTests    : Retrieved logfile from 'http://10.194.6.14:35808/logfile
22-Feb-2019 06:27:28 2019-02-22 06:27:28.455  INFO 22325 --- [           main] o.s.c.d.acceptance.test.TickTockTests    : Matched all 'Started LogSink' in logfile for instance TICKTOCK.log-v1-0 of app log
22-Feb-2019 06:27:28 2019-02-22 06:27:28.455  INFO 22325 --- [           main] o.s.c.d.acceptance.test.TickTockTests    : Looking for 'TICKTOCK - TIMESTAMP:' in logfile for log
22-Feb-2019 06:27:38 2019-02-22 06:27:38.455  INFO 22325 --- [           main] o.s.c.d.acceptance.test.TickTockTests    : Requesting log for app TICKTOCK.log-v1-0
22-Feb-2019 06:27:38 2019-02-22 06:27:38.473  INFO 22325 --- [           main] o.s.c.d.acceptance.test.TickTockTests    : Retrieved logfile from 'http://10.194.6.14:35808/logfile
22-Feb-2019 06:27:38 2019-02-22 06:27:38.473  INFO 22325 --- [           main] o.s.c.d.acceptance.test.TickTockTests    : Matched all 'TICKTOCK - TIMESTAMP:' in logfile for instance TICKTOCK.log-v1-0 of app log
22-Feb-2019 06:27:38 2019-02-22 06:27:38.474  INFO 22325 --- [           main] o.s.c.d.acceptance.test.TickTockTests    : Updating stream 'TICKTOCK'
22-Feb-2019 06:27:38 2019-02-22 06:27:38.931  INFO 22325 --- [           main] o.s.c.d.acceptance.test.TickTockTests    : Checking: Stream=TICKTOCK, status = deploying, status description = The stream is being deployed.
22-Feb-2019 06:27:38 2019-02-22 06:27:38.932  INFO 22325 --- [           main] o.s.c.d.acceptance.test.TickTockTests    : Sleeping to check status of Stream=TICKTOCK
22-Feb-2019 06:27:48 2019-02-22 06:27:48.970  INFO 22325 --- [           main] o.s.c.d.acceptance.test.TickTockTests    : Checking: Stream=TICKTOCK, status = deployed, status description = The stream has been successfully deployed
22-Feb-2019 06:27:49 2019-02-22 06:27:49.001  INFO 22325 --- [           main] o.s.c.d.acceptance.test.TickTockTests    : Sleeping to check status of Stream=TICKTOCK
22-Feb-2019 06:27:59 2019-02-22 06:27:59.001  INFO 22325 --- [           main] o.s.c.d.acceptance.test.TickTockTests    : Stream 'TICKTOCK' started with status: deployed
22-Feb-2019 06:27:59 2019-02-22 06:27:59.002  INFO 22325 --- [           main] o.s.c.d.acceptance.test.TickTockTests    : App 'log' has instances: {TICKTOCK.log-v1-0=http://10.194.6.14:35808, TICKTOCK.log-v2-0=http://10.194.6.14:44565}
22-Feb-2019 06:27:59 2019-02-22 06:27:59.002  INFO 22325 --- [           main] o.s.c.d.acceptance.test.TickTockTests    : App 'time' has instances: {TICKTOCK.time-v1-0=http://10.194.6.14:25165}
22-Feb-2019 06:27:59 2019-02-22 06:27:59.002  INFO 22325 --- [           main] o.s.c.d.acceptance.test.TickTockTests    : Looking for 'Started LogSink' in logfile for log
22-Feb-2019 06:28:09 2019-02-22 06:28:09.002  INFO 22325 --- [           main] o.s.c.d.acceptance.test.TickTockTests    : Requesting log for app TICKTOCK.log-v1-0
22-Feb-2019 06:28:09 2019-02-22 06:28:09.003  WARN 22325 --- [           main] o.s.c.d.acceptance.test.TickTockTests    : Error while trying to access logfile from 'http://10.194.6.14:35808/logfile' due to : org.springframework.web.client.ResourceAccessException: I/O error on GET request for "http://10.194.6.14:35808/logfile": Connection refused (Connection refused); nested exception is java.net.ConnectException: Connection refused (Connection refused)
22-Feb-2019 06:28:09 2019-02-22 06:28:09.004  INFO 22325 --- [           main] o.s.c.d.acceptance.test.TickTockTests    : Polling to get log file. Remaining poll time = 169 seconds.
22-Feb-2019 06:28:09 2019-02-22 06:28:09.004  INFO 22325 --- [           main] o.s.c.d.acceptance.test.TickTockTests    : Requesting log for app TICKTOCK.log-v2-0
22-Feb-2019 06:28:09 2019-02-22 06:28:09.160  INFO 22325 --- [           main] o.s.c.d.acceptance.test.TickTockTests    : Retrieved logfile from 'http://10.194.6.14:44565/logfile
22-Feb-2019 06:28:09 2019-02-22 06:28:09.160  INFO 22325 --- [           main] o.s.c.d.acceptance.test.TickTockTests    : Matched all 'Started LogSink' in logfile for instance TICKTOCK.log-v2-0 of app log
22-Feb-2019 06:28:09 2019-02-22 06:28:09.161  INFO 22325 --- [           main] o.s.c.d.acceptance.test.TickTockTests    : Looking for 'TICKTOCK Updated - TIMESTAMP:' in logfile for log
22-Feb-2019 06:28:19 2019-02-22 06:28:19.161  INFO 22325 --- [           main] o.s.c.d.acceptance.test.TickTockTests    : Requesting log for app TICKTOCK.log-v1-0
22-Feb-2019 06:28:19 2019-02-22 06:28:19.162  WARN 22325 --- [           main] o.s.c.d.acceptance.test.TickTockTests    : Error while trying to access logfile from 'http://10.194.6.14:35808/logfile' due to : org.springframework.web.client.ResourceAccessException: I/O error on GET request for "http://10.194.6.14:35808/logfile": Connection refused (Connection refused); nested exception is java.net.ConnectException: Connection refused (Connection refused)
22-Feb-2019 06:28:19 2019-02-22 06:28:19.162  INFO 22325 --- [           main] o.s.c.d.acceptance.test.TickTockTests    : Polling to get log file. Remaining poll time = 169 seconds.
22-Feb-2019 06:28:19 2019-02-22 06:28:19.162  INFO 22325 --- [           main] o.s.c.d.acceptance.test.TickTockTests    : Requesting log for app TICKTOCK.log-v2-0
22-Feb-2019 06:28:19 2019-02-22 06:28:19.174  INFO 22325 --- [           main] o.s.c.d.acceptance.test.TickTockTests    : Retrieved logfile from 'http://10.194.6.14:44565/logfile
22-Feb-2019 06:28:19 2019-02-22 06:28:19.175  INFO 22325 --- [           main] o.s.c.d.acceptance.test.TickTockTests    : Matched all 'TICKTOCK Updated - TIMESTAMP:' in logfile for instance TICKTOCK.log-v2-0 of app log
22-Feb-2019 06:28:19 2019-02-22 06:28:19.175  INFO 22325 --- [           main] o.s.c.d.acceptance.test.TickTockTests    : Rolling back the stream 'TICKTOCK' to the version 0
22-Feb-2019 06:28:19 2019-02-22 06:28:19.528  INFO 22325 --- [           main] o.s.c.d.acceptance.test.TickTockTests    : Checking: Stream=TICKTOCK, status = deploying, status description = The stream is being deployed.
22-Feb-2019 06:28:19 2019-02-22 06:28:19.528  INFO 22325 --- [           main] o.s.c.d.acceptance.test.TickTockTests    : Sleeping to check status of Stream=TICKTOCK
22-Feb-2019 06:28:29 2019-02-22 06:28:29.562  INFO 22325 --- [           main] o.s.c.d.acceptance.test.TickTockTests    : Checking: Stream=TICKTOCK, status = deployed, status description = The stream has been successfully deployed
22-Feb-2019 06:28:29 2019-02-22 06:28:29.592  INFO 22325 --- [           main] o.s.c.d.acceptance.test.TickTockTests    : Sleeping to check status of Stream=TICKTOCK
22-Feb-2019 06:28:39 2019-02-22 06:28:39.592  INFO 22325 --- [           main] o.s.c.d.acceptance.test.TickTockTests    : Stream 'TICKTOCK' started with status: deployed
22-Feb-2019 06:28:39 2019-02-22 06:28:39.593  INFO 22325 --- [           main] o.s.c.d.acceptance.test.TickTockTests    : App 'log' has instances: {TICKTOCK.log-v1-0=http://10.194.6.14:35808, TICKTOCK.log-v3-0=http://10.194.6.14:35229, TICKTOCK.log-v2-0=http://10.194.6.14:44565}
22-Feb-2019 06:28:39 2019-02-22 06:28:39.593  INFO 22325 --- [           main] o.s.c.d.acceptance.test.TickTockTests    : App 'time' has instances: {TICKTOCK.time-v1-0=http://10.194.6.14:25165}
22-Feb-2019 06:28:39 2019-02-22 06:28:39.593  INFO 22325 --- [           main] o.s.c.d.acceptance.test.TickTockTests    : Looking for 'TICKTOCK - TIMESTAMP:' in logfile for log
22-Feb-2019 06:28:49 2019-02-22 06:28:49.593  INFO 22325 --- [           main] o.s.c.d.acceptance.test.TickTockTests    : Requesting log for app TICKTOCK.log-v1-0
22-Feb-2019 06:28:49 2019-02-22 06:28:49.595  WARN 22325 --- [           main] o.s.c.d.acceptance.test.TickTockTests    : Error while trying to access logfile from 'http://10.194.6.14:35808/logfile' due to : org.springframework.web.client.ResourceAccessException: I/O error on GET request for "http://10.194.6.14:35808/logfile": Connection refused (Connection refused); nested exception is java.net.ConnectException: Connection refused (Connection refused)
22-Feb-2019 06:28:49 2019-02-22 06:28:49.595  INFO 22325 --- [           main] o.s.c.d.acceptance.test.TickTockTests    : Polling to get log file. Remaining poll time = 169 seconds.
22-Feb-2019 06:28:49 2019-02-22 06:28:49.595  INFO 22325 --- [           main] o.s.c.d.acceptance.test.TickTockTests    : Requesting log for app TICKTOCK.log-v3-0
22-Feb-2019 06:28:49 2019-02-22 06:28:49.744  INFO 22325 --- [           main] o.s.c.d.acceptance.test.TickTockTests    : Retrieved logfile from 'http://10.194.6.14:35229/logfile
22-Feb-2019 06:28:49 2019-02-22 06:28:49.745  INFO 22325 --- [           main] o.s.c.d.acceptance.test.TickTockTests    : Matched all 'TICKTOCK - TIMESTAMP:' in logfile for instance TICKTOCK.log-v3-0 of app log
22-Feb-2019 06:28:49 2019-02-22 06:28:49.746  INFO 22325 --- [           main] junit.logTestName                        : Test tickTockUpdateRollbackTests(org.springframework.cloud.dataflow.acceptance.test.TickTockTests) Succeeded
22-Feb-2019 06:28:49 2019-02-22 06:28:49.747  INFO 22325 --- [           main] junit.logTestName                        : Finished Test tickTockUpdateRollbackTests(org.springframework.cloud.dataflow.acceptance.test.TickTockTests)
22-Feb-2019 06:28:49 2019-02-22 06:28:49.747  INFO 22325 --- [           main] o.s.c.d.acceptance.test.TickTockTests    : Destroy all streams
22-Feb-2019 06:28:49 2019-02-22 06:28:49.986  INFO 22325 --- [           main] junit.logTestName                        : Starting Test tickTockTests(org.springframework.cloud.dataflow.acceptance.test.TickTockTests)
22-Feb-2019 06:28:49 2019-02-22 06:28:49.992  INFO 22325 --- [           main] o.s.c.d.acceptance.test.TickTockTests    : Creating stream 'TICKTOCK'
22-Feb-2019 06:28:50 2019-02-22 06:28:50.019  INFO 22325 --- [           main] o.s.c.d.acceptance.test.TickTockTests    : Deploying stream 'TICKTOCK' with properties: {app.*.logging.file=${PID}-test.log, app.*.endpoints.logfile.sensitive=false, app.log.log.expression='TICKTOCK - TIMESTAMP: '.concat(payload), app.*.management.endpoints.web.exposure.include=*}
22-Feb-2019 06:28:50 2019-02-22 06:28:50.500  INFO 22325 --- [           main] o.s.c.d.acceptance.test.TickTockTests    : Checking: Stream=TICKTOCK, status = deploying, status description = The stream is being deployed.
22-Feb-2019 06:28:50 2019-02-22 06:28:50.500  INFO 22325 --- [           main] o.s.c.d.acceptance.test.TickTockTests    : Sleeping to check status of Stream=TICKTOCK
22-Feb-2019 06:29:00 2019-02-22 06:29:00.550  INFO 22325 --- [           main] o.s.c.d.acceptance.test.TickTockTests    : Checking: Stream=TICKTOCK, status = deploying, status description = The stream is being deployed.
22-Feb-2019 06:29:00 2019-02-22 06:29:00.551  INFO 22325 --- [           main] o.s.c.d.acceptance.test.TickTockTests    : Sleeping to check status of Stream=TICKTOCK
22-Feb-2019 06:29:10 2019-02-22 06:29:10.623  INFO 22325 --- [           main] o.s.c.d.acceptance.test.TickTockTests    : Checking: Stream=TICKTOCK, status = deployed, status description = The stream has been successfully deployed
22-Feb-2019 06:29:10 2019-02-22 06:29:10.659  INFO 22325 --- [           main] o.s.c.d.acceptance.test.TickTockTests    : Sleeping to check status of Stream=TICKTOCK
22-Feb-2019 06:29:20 2019-02-22 06:29:20.659  INFO 22325 --- [           main] o.s.c.d.acceptance.test.TickTockTests    : Stream 'TICKTOCK' started with status: deployed
22-Feb-2019 06:29:20 2019-02-22 06:29:20.660  INFO 22325 --- [           main] o.s.c.d.acceptance.test.TickTockTests    : App 'log' has instances: {TICKTOCK.log-v4-0=http://10.194.6.14:45670}
22-Feb-2019 06:29:20 2019-02-22 06:29:20.660  INFO 22325 --- [           main] o.s.c.d.acceptance.test.TickTockTests    : App 'time' has instances: {TICKTOCK.time-v4-0=http://10.194.6.14:22294}
22-Feb-2019 06:29:20 2019-02-22 06:29:20.660  INFO 22325 --- [           main] o.s.c.d.acceptance.test.TickTockTests    : Looking for 'Started TimeSource' in logfile for time
22-Feb-2019 06:29:30 2019-02-22 06:29:30.660  INFO 22325 --- [           main] o.s.c.d.acceptance.test.TickTockTests    : Requesting log for app TICKTOCK.time-v4-0
22-Feb-2019 06:29:30 2019-02-22 06:29:30.810  INFO 22325 --- [           main] o.s.c.d.acceptance.test.TickTockTests    : Retrieved logfile from 'http://10.194.6.14:22294/logfile
22-Feb-2019 06:29:30 2019-02-22 06:29:30.811  INFO 22325 --- [           main] o.s.c.d.acceptance.test.TickTockTests    : Matched all 'Started TimeSource' in logfile for instance TICKTOCK.time-v4-0 of app time
22-Feb-2019 06:29:30 2019-02-22 06:29:30.811  INFO 22325 --- [           main] o.s.c.d.acceptance.test.TickTockTests    : Looking for 'Started LogSink' in logfile for log
22-Feb-2019 06:29:40 2019-02-22 06:29:40.811  INFO 22325 --- [           main] o.s.c.d.acceptance.test.TickTockTests    : Requesting log for app TICKTOCK.log-v4-0
22-Feb-2019 06:29:40 2019-02-22 06:29:40.953  INFO 22325 --- [           main] o.s.c.d.acceptance.test.TickTockTests    : Retrieved logfile from 'http://10.194.6.14:45670/logfile
22-Feb-2019 06:29:40 2019-02-22 06:29:40.953  INFO 22325 --- [           main] o.s.c.d.acceptance.test.TickTockTests    : Matched all 'Started LogSink' in logfile for instance TICKTOCK.log-v4-0 of app log
22-Feb-2019 06:29:40 2019-02-22 06:29:40.953  INFO 22325 --- [           main] o.s.c.d.acceptance.test.TickTockTests    : Looking for 'TICKTOCK - TIMESTAMP:' in logfile for log
22-Feb-2019 06:29:50 2019-02-22 06:29:50.953  INFO 22325 --- [           main] o.s.c.d.acceptance.test.TickTockTests    : Requesting log for app TICKTOCK.log-v4-0
22-Feb-2019 06:29:50 2019-02-22 06:29:50.969  INFO 22325 --- [           main] o.s.c.d.acceptance.test.TickTockTests    : Retrieved logfile from 'http://10.194.6.14:45670/logfile
22-Feb-2019 06:29:50 2019-02-22 06:29:50.969  INFO 22325 --- [           main] o.s.c.d.acceptance.test.TickTockTests    : Matched all 'TICKTOCK - TIMESTAMP:' in logfile for instance TICKTOCK.log-v4-0 of app log
22-Feb-2019 06:29:50 2019-02-22 06:29:50.971  INFO 22325 --- [           main] junit.logTestName                        : Test tickTockTests(org.springframework.cloud.dataflow.acceptance.test.TickTockTests) Succeeded
22-Feb-2019 06:29:50 2019-02-22 06:29:50.971  INFO 22325 --- [           main] junit.logTestName                        : Finished Test tickTockTests(org.springframework.cloud.dataflow.acceptance.test.TickTockTests)
22-Feb-2019 06:29:50 2019-02-22 06:29:50.971  INFO 22325 --- [           main] o.s.c.d.acceptance.test.TickTockTests    : Destroy all streams
22-Feb-2019 06:29:51 2019-02-22 06:29:51.168  INFO 22325 --- [           main] junit.logTestName                        : Starting Test tickTockTestsFromConfigServer(org.springframework.cloud.dataflow.acceptance.test.TickTockTests)
22-Feb-2019 06:29:51 2019-02-22 06:29:51.175  INFO 22325 --- [           main] junit.logTestName                        : Finished Test tickTockTestsFromConfigServer(org.springframework.cloud.dataflow.acceptance.test.TickTockTests)
22-Feb-2019 06:29:51 2019-02-22 06:29:51.176  INFO 22325 --- [           main] o.s.c.d.acceptance.test.TickTockTests    : Destroy all streams
22-Feb-2019 06:29:51 Tests run: 3, Failures: 0, Errors: 0, Skipped: 1, Time elapsed: 193.785 sec - in org.springframework.cloud.dataflow.acceptance.test.TickTockTests
22-Feb-2019 06:29:51 Running org.springframework.cloud.dataflow.acceptance.test.TransformTests
22-Feb-2019 06:29:51 2019-02-22 06:29:51.183  INFO 22325 --- [           main] .b.t.c.SpringBootTestContextBootstrapper : Neither @ContextConfiguration nor @ContextHierarchy found for test class [org.springframework.cloud.dataflow.acceptance.test.TransformTests], using SpringBootContextLoader
22-Feb-2019 06:29:51 2019-02-22 06:29:51.189  INFO 22325 --- [           main] .b.t.c.SpringBootTestContextBootstrapper : Loaded default TestExecutionListener class names from location [META-INF/spring.factories]: [org.springframework.boot.test.mock.mockito.MockitoTestExecutionListener, org.springframework.boot.test.mock.mockito.ResetMocksTestExecutionListener, org.springframework.boot.test.autoconfigure.restdocs.RestDocsTestExecutionListener, org.springframework.boot.test.autoconfigure.web.client.MockRestServiceServerResetTestExecutionListener, org.springframework.boot.test.autoconfigure.web.servlet.MockMvcPrintOnlyOnFailureTestExecutionListener, org.springframework.boot.test.autoconfigure.web.servlet.WebDriverTestExecutionListener, org.springframework.test.context.web.ServletTestExecutionListener, org.springframework.test.context.support.DirtiesContextBeforeModesTestExecutionListener, org.springframework.test.context.support.DependencyInjectionTestExecutionListener, org.springframework.test.context.support.DirtiesContextTestExecutionListener, org.springframework.test.context.transaction.TransactionalTestExecutionListener, org.springframework.test.context.jdbc.SqlScriptsTestExecutionListener]
22-Feb-2019 06:29:51 2019-02-22 06:29:51.191  INFO 22325 --- [           main] .b.t.c.SpringBootTestContextBootstrapper : Using TestExecutionListeners: [org.springframework.test.context.web.ServletTestExecutionListener@36327cec, org.springframework.test.context.support.DirtiesContextBeforeModesTestExecutionListener@410ae5ac, org.springframework.boot.test.autoconfigure.SpringBootDependencyInjectionTestExecutionListener@1a8df0b3, org.springframework.test.context.support.DirtiesContextTestExecutionListener@7c112f5f, org.springframework.test.context.transaction.TransactionalTestExecutionListener@5961e92d, org.springframework.test.context.jdbc.SqlScriptsTestExecutionListener@4fd05028, org.springframework.boot.test.autoconfigure.web.servlet.MockMvcPrintOnlyOnFailureTestExecutionListener@3a2d3909, org.springframework.boot.test.autoconfigure.web.client.MockRestServiceServerResetTestExecutionListener@4fb392c4, org.springframework.boot.test.mock.mockito.ResetMocksTestExecutionListener@194d329e, org.springframework.boot.test.autoconfigure.web.servlet.WebDriverTestExecutionListener@54d1608f, org.springframework.boot.test.autoconfigure.restdocs.RestDocsTestExecutionListener@7e7fe6d, org.springframework.boot.test.mock.mockito.MockitoTestExecutionListener@541179e7]
22-Feb-2019 06:29:51 2019-02-22 06:29:51.257  INFO 22325 --- [           main] junit.logTestName                        : Starting Test transformTests(org.springframework.cloud.dataflow.acceptance.test.TransformTests)
22-Feb-2019 06:29:51 2019-02-22 06:29:51.261  INFO 22325 --- [           main] o.s.c.d.acceptance.test.TransformTests   : Creating stream 'TRANSFORM-TEST'
22-Feb-2019 06:29:51 2019-02-22 06:29:51.284  INFO 22325 --- [           main] o.s.c.d.acceptance.test.TransformTests   : Deploying stream 'TRANSFORM-TEST' with properties: {app.*.logging.file=${PID}-test.log, app.*.endpoints.logfile.sensitive=false, app.*.management.endpoints.web.exposure.include=*}
22-Feb-2019 06:29:52 2019-02-22 06:29:52.026  INFO 22325 --- [           main] o.s.c.d.acceptance.test.TransformTests   : Checking: Stream=TRANSFORM-TEST, status = deploying, status description = The stream is being deployed.
22-Feb-2019 06:29:52 2019-02-22 06:29:52.026  INFO 22325 --- [           main] o.s.c.d.acceptance.test.TransformTests   : Sleeping to check status of Stream=TRANSFORM-TEST
22-Feb-2019 06:30:02 2019-02-22 06:30:02.094  INFO 22325 --- [           main] o.s.c.d.acceptance.test.TransformTests   : Checking: Stream=TRANSFORM-TEST, status = deploying, status description = The stream is being deployed.
22-Feb-2019 06:30:02 2019-02-22 06:30:02.095  INFO 22325 --- [           main] o.s.c.d.acceptance.test.TransformTests   : Sleeping to check status of Stream=TRANSFORM-TEST
22-Feb-2019 06:30:12 2019-02-22 06:30:12.141  INFO 22325 --- [           main] o.s.c.d.acceptance.test.TransformTests   : Checking: Stream=TRANSFORM-TEST, status = deploying, status description = The stream is being deployed.
22-Feb-2019 06:30:12 2019-02-22 06:30:12.141  INFO 22325 --- [           main] o.s.c.d.acceptance.test.TransformTests   : Sleeping to check status of Stream=TRANSFORM-TEST
22-Feb-2019 06:30:22 2019-02-22 06:30:22.181  INFO 22325 --- [           main] o.s.c.d.acceptance.test.TransformTests   : Checking: Stream=TRANSFORM-TEST, status = deployed, status description = The stream has been successfully deployed
22-Feb-2019 06:30:22 2019-02-22 06:30:22.239  INFO 22325 --- [           main] o.s.c.d.acceptance.test.TransformTests   : Sleeping to check status of Stream=TRANSFORM-TEST
22-Feb-2019 06:30:32 2019-02-22 06:30:32.240  INFO 22325 --- [           main] o.s.c.d.acceptance.test.TransformTests   : Stream 'TRANSFORM-TEST' started with status: deployed
22-Feb-2019 06:30:32 2019-02-22 06:30:32.240  INFO 22325 --- [           main] o.s.c.d.acceptance.test.TransformTests   : App 'transform' has instances: {TRANSFORM-TEST.transform-v1-0=http://10.194.6.14:34245}
22-Feb-2019 06:30:32 2019-02-22 06:30:32.240  INFO 22325 --- [           main] o.s.c.d.acceptance.test.TransformTests   : App 'log' has instances: {TRANSFORM-TEST.log-v1-0=http://10.194.6.14:36754}
22-Feb-2019 06:30:32 2019-02-22 06:30:32.240  INFO 22325 --- [           main] o.s.c.d.acceptance.test.TransformTests   : App 'http' has instances: {TRANSFORM-TEST.http-v1-0=http://10.194.6.14:23107}
22-Feb-2019 06:30:32 2019-02-22 06:30:32.240  INFO 22325 --- [           main] o.s.c.d.acceptance.test.TransformTests   : Looking for 'Started HttpSource' in logfile for http
22-Feb-2019 06:30:42 2019-02-22 06:30:42.240  INFO 22325 --- [           main] o.s.c.d.acceptance.test.TransformTests   : Requesting log for app TRANSFORM-TEST.http-v1-0
22-Feb-2019 06:30:42 2019-02-22 06:30:42.444  INFO 22325 --- [           main] o.s.c.d.acceptance.test.TransformTests   : Retrieved logfile from 'http://10.194.6.14:23107/logfile
22-Feb-2019 06:30:42 2019-02-22 06:30:42.444  INFO 22325 --- [           main] o.s.c.d.acceptance.test.TransformTests   : Matched all 'Started HttpSource' in logfile for instance TRANSFORM-TEST.http-v1-0 of app http
22-Feb-2019 06:30:42 2019-02-22 06:30:42.587  INFO 22325 --- [           main] o.s.c.d.acceptance.test.TransformTests   : Looking for 'Started LogSink' in logfile for log
22-Feb-2019 06:30:52 2019-02-22 06:30:52.587  INFO 22325 --- [           main] o.s.c.d.acceptance.test.TransformTests   : Requesting log for app TRANSFORM-TEST.log-v1-0
22-Feb-2019 06:30:52 2019-02-22 06:30:52.733  INFO 22325 --- [           main] o.s.c.d.acceptance.test.TransformTests   : Retrieved logfile from 'http://10.194.6.14:36754/logfile
22-Feb-2019 06:30:52 2019-02-22 06:30:52.734  INFO 22325 --- [           main] o.s.c.d.acceptance.test.TransformTests   : Matched all 'Started LogSink' in logfile for instance TRANSFORM-TEST.log-v1-0 of app log
22-Feb-2019 06:30:52 2019-02-22 06:30:52.734  INFO 22325 --- [           main] o.s.c.d.acceptance.test.TransformTests   : Looking for 'ABCDEFG' in logfile for log
22-Feb-2019 06:31:02 2019-02-22 06:31:02.734  INFO 22325 --- [           main] o.s.c.d.acceptance.test.TransformTests   : Requesting log for app TRANSFORM-TEST.log-v1-0
22-Feb-2019 06:31:02 2019-02-22 06:31:02.746  INFO 22325 --- [           main] o.s.c.d.acceptance.test.TransformTests   : Retrieved logfile from 'http://10.194.6.14:36754/logfile
22-Feb-2019 06:31:02 2019-02-22 06:31:02.746  INFO 22325 --- [           main] o.s.c.d.acceptance.test.TransformTests   : Matched all 'ABCDEFG' in logfile for instance TRANSFORM-TEST.log-v1-0 of app log
22-Feb-2019 06:31:02 2019-02-22 06:31:02.748  INFO 22325 --- [           main] junit.logTestName                        : Test transformTests(org.springframework.cloud.dataflow.acceptance.test.TransformTests) Succeeded
22-Feb-2019 06:31:02 2019-02-22 06:31:02.750  INFO 22325 --- [           main] junit.logTestName                        : Finished Test transformTests(org.springframework.cloud.dataflow.acceptance.test.TransformTests)
22-Feb-2019 06:31:02 2019-02-22 06:31:02.750  INFO 22325 --- [           main] o.s.c.d.acceptance.test.TransformTests   : Destroy all streams
22-Feb-2019 06:31:03 Tests run: 1, Failures: 0, Errors: 0, Skipped: 0, Time elapsed: 71.842 sec - in org.springframework.cloud.dataflow.acceptance.test.TransformTests
22-Feb-2019 06:31:03 Running org.springframework.cloud.dataflow.acceptance.test.SchedulerTests
22-Feb-2019 06:31:03 2019-02-22 06:31:03.217  INFO 22325 --- [           main] s.c.a.AnnotationConfigApplicationContext : Refreshing org.springframework.context.annotation.AnnotationConfigApplicationContext@74f827ad: startup date [Fri Feb 22 06:31:03 UTC 2019]; root of context hierarchy
22-Feb-2019 06:31:03 2019-02-22 06:31:03.316  INFO 22325 --- [           main] trationDelegate$BeanPostProcessorChecker : Bean 'configurationPropertiesRebinderAutoConfiguration' of type [class org.springframework.cloud.autoconfigure.ConfigurationPropertiesRebinderAutoConfiguration$$EnhancerBySpringCGLIB$$778358fe] is not eligible for getting processed by all BeanPostProcessors (for example: not eligible for auto-proxying)
22-Feb-2019 06:31:03
22-Feb-2019 06:31:03   .   ____          _            __ _ _
22-Feb-2019 06:31:03 /\\ / ___'_ __ _ _(_)_ __  __ _ \ \ \ \
22-Feb-2019 06:31:03 ( ( )\___ | '_ | '_| | '_ \/ _` | \ \ \ \
22-Feb-2019 06:31:03 \\/  ___)| |_)| | | | | || (_| |  ) ) ) )
22-Feb-2019 06:31:03   '  |____| .__|_| |_|_| |_\__, | / / / /
22-Feb-2019 06:31:03 =========|_|==============|___/=/_/_/_/
22-Feb-2019 06:31:03 :: Spring Boot ::        (v1.4.1.RELEASE)
22-Feb-2019 06:31:03
22-Feb-2019 06:31:03 2019-02-22 06:31:03.530  INFO 22325 --- [           main] c.c.c.ConfigServicePropertySourceLocator : Fetching config from server at: http://localhost:8888
22-Feb-2019 06:31:03 2019-02-22 06:31:03.541  WARN 22325 --- [           main] c.c.c.ConfigServicePropertySourceLocator : Could not locate PropertySource: I/O error on GET request for "http://localhost:8888//blah": Connection refused (Connection refused); nested exception is java.net.ConnectException: Connection refused (Connection refused)
22-Feb-2019 06:31:03 2019-02-22 06:31:03.542  INFO 22325 --- [           main] o.a.maven.surefire.booter.ForkedBooter   : The following profiles are active: blah
22-Feb-2019 06:31:03 2019-02-22 06:31:03.544  INFO 22325 --- [           main] s.c.a.AnnotationConfigApplicationContext : Refreshing org.springframework.context.annotation.AnnotationConfigApplicationContext@7cfac39f: startup date [Fri Feb 22 06:31:03 UTC 2019]; parent: org.springframework.context.annotation.AnnotationConfigApplicationContext@74f827ad
22-Feb-2019 06:31:03 2019-02-22 06:31:03.713  INFO 22325 --- [           main] o.a.maven.surefire.booter.ForkedBooter   : Started ForkedBooter in 0.668 seconds (JVM running for 517.867)
22-Feb-2019 06:31:03 2019-02-22 06:31:03.714  INFO 22325 --- [           main] s.c.a.AnnotationConfigApplicationContext : Closing org.springframework.context.annotation.AnnotationConfigApplicationContext@7cfac39f: startup date [Fri Feb 22 06:31:03 UTC 2019]; parent: org.springframework.context.annotation.AnnotationConfigApplicationContext@74f827ad
22-Feb-2019 06:31:03 2019-02-22 06:31:03.715 ERROR 22325 --- [           main] o.s.c.d.a.test.util.SchedulerRule        : SCHEDULER IS NOT AVAILABLE, SKIPPING TESTS
22-Feb-2019 06:31:03
22-Feb-2019 06:31:03 java.lang.IllegalArgumentException: no SchedulerOperations bean is available.  Skipping test.
22-Feb-2019 06:31:03         at org.springframework.util.Assert.notNull(Assert.java:115)
22-Feb-2019 06:31:03         at org.springframework.cloud.dataflow.acceptance.test.util.SchedulerRule.obtainResource(SchedulerRule.java:57)
22-Feb-2019 06:31:03         at org.springframework.cloud.scheduler.spi.junit.AbstractExternalResourceTestSupport.apply(AbstractExternalResourceTestSupport.java:58)
22-Feb-2019 06:31:03         at org.junit.rules.RunRules.applyAll(RunRules.java:26)
22-Feb-2019 06:31:03         at org.junit.rules.RunRules.<init>(RunRules.java:15)
22-Feb-2019 06:31:03         at org.junit.runners.ParentRunner.withClassRules(ParentRunner.java:245)
22-Feb-2019 06:31:03         at org.junit.runners.ParentRunner.classBlock(ParentRunner.java:194)
22-Feb-2019 06:31:03         at org.junit.runners.ParentRunner.run(ParentRunner.java:362)
22-Feb-2019 06:31:03         at org.springframework.test.context.junit4.SpringJUnit4ClassRunner.run(SpringJUnit4ClassRunner.java:191)
22-Feb-2019 06:31:03         at org.apache.maven.surefire.junit4.JUnit4Provider.execute(JUnit4Provider.java:283)
22-Feb-2019 06:31:03         at org.apache.maven.surefire.junit4.JUnit4Provider.executeWithRerun(JUnit4Provider.java:173)
22-Feb-2019 06:31:03         at org.apache.maven.surefire.junit4.JUnit4Provider.executeTestSet(JUnit4Provider.java:153)
22-Feb-2019 06:31:03         at org.apache.maven.surefire.junit4.JUnit4Provider.invoke(JUnit4Provider.java:128)
22-Feb-2019 06:31:03         at org.apache.maven.surefire.booter.ForkedBooter.invokeProviderInSameClassLoader(ForkedBooter.java:203)
22-Feb-2019 06:31:03         at org.apache.maven.surefire.booter.ForkedBooter.runSuitesInProcess(ForkedBooter.java:155)
22-Feb-2019 06:31:03         at org.apache.maven.surefire.booter.ForkedBooter.main(ForkedBooter.java:103)
22-Feb-2019 06:31:03
22-Feb-2019 06:31:03 Tests run: 1, Failures: 0, Errors: 0, Skipped: 1, Time elapsed: 0.687 sec - in org.springframework.cloud.dataflow.acceptance.test.SchedulerTests
22-Feb-2019 06:31:03 Running org.springframework.cloud.dataflow.acceptance.test.NamedChannelTests
22-Feb-2019 06:31:03 2019-02-22 06:31:03.716  INFO 22325 --- [           main] .b.t.c.SpringBootTestContextBootstrapper : Neither @ContextConfiguration nor @ContextHierarchy found for test class [org.springframework.cloud.dataflow.acceptance.test.NamedChannelTests], using SpringBootContextLoader
22-Feb-2019 06:31:03 2019-02-22 06:31:03.723  INFO 22325 --- [           main] .b.t.c.SpringBootTestContextBootstrapper : Loaded default TestExecutionListener class names from location [META-INF/spring.factories]: [org.springframework.boot.test.mock.mockito.MockitoTestExecutionListener, org.springframework.boot.test.mock.mockito.ResetMocksTestExecutionListener, org.springframework.boot.test.autoconfigure.restdocs.RestDocsTestExecutionListener, org.springframework.boot.test.autoconfigure.web.client.MockRestServiceServerResetTestExecutionListener, org.springframework.boot.test.autoconfigure.web.servlet.MockMvcPrintOnlyOnFailureTestExecutionListener, org.springframework.boot.test.autoconfigure.web.servlet.WebDriverTestExecutionListener, org.springframework.test.context.web.ServletTestExecutionListener, org.springframework.test.context.support.DirtiesContextBeforeModesTestExecutionListener, org.springframework.test.context.support.DependencyInjectionTestExecutionListener, org.springframework.test.context.support.DirtiesContextTestExecutionListener, org.springframework.test.context.transaction.TransactionalTestExecutionListener, org.springframework.test.context.jdbc.SqlScriptsTestExecutionListener]
22-Feb-2019 06:31:03 2019-02-22 06:31:03.731  INFO 22325 --- [           main] .b.t.c.SpringBootTestContextBootstrapper : Using TestExecutionListeners: [org.springframework.test.context.web.ServletTestExecutionListener@2b148329, org.springframework.test.context.support.DirtiesContextBeforeModesTestExecutionListener@62c72501, org.springframework.boot.test.autoconfigure.SpringBootDependencyInjectionTestExecutionListener@c889805, org.springframework.test.context.support.DirtiesContextTestExecutionListener@77db3d02, org.springframework.test.context.transaction.TransactionalTestExecutionListener@78d9f51b, org.springframework.test.context.jdbc.SqlScriptsTestExecutionListener@23ed382c, org.springframework.boot.test.autoconfigure.web.servlet.MockMvcPrintOnlyOnFailureTestExecutionListener@6bedd4e4, org.springframework.boot.test.autoconfigure.web.client.MockRestServiceServerResetTestExecutionListener@4570d7b6, org.springframework.boot.test.mock.mockito.ResetMocksTestExecutionListener@72b6832e, org.springframework.boot.test.autoconfigure.web.servlet.WebDriverTestExecutionListener@3850e90c, org.springframework.boot.test.autoconfigure.restdocs.RestDocsTestExecutionListener@3d9f5016, org.springframework.boot.test.mock.mockito.MockitoTestExecutionListener@7e91ed74]
22-Feb-2019 06:31:03 2019-02-22 06:31:03.830  INFO 22325 --- [           main] junit.logTestName                        : Starting Test testDestination(org.springframework.cloud.dataflow.acceptance.test.NamedChannelTests)
22-Feb-2019 06:31:03 2019-02-22 06:31:03.832  INFO 22325 --- [           main] o.s.c.d.a.test.NamedChannelTests         : Creating stream 'LOG-DESTINATION-SINK'
22-Feb-2019 06:31:03 2019-02-22 06:31:03.862  INFO 22325 --- [           main] o.s.c.d.a.test.NamedChannelTests         : Deploying stream 'LOG-DESTINATION-SINK' with properties: {app.*.logging.file=${PID}-test.log, app.*.endpoints.logfile.sensitive=false, app.*.management.endpoints.web.exposure.include=*}
22-Feb-2019 06:31:04 2019-02-22 06:31:04.222  INFO 22325 --- [           main] o.s.c.d.a.test.NamedChannelTests         : Checking: Stream=LOG-DESTINATION-SINK, status = deploying, status description = The stream is being deployed.
22-Feb-2019 06:31:04 2019-02-22 06:31:04.222  INFO 22325 --- [           main] o.s.c.d.a.test.NamedChannelTests         : Sleeping to check status of Stream=LOG-DESTINATION-SINK
22-Feb-2019 06:31:14 2019-02-22 06:31:14.269  INFO 22325 --- [           main] o.s.c.d.a.test.NamedChannelTests         : Checking: Stream=LOG-DESTINATION-SINK, status = deployed, status description = The stream has been successfully deployed
22-Feb-2019 06:31:14 2019-02-22 06:31:14.299  INFO 22325 --- [           main] o.s.c.d.a.test.NamedChannelTests         : Sleeping to check status of Stream=LOG-DESTINATION-SINK
22-Feb-2019 06:31:24 2019-02-22 06:31:24.299  INFO 22325 --- [           main] o.s.c.d.a.test.NamedChannelTests         : Stream 'LOG-DESTINATION-SINK' started with status: deployed
22-Feb-2019 06:31:24 2019-02-22 06:31:24.300  INFO 22325 --- [           main] o.s.c.d.a.test.NamedChannelTests         : App 'log' has instances: {LOG-DESTINATION-SINK.log-v1-0=http://10.194.6.14:33964}
22-Feb-2019 06:31:24 2019-02-22 06:31:24.300  INFO 22325 --- [           main] o.s.c.d.a.test.NamedChannelTests         : Looking for 'Started LogSink' in logfile for log
22-Feb-2019 06:31:34 2019-02-22 06:31:34.300  INFO 22325 --- [           main] o.s.c.d.a.test.NamedChannelTests         : Requesting log for app LOG-DESTINATION-SINK.log-v1-0
22-Feb-2019 06:31:34 2019-02-22 06:31:34.462  INFO 22325 --- [           main] o.s.c.d.a.test.NamedChannelTests         : Retrieved logfile from 'http://10.194.6.14:33964/logfile
22-Feb-2019 06:31:34 2019-02-22 06:31:34.462  INFO 22325 --- [           main] o.s.c.d.a.test.NamedChannelTests         : Matched all 'Started LogSink' in logfile for instance LOG-DESTINATION-SINK.log-v1-0 of app log
22-Feb-2019 06:31:34 2019-02-22 06:31:34.463  INFO 22325 --- [           main] o.s.c.d.a.test.NamedChannelTests         : Creating stream 'HTTP-DESTINATION-SOURCE'
22-Feb-2019 06:31:34 2019-02-22 06:31:34.482  INFO 22325 --- [           main] o.s.c.d.a.test.NamedChannelTests         : Deploying stream 'HTTP-DESTINATION-SOURCE' with properties: {app.*.logging.file=${PID}-test.log, app.*.endpoints.logfile.sensitive=false, app.*.management.endpoints.web.exposure.include=*}
22-Feb-2019 06:31:34 2019-02-22 06:31:34.787  INFO 22325 --- [           main] o.s.c.d.a.test.NamedChannelTests         : Checking: Stream=HTTP-DESTINATION-SOURCE, status = deploying, status description = The stream is being deployed.
22-Feb-2019 06:31:34 2019-02-22 06:31:34.787  INFO 22325 --- [           main] o.s.c.d.a.test.NamedChannelTests         : Sleeping to check status of Stream=HTTP-DESTINATION-SOURCE
22-Feb-2019 06:31:44 2019-02-22 06:31:44.832  INFO 22325 --- [           main] o.s.c.d.a.test.NamedChannelTests         : Checking: Stream=HTTP-DESTINATION-SOURCE, status = deployed, status description = The stream has been successfully deployed
22-Feb-2019 06:31:44 2019-02-22 06:31:44.886  INFO 22325 --- [           main] o.s.c.d.a.test.NamedChannelTests         : Sleeping to check status of Stream=HTTP-DESTINATION-SOURCE
22-Feb-2019 06:31:54 2019-02-22 06:31:54.886  INFO 22325 --- [           main] o.s.c.d.a.test.NamedChannelTests         : Stream 'HTTP-DESTINATION-SOURCE' started with status: deployed
22-Feb-2019 06:31:54 2019-02-22 06:31:54.886  INFO 22325 --- [           main] o.s.c.d.a.test.NamedChannelTests         : App 'http' has instances: {HTTP-DESTINATION-SOURCE.http-v1-0=http://10.194.6.14:24410}
22-Feb-2019 06:31:54 2019-02-22 06:31:54.886  INFO 22325 --- [           main] o.s.c.d.a.test.NamedChannelTests         : Looking for 'Started HttpSource' in logfile for http
22-Feb-2019 06:32:04 2019-02-22 06:32:04.886  INFO 22325 --- [           main] o.s.c.d.a.test.NamedChannelTests         : Requesting log for app HTTP-DESTINATION-SOURCE.http-v1-0
22-Feb-2019 06:32:05 2019-02-22 06:32:05.144  INFO 22325 --- [           main] o.s.c.d.a.test.NamedChannelTests         : Retrieved logfile from 'http://10.194.6.14:24410/logfile
22-Feb-2019 06:32:05 2019-02-22 06:32:05.144  INFO 22325 --- [           main] o.s.c.d.a.test.NamedChannelTests         : Matched all 'Started HttpSource' in logfile for instance HTTP-DESTINATION-SOURCE.http-v1-0 of app http
22-Feb-2019 06:32:05 2019-02-22 06:32:05.288  INFO 22325 --- [           main] o.s.c.d.a.test.NamedChannelTests         : Looking for 'abcdefg' in logfile for log
22-Feb-2019 06:32:15 2019-02-22 06:32:15.288  INFO 22325 --- [           main] o.s.c.d.a.test.NamedChannelTests         : Requesting log for app LOG-DESTINATION-SINK.log-v1-0
22-Feb-2019 06:32:15 2019-02-22 06:32:15.306  INFO 22325 --- [           main] o.s.c.d.a.test.NamedChannelTests         : Retrieved logfile from 'http://10.194.6.14:33964/logfile
22-Feb-2019 06:32:15 2019-02-22 06:32:15.306  INFO 22325 --- [           main] o.s.c.d.a.test.NamedChannelTests         : Matched all 'abcdefg' in logfile for instance LOG-DESTINATION-SINK.log-v1-0 of app log
22-Feb-2019 06:32:15 2019-02-22 06:32:15.308  INFO 22325 --- [           main] junit.logTestName                        : Test testDestination(org.springframework.cloud.dataflow.acceptance.test.NamedChannelTests) Succeeded
22-Feb-2019 06:32:15 2019-02-22 06:32:15.308  INFO 22325 --- [           main] junit.logTestName                        : Finished Test testDestination(org.springframework.cloud.dataflow.acceptance.test.NamedChannelTests)
22-Feb-2019 06:32:15 2019-02-22 06:32:15.308  INFO 22325 --- [           main] o.s.c.d.a.test.NamedChannelTests         : Destroy all streams
22-Feb-2019 06:32:15 2019-02-22 06:32:15.578  INFO 22325 --- [           main] junit.logTestName                        : Starting Test testTap(org.springframework.cloud.dataflow.acceptance.test.NamedChannelTests)
22-Feb-2019 06:32:15 2019-02-22 06:32:15.579  INFO 22325 --- [           main] o.s.c.d.a.test.NamedChannelTests         : Creating stream 'TAPHTTP'
22-Feb-2019 06:32:15 2019-02-22 06:32:15.599  INFO 22325 --- [           main] o.s.c.d.a.test.NamedChannelTests         : Deploying stream 'TAPHTTP' with properties: {app.*.logging.file=${PID}-test.log, app.*.endpoints.logfile.sensitive=false, app.*.management.endpoints.web.exposure.include=*}
22-Feb-2019 06:32:16 2019-02-22 06:32:16.114  INFO 22325 --- [           main] o.s.c.d.a.test.NamedChannelTests         : Checking: Stream=TAPHTTP, status = deploying, status description = The stream is being deployed.
22-Feb-2019 06:32:16 2019-02-22 06:32:16.114  INFO 22325 --- [           main] o.s.c.d.a.test.NamedChannelTests         : Sleeping to check status of Stream=TAPHTTP
22-Feb-2019 06:32:26 2019-02-22 06:32:26.177  INFO 22325 --- [           main] o.s.c.d.a.test.NamedChannelTests         : Checking: Stream=TAPHTTP, status = deploying, status description = The stream is being deployed.
22-Feb-2019 06:32:26 2019-02-22 06:32:26.178  INFO 22325 --- [           main] o.s.c.d.a.test.NamedChannelTests         : Sleeping to check status of Stream=TAPHTTP
22-Feb-2019 06:32:36 2019-02-22 06:32:36.210  INFO 22325 --- [           main] o.s.c.d.a.test.NamedChannelTests         : Checking: Stream=TAPHTTP, status = deployed, status description = The stream has been successfully deployed
22-Feb-2019 06:32:36 2019-02-22 06:32:36.258  INFO 22325 --- [           main] o.s.c.d.a.test.NamedChannelTests         : Sleeping to check status of Stream=TAPHTTP
22-Feb-2019 06:32:46 2019-02-22 06:32:46.258  INFO 22325 --- [           main] o.s.c.d.a.test.NamedChannelTests         : Stream 'TAPHTTP' started with status: deployed
22-Feb-2019 06:32:46 2019-02-22 06:32:46.258  INFO 22325 --- [           main] o.s.c.d.a.test.NamedChannelTests         : App 'log' has instances: {TAPHTTP.log-v1-0=http://10.194.6.14:59136}
22-Feb-2019 06:32:46 2019-02-22 06:32:46.258  INFO 22325 --- [           main] o.s.c.d.a.test.NamedChannelTests         : App 'http' has instances: {TAPHTTP.http-v1-0=http://10.194.6.14:40518}
22-Feb-2019 06:32:46 2019-02-22 06:32:46.258  INFO 22325 --- [           main] o.s.c.d.a.test.NamedChannelTests         : Looking for 'Started HttpSource' in logfile for http
22-Feb-2019 06:32:56 2019-02-22 06:32:56.259  INFO 22325 --- [           main] o.s.c.d.a.test.NamedChannelTests         : Requesting log for app TAPHTTP.http-v1-0
22-Feb-2019 06:32:56 2019-02-22 06:32:56.429  INFO 22325 --- [           main] o.s.c.d.a.test.NamedChannelTests         : Retrieved logfile from 'http://10.194.6.14:40518/logfile
22-Feb-2019 06:32:56 2019-02-22 06:32:56.429  INFO 22325 --- [           main] o.s.c.d.a.test.NamedChannelTests         : Matched all 'Started HttpSource' in logfile for instance TAPHTTP.http-v1-0 of app http
22-Feb-2019 06:32:56 2019-02-22 06:32:56.429  INFO 22325 --- [           main] o.s.c.d.a.test.NamedChannelTests         : Looking for 'Started LogSink' in logfile for log
22-Feb-2019 06:33:06 2019-02-22 06:33:06.429  INFO 22325 --- [           main] o.s.c.d.a.test.NamedChannelTests         : Requesting log for app TAPHTTP.log-v1-0
22-Feb-2019 06:33:06 2019-02-22 06:33:06.574  INFO 22325 --- [           main] o.s.c.d.a.test.NamedChannelTests         : Retrieved logfile from 'http://10.194.6.14:59136/logfile
22-Feb-2019 06:33:06 2019-02-22 06:33:06.574  INFO 22325 --- [           main] o.s.c.d.a.test.NamedChannelTests         : Matched all 'Started LogSink' in logfile for instance TAPHTTP.log-v1-0 of app log
22-Feb-2019 06:33:06 2019-02-22 06:33:06.574  INFO 22325 --- [           main] o.s.c.d.a.test.NamedChannelTests         : Creating stream 'TAPSTREAM'
22-Feb-2019 06:33:06 2019-02-22 06:33:06.593  INFO 22325 --- [           main] o.s.c.d.a.test.NamedChannelTests         : Deploying stream 'TAPSTREAM' with properties: {app.*.logging.file=${PID}-test.log, app.*.endpoints.logfile.sensitive=false, app.*.management.endpoints.web.exposure.include=*}
22-Feb-2019 06:33:06 2019-02-22 06:33:06.868  INFO 22325 --- [           main] o.s.c.d.a.test.NamedChannelTests         : Checking: Stream=TAPSTREAM, status = deploying, status description = The stream is being deployed.
22-Feb-2019 06:33:06 2019-02-22 06:33:06.868  INFO 22325 --- [           main] o.s.c.d.a.test.NamedChannelTests         : Sleeping to check status of Stream=TAPSTREAM
22-Feb-2019 06:33:16 2019-02-22 06:33:16.924  INFO 22325 --- [           main] o.s.c.d.a.test.NamedChannelTests         : Checking: Stream=TAPSTREAM, status = deployed, status description = The stream has been successfully deployed
22-Feb-2019 06:33:16 2019-02-22 06:33:16.960  INFO 22325 --- [           main] o.s.c.d.a.test.NamedChannelTests         : Sleeping to check status of Stream=TAPSTREAM
22-Feb-2019 06:33:26 2019-02-22 06:33:26.961  INFO 22325 --- [           main] o.s.c.d.a.test.NamedChannelTests         : Stream 'TAPSTREAM' started with status: deployed
22-Feb-2019 06:33:26 2019-02-22 06:33:26.962  INFO 22325 --- [           main] o.s.c.d.a.test.NamedChannelTests         : App 'log' has instances: {TAPSTREAM.log-v1-0=http://10.194.6.14:51302}
22-Feb-2019 06:33:26 2019-02-22 06:33:26.962  INFO 22325 --- [           main] o.s.c.d.a.test.NamedChannelTests         : Looking for 'Started LogSink' in logfile for log
22-Feb-2019 06:33:36 2019-02-22 06:33:36.962  INFO 22325 --- [           main] o.s.c.d.a.test.NamedChannelTests         : Requesting log for app TAPSTREAM.log-v1-0
22-Feb-2019 06:33:37 2019-02-22 06:33:37.124  INFO 22325 --- [           main] o.s.c.d.a.test.NamedChannelTests         : Retrieved logfile from 'http://10.194.6.14:51302/logfile
22-Feb-2019 06:33:37 2019-02-22 06:33:37.125  INFO 22325 --- [           main] o.s.c.d.a.test.NamedChannelTests         : Matched all 'Started LogSink' in logfile for instance TAPSTREAM.log-v1-0 of app log
22-Feb-2019 06:33:37 2019-02-22 06:33:37.289  INFO 22325 --- [           main] o.s.c.d.a.test.NamedChannelTests         : Looking for 'abcdefg' in logfile for log
22-Feb-2019 06:33:47 2019-02-22 06:33:47.290  INFO 22325 --- [           main] o.s.c.d.a.test.NamedChannelTests         : Requesting log for app TAPSTREAM.log-v1-0
22-Feb-2019 06:33:47 2019-02-22 06:33:47.305  INFO 22325 --- [           main] o.s.c.d.a.test.NamedChannelTests         : Retrieved logfile from 'http://10.194.6.14:51302/logfile
22-Feb-2019 06:33:47 2019-02-22 06:33:47.306  INFO 22325 --- [           main] o.s.c.d.a.test.NamedChannelTests         : Matched all 'abcdefg' in logfile for instance TAPSTREAM.log-v1-0 of app log
22-Feb-2019 06:33:47 2019-02-22 06:33:47.307  INFO 22325 --- [           main] junit.logTestName                        : Test testTap(org.springframework.cloud.dataflow.acceptance.test.NamedChannelTests) Succeeded
22-Feb-2019 06:33:47 2019-02-22 06:33:47.307  INFO 22325 --- [           main] junit.logTestName                        : Finished Test testTap(org.springframework.cloud.dataflow.acceptance.test.NamedChannelTests)
22-Feb-2019 06:33:47 2019-02-22 06:33:47.307  INFO 22325 --- [           main] o.s.c.d.a.test.NamedChannelTests         : Destroy all streams
22-Feb-2019 06:33:47 2019-02-22 06:33:47.617  INFO 22325 --- [           main] junit.logTestName                        : Starting Test manyToOneTest(org.springframework.cloud.dataflow.acceptance.test.NamedChannelTests)
22-Feb-2019 06:33:47 2019-02-22 06:33:47.619  INFO 22325 --- [           main] o.s.c.d.a.test.NamedChannelTests         : Creating stream 'MANY-TO-ONE'
22-Feb-2019 06:33:47 2019-02-22 06:33:47.639  INFO 22325 --- [           main] o.s.c.d.a.test.NamedChannelTests         : Deploying stream 'MANY-TO-ONE' with properties: {app.*.logging.file=${PID}-test.log, app.*.endpoints.logfile.sensitive=false, app.*.management.endpoints.web.exposure.include=*}
22-Feb-2019 06:33:48 2019-02-22 06:33:48.036  INFO 22325 --- [           main] o.s.c.d.a.test.NamedChannelTests         : Checking: Stream=MANY-TO-ONE, status = deploying, status description = The stream is being deployed.
22-Feb-2019 06:33:48 2019-02-22 06:33:48.036  INFO 22325 --- [           main] o.s.c.d.a.test.NamedChannelTests         : Sleeping to check status of Stream=MANY-TO-ONE
22-Feb-2019 06:33:58 2019-02-22 06:33:58.075  INFO 22325 --- [           main] o.s.c.d.a.test.NamedChannelTests         : Checking: Stream=MANY-TO-ONE, status = deployed, status description = The stream has been successfully deployed
22-Feb-2019 06:33:58 2019-02-22 06:33:58.101  INFO 22325 --- [           main] o.s.c.d.a.test.NamedChannelTests         : Sleeping to check status of Stream=MANY-TO-ONE
22-Feb-2019 06:34:08 2019-02-22 06:34:08.101  INFO 22325 --- [           main] o.s.c.d.a.test.NamedChannelTests         : Stream 'MANY-TO-ONE' started with status: deployed
22-Feb-2019 06:34:08 2019-02-22 06:34:08.101  INFO 22325 --- [           main] o.s.c.d.a.test.NamedChannelTests         : App 'log' has instances: {MANY-TO-ONE.log-v1-0=http://10.194.6.14:23435}
22-Feb-2019 06:34:08 2019-02-22 06:34:08.102  INFO 22325 --- [           main] o.s.c.d.a.test.NamedChannelTests         : Looking for 'Started LogSink' in logfile for log
22-Feb-2019 06:34:18 2019-02-22 06:34:18.102  INFO 22325 --- [           main] o.s.c.d.a.test.NamedChannelTests         : Requesting log for app MANY-TO-ONE.log-v1-0
22-Feb-2019 06:34:18 2019-02-22 06:34:18.272  INFO 22325 --- [           main] o.s.c.d.a.test.NamedChannelTests         : Retrieved logfile from 'http://10.194.6.14:23435/logfile
22-Feb-2019 06:34:18 2019-02-22 06:34:18.272  INFO 22325 --- [           main] o.s.c.d.a.test.NamedChannelTests         : Matched all 'Started LogSink' in logfile for instance MANY-TO-ONE.log-v1-0 of app log
22-Feb-2019 06:34:18 2019-02-22 06:34:18.272  INFO 22325 --- [           main] o.s.c.d.a.test.NamedChannelTests         : Creating stream 'HTTP-SOURCE-1'
22-Feb-2019 06:34:18 2019-02-22 06:34:18.295  INFO 22325 --- [           main] o.s.c.d.a.test.NamedChannelTests         : Deploying stream 'HTTP-SOURCE-1' with properties: {app.*.logging.file=${PID}-test.log, app.*.endpoints.logfile.sensitive=false, app.*.management.endpoints.web.exposure.include=*}
22-Feb-2019 06:34:18 2019-02-22 06:34:18.586  INFO 22325 --- [           main] o.s.c.d.a.test.NamedChannelTests         : Checking: Stream=HTTP-SOURCE-1, status = deploying, status description = The stream is being deployed.
22-Feb-2019 06:34:18 2019-02-22 06:34:18.586  INFO 22325 --- [           main] o.s.c.d.a.test.NamedChannelTests         : Sleeping to check status of Stream=HTTP-SOURCE-1
22-Feb-2019 06:34:28 2019-02-22 06:34:28.650  INFO 22325 --- [           main] o.s.c.d.a.test.NamedChannelTests         : Checking: Stream=HTTP-SOURCE-1, status = deployed, status description = The stream has been successfully deployed
22-Feb-2019 06:34:28 2019-02-22 06:34:28.685  INFO 22325 --- [           main] o.s.c.d.a.test.NamedChannelTests         : Sleeping to check status of Stream=HTTP-SOURCE-1
22-Feb-2019 06:34:38 2019-02-22 06:34:38.686  INFO 22325 --- [           main] o.s.c.d.a.test.NamedChannelTests         : Stream 'HTTP-SOURCE-1' started with status: deployed
22-Feb-2019 06:34:38 2019-02-22 06:34:38.686  INFO 22325 --- [           main] o.s.c.d.a.test.NamedChannelTests         : App 'http' has instances: {HTTP-SOURCE-1.http-v1-0=http://10.194.6.14:30352}
22-Feb-2019 06:34:38 2019-02-22 06:34:38.686  INFO 22325 --- [           main] o.s.c.d.a.test.NamedChannelTests         : Looking for 'Started HttpSource' in logfile for http
22-Feb-2019 06:34:48 2019-02-22 06:34:48.686  INFO 22325 --- [           main] o.s.c.d.a.test.NamedChannelTests         : Requesting log for app HTTP-SOURCE-1.http-v1-0
22-Feb-2019 06:34:48 2019-02-22 06:34:48.857  INFO 22325 --- [           main] o.s.c.d.a.test.NamedChannelTests         : Retrieved logfile from 'http://10.194.6.14:30352/logfile
22-Feb-2019 06:34:48 2019-02-22 06:34:48.857  INFO 22325 --- [           main] o.s.c.d.a.test.NamedChannelTests         : Matched all 'Started HttpSource' in logfile for instance HTTP-SOURCE-1.http-v1-0 of app http
22-Feb-2019 06:34:48 2019-02-22 06:34:48.858  INFO 22325 --- [           main] o.s.c.d.a.test.NamedChannelTests         : Creating stream 'HTTP-SOURCE-2'
22-Feb-2019 06:34:48 2019-02-22 06:34:48.876  INFO 22325 --- [           main] o.s.c.d.a.test.NamedChannelTests         : Deploying stream 'HTTP-SOURCE-2' with properties: {app.*.logging.file=${PID}-test.log, app.*.endpoints.logfile.sensitive=false, app.*.management.endpoints.web.exposure.include=*}
22-Feb-2019 06:34:49 2019-02-22 06:34:49.208  INFO 22325 --- [           main] o.s.c.d.a.test.NamedChannelTests         : Checking: Stream=HTTP-SOURCE-2, status = deploying, status description = The stream is being deployed.
22-Feb-2019 06:34:49 2019-02-22 06:34:49.208  INFO 22325 --- [           main] o.s.c.d.a.test.NamedChannelTests         : Sleeping to check status of Stream=HTTP-SOURCE-2
22-Feb-2019 06:34:59 2019-02-22 06:34:59.280  INFO 22325 --- [           main] o.s.c.d.a.test.NamedChannelTests         : Checking: Stream=HTTP-SOURCE-2, status = deployed, status description = The stream has been successfully deployed
22-Feb-2019 06:34:59 2019-02-22 06:34:59.329  INFO 22325 --- [           main] o.s.c.d.a.test.NamedChannelTests         : Sleeping to check status of Stream=HTTP-SOURCE-2
22-Feb-2019 06:35:09 2019-02-22 06:35:09.329  INFO 22325 --- [           main] o.s.c.d.a.test.NamedChannelTests         : Stream 'HTTP-SOURCE-2' started with status: deployed
22-Feb-2019 06:35:09 2019-02-22 06:35:09.330  INFO 22325 --- [           main] o.s.c.d.a.test.NamedChannelTests         : App 'http' has instances: {HTTP-SOURCE-2.http-v1-0=http://10.194.6.14:26512}
22-Feb-2019 06:35:09 2019-02-22 06:35:09.330  INFO 22325 --- [           main] o.s.c.d.a.test.NamedChannelTests         : Looking for 'Started HttpSource' in logfile for http
22-Feb-2019 06:35:19 2019-02-22 06:35:19.330  INFO 22325 --- [           main] o.s.c.d.a.test.NamedChannelTests         : Requesting log for app HTTP-SOURCE-2.http-v1-0
22-Feb-2019 06:35:19 2019-02-22 06:35:19.502  INFO 22325 --- [           main] o.s.c.d.a.test.NamedChannelTests         : Retrieved logfile from 'http://10.194.6.14:26512/logfile
22-Feb-2019 06:35:19 2019-02-22 06:35:19.502  INFO 22325 --- [           main] o.s.c.d.a.test.NamedChannelTests         : Matched all 'Started HttpSource' in logfile for instance HTTP-SOURCE-2.http-v1-0 of app http
22-Feb-2019 06:35:19 2019-02-22 06:35:19.634  INFO 22325 --- [           main] o.s.c.d.a.test.NamedChannelTests         : Looking for 'abcdefg' in logfile for log
22-Feb-2019 06:35:29 2019-02-22 06:35:29.634  INFO 22325 --- [           main] o.s.c.d.a.test.NamedChannelTests         : Requesting log for app MANY-TO-ONE.log-v1-0
22-Feb-2019 06:35:29 2019-02-22 06:35:29.656  INFO 22325 --- [           main] o.s.c.d.a.test.NamedChannelTests         : Retrieved logfile from 'http://10.194.6.14:23435/logfile
22-Feb-2019 06:35:29 2019-02-22 06:35:29.656  INFO 22325 --- [           main] o.s.c.d.a.test.NamedChannelTests         : Matched all 'abcdefg' in logfile for instance MANY-TO-ONE.log-v1-0 of app log
22-Feb-2019 06:35:29 2019-02-22 06:35:29.791  INFO 22325 --- [           main] o.s.c.d.a.test.NamedChannelTests         : Looking for 'hijklmn' in logfile for log
22-Feb-2019 06:35:39 2019-02-22 06:35:39.791  INFO 22325 --- [           main] o.s.c.d.a.test.NamedChannelTests         : Requesting log for app MANY-TO-ONE.log-v1-0
22-Feb-2019 06:35:39 2019-02-22 06:35:39.802  INFO 22325 --- [           main] o.s.c.d.a.test.NamedChannelTests         : Retrieved logfile from 'http://10.194.6.14:23435/logfile
22-Feb-2019 06:35:39 2019-02-22 06:35:39.802  INFO 22325 --- [           main] o.s.c.d.a.test.NamedChannelTests         : Matched all 'hijklmn' in logfile for instance MANY-TO-ONE.log-v1-0 of app log
22-Feb-2019 06:35:39 2019-02-22 06:35:39.804  INFO 22325 --- [           main] junit.logTestName                        : Test manyToOneTest(org.springframework.cloud.dataflow.acceptance.test.NamedChannelTests) Succeeded
22-Feb-2019 06:35:39 2019-02-22 06:35:39.804  INFO 22325 --- [           main] junit.logTestName                        : Finished Test manyToOneTest(org.springframework.cloud.dataflow.acceptance.test.NamedChannelTests)
22-Feb-2019 06:35:39 2019-02-22 06:35:39.804  INFO 22325 --- [           main] o.s.c.d.a.test.NamedChannelTests         : Destroy all streams
22-Feb-2019 06:35:40 2019-02-22 06:35:40.138  INFO 22325 --- [           main] junit.logTestName                        : Starting Test directedGraphTest(org.springframework.cloud.dataflow.acceptance.test.NamedChannelTests)
22-Feb-2019 06:35:40 2019-02-22 06:35:40.139  INFO 22325 --- [           main] o.s.c.d.a.test.NamedChannelTests         : Creating stream 'DIRECTED-GRAPH-DESTINATION1'
22-Feb-2019 06:35:40 2019-02-22 06:35:40.158  INFO 22325 --- [           main] o.s.c.d.a.test.NamedChannelTests         : Deploying stream 'DIRECTED-GRAPH-DESTINATION1' with properties: {app.*.logging.file=${PID}-test.log, app.*.endpoints.logfile.sensitive=false, app.*.management.endpoints.web.exposure.include=*}
22-Feb-2019 06:35:40 2019-02-22 06:35:40.648  INFO 22325 --- [           main] o.s.c.d.a.test.NamedChannelTests         : Checking: Stream=DIRECTED-GRAPH-DESTINATION1, status = deploying, status description = The stream is being deployed.
22-Feb-2019 06:35:40 2019-02-22 06:35:40.648  INFO 22325 --- [           main] o.s.c.d.a.test.NamedChannelTests         : Sleeping to check status of Stream=DIRECTED-GRAPH-DESTINATION1
22-Feb-2019 06:35:50 2019-02-22 06:35:50.702  INFO 22325 --- [           main] o.s.c.d.a.test.NamedChannelTests         : Checking: Stream=DIRECTED-GRAPH-DESTINATION1, status = deploying, status description = The stream is being deployed.
22-Feb-2019 06:35:50 2019-02-22 06:35:50.702  INFO 22325 --- [           main] o.s.c.d.a.test.NamedChannelTests         : Sleeping to check status of Stream=DIRECTED-GRAPH-DESTINATION1
22-Feb-2019 06:36:00 2019-02-22 06:36:00.745  INFO 22325 --- [           main] o.s.c.d.a.test.NamedChannelTests         : Checking: Stream=DIRECTED-GRAPH-DESTINATION1, status = deployed, status description = The stream has been successfully deployed
22-Feb-2019 06:36:00 2019-02-22 06:36:00.782  INFO 22325 --- [           main] o.s.c.d.a.test.NamedChannelTests         : Sleeping to check status of Stream=DIRECTED-GRAPH-DESTINATION1
22-Feb-2019 06:36:10 2019-02-22 06:36:10.782  INFO 22325 --- [           main] o.s.c.d.a.test.NamedChannelTests         : Stream 'DIRECTED-GRAPH-DESTINATION1' started with status: deployed
22-Feb-2019 06:36:10 2019-02-22 06:36:10.782  INFO 22325 --- [           main] o.s.c.d.a.test.NamedChannelTests         : App 'transform' has instances: {DIRECTED-GRAPH-DESTINATION1.transform-v1-0=http://10.194.6.14:51350}
22-Feb-2019 06:36:10 2019-02-22 06:36:10.782  INFO 22325 --- [           main] o.s.c.d.a.test.NamedChannelTests         : App 'log' has instances: {DIRECTED-GRAPH-DESTINATION1.log-v1-0=http://10.194.6.14:21689}
22-Feb-2019 06:36:10 2019-02-22 06:36:10.783  INFO 22325 --- [           main] o.s.c.d.a.test.NamedChannelTests         : Looking for 'Started LogSink' in logfile for log
22-Feb-2019 06:36:20 2019-02-22 06:36:20.783  INFO 22325 --- [           main] o.s.c.d.a.test.NamedChannelTests         : Requesting log for app DIRECTED-GRAPH-DESTINATION1.log-v1-0
22-Feb-2019 06:36:20 2019-02-22 06:36:20.921  INFO 22325 --- [           main] o.s.c.d.a.test.NamedChannelTests         : Retrieved logfile from 'http://10.194.6.14:21689/logfile
22-Feb-2019 06:36:20 2019-02-22 06:36:20.922  INFO 22325 --- [           main] o.s.c.d.a.test.NamedChannelTests         : Matched all 'Started LogSink' in logfile for instance DIRECTED-GRAPH-DESTINATION1.log-v1-0 of app log
22-Feb-2019 06:36:20 2019-02-22 06:36:20.922  INFO 22325 --- [           main] o.s.c.d.a.test.NamedChannelTests         : Creating stream 'DIRECTED-GRAPH-DESTINATION2'
22-Feb-2019 06:36:20 2019-02-22 06:36:20.941  INFO 22325 --- [           main] o.s.c.d.a.test.NamedChannelTests         : Deploying stream 'DIRECTED-GRAPH-DESTINATION2' with properties: {app.*.logging.file=${PID}-test.log, app.*.endpoints.logfile.sensitive=false, app.*.management.endpoints.web.exposure.include=*}
22-Feb-2019 06:36:21 2019-02-22 06:36:21.364  INFO 22325 --- [           main] o.s.c.d.a.test.NamedChannelTests         : Checking: Stream=DIRECTED-GRAPH-DESTINATION2, status = deploying, status description = The stream is being deployed.
22-Feb-2019 06:36:21 2019-02-22 06:36:21.364  INFO 22325 --- [           main] o.s.c.d.a.test.NamedChannelTests         : Sleeping to check status of Stream=DIRECTED-GRAPH-DESTINATION2
22-Feb-2019 06:36:31 2019-02-22 06:36:31.415  INFO 22325 --- [           main] o.s.c.d.a.test.NamedChannelTests         : Checking: Stream=DIRECTED-GRAPH-DESTINATION2, status = deploying, status description = The stream is being deployed.
22-Feb-2019 06:36:31 2019-02-22 06:36:31.415  INFO 22325 --- [           main] o.s.c.d.a.test.NamedChannelTests         : Sleeping to check status of Stream=DIRECTED-GRAPH-DESTINATION2
22-Feb-2019 06:36:41 2019-02-22 06:36:41.468  INFO 22325 --- [           main] o.s.c.d.a.test.NamedChannelTests         : Checking: Stream=DIRECTED-GRAPH-DESTINATION2, status = deployed, status description = The stream has been successfully deployed
22-Feb-2019 06:36:41 2019-02-22 06:36:41.518  INFO 22325 --- [           main] o.s.c.d.a.test.NamedChannelTests         : Sleeping to check status of Stream=DIRECTED-GRAPH-DESTINATION2
22-Feb-2019 06:36:51 2019-02-22 06:36:51.518  INFO 22325 --- [           main] o.s.c.d.a.test.NamedChannelTests         : Stream 'DIRECTED-GRAPH-DESTINATION2' started with status: deployed
22-Feb-2019 06:36:51 2019-02-22 06:36:51.518  INFO 22325 --- [           main] o.s.c.d.a.test.NamedChannelTests         : App 'transform' has instances: {DIRECTED-GRAPH-DESTINATION2.transform-v1-0=http://10.194.6.14:38251}
22-Feb-2019 06:36:51 2019-02-22 06:36:51.518  INFO 22325 --- [           main] o.s.c.d.a.test.NamedChannelTests         : App 'log' has instances: {DIRECTED-GRAPH-DESTINATION2.log-v1-0=http://10.194.6.14:34458}
22-Feb-2019 06:36:51 2019-02-22 06:36:51.518  INFO 22325 --- [           main] o.s.c.d.a.test.NamedChannelTests         : Looking for 'Started LogSink' in logfile for log
22-Feb-2019 06:37:01 2019-02-22 06:37:01.519  INFO 22325 --- [           main] o.s.c.d.a.test.NamedChannelTests         : Requesting log for app DIRECTED-GRAPH-DESTINATION2.log-v1-0
22-Feb-2019 06:37:01 2019-02-22 06:37:01.663  INFO 22325 --- [           main] o.s.c.d.a.test.NamedChannelTests         : Retrieved logfile from 'http://10.194.6.14:34458/logfile
22-Feb-2019 06:37:01 2019-02-22 06:37:01.664  INFO 22325 --- [           main] o.s.c.d.a.test.NamedChannelTests         : Matched all 'Started LogSink' in logfile for instance DIRECTED-GRAPH-DESTINATION2.log-v1-0 of app log
22-Feb-2019 06:37:01 2019-02-22 06:37:01.664  INFO 22325 --- [           main] o.s.c.d.a.test.NamedChannelTests         : Creating stream 'DIRECTED-GRAPH-HTTP-SOURCE'
22-Feb-2019 06:37:01 2019-02-22 06:37:01.686  INFO 22325 --- [           main] o.s.c.d.a.test.NamedChannelTests         : Deploying stream 'DIRECTED-GRAPH-HTTP-SOURCE' with properties: {app.*.logging.file=${PID}-test.log, app.*.endpoints.logfile.sensitive=false, app.*.management.endpoints.web.exposure.include=*}
22-Feb-2019 06:37:02 2019-02-22 06:37:02.119  INFO 22325 --- [           main] o.s.c.d.a.test.NamedChannelTests         : Checking: Stream=DIRECTED-GRAPH-HTTP-SOURCE, status = deploying, status description = The stream is being deployed.
22-Feb-2019 06:37:02 2019-02-22 06:37:02.119  INFO 22325 --- [           main] o.s.c.d.a.test.NamedChannelTests         : Sleeping to check status of Stream=DIRECTED-GRAPH-HTTP-SOURCE
22-Feb-2019 06:37:12 2019-02-22 06:37:12.233  INFO 22325 --- [           main] o.s.c.d.a.test.NamedChannelTests         : Checking: Stream=DIRECTED-GRAPH-HTTP-SOURCE, status = deploying, status description = The stream is being deployed.
22-Feb-2019 06:37:12 2019-02-22 06:37:12.234  INFO 22325 --- [           main] o.s.c.d.a.test.NamedChannelTests         : Sleeping to check status of Stream=DIRECTED-GRAPH-HTTP-SOURCE
22-Feb-2019 06:37:22 2019-02-22 06:37:22.300  INFO 22325 --- [           main] o.s.c.d.a.test.NamedChannelTests         : Checking: Stream=DIRECTED-GRAPH-HTTP-SOURCE, status = deployed, status description = The stream has been successfully deployed
22-Feb-2019 06:37:22 2019-02-22 06:37:22.340  INFO 22325 --- [           main] o.s.c.d.a.test.NamedChannelTests         : Sleeping to check status of Stream=DIRECTED-GRAPH-HTTP-SOURCE
22-Feb-2019 06:37:32 2019-02-22 06:37:32.341  INFO 22325 --- [           main] o.s.c.d.a.test.NamedChannelTests         : Stream 'DIRECTED-GRAPH-HTTP-SOURCE' started with status: deployed
22-Feb-2019 06:37:32 2019-02-22 06:37:32.341  INFO 22325 --- [           main] o.s.c.d.a.test.NamedChannelTests         : App 'router' has instances: {DIRECTED-GRAPH-HTTP-SOURCE.router-v1-0=http://10.194.6.14:57176}
22-Feb-2019 06:37:32 2019-02-22 06:37:32.341  INFO 22325 --- [           main] o.s.c.d.a.test.NamedChannelTests         : App 'http' has instances: {DIRECTED-GRAPH-HTTP-SOURCE.http-v1-0=http://10.194.6.14:30318}
22-Feb-2019 06:37:32 2019-02-22 06:37:32.341  INFO 22325 --- [           main] o.s.c.d.a.test.NamedChannelTests         : Looking for 'Started HttpSource' in logfile for http
22-Feb-2019 06:37:42 2019-02-22 06:37:42.341  INFO 22325 --- [           main] o.s.c.d.a.test.NamedChannelTests         : Requesting log for app DIRECTED-GRAPH-HTTP-SOURCE.http-v1-0
22-Feb-2019 06:37:42 2019-02-22 06:37:42.528  INFO 22325 --- [           main] o.s.c.d.a.test.NamedChannelTests         : Retrieved logfile from 'http://10.194.6.14:30318/logfile
22-Feb-2019 06:37:42 2019-02-22 06:37:42.529  INFO 22325 --- [           main] o.s.c.d.a.test.NamedChannelTests         : Matched all 'Started HttpSource' in logfile for instance DIRECTED-GRAPH-HTTP-SOURCE.http-v1-0 of app http
22-Feb-2019 06:37:42 2019-02-22 06:37:42.677  INFO 22325 --- [           main] o.s.c.d.a.test.NamedChannelTests         : Looking for 'abcd-foo' in logfile for log
22-Feb-2019 06:37:52 2019-02-22 06:37:52.678  INFO 22325 --- [           main] o.s.c.d.a.test.NamedChannelTests         : Requesting log for app DIRECTED-GRAPH-DESTINATION1.log-v1-0
22-Feb-2019 06:37:52 2019-02-22 06:37:52.694  INFO 22325 --- [           main] o.s.c.d.a.test.NamedChannelTests         : Retrieved logfile from 'http://10.194.6.14:21689/logfile
22-Feb-2019 06:37:52 2019-02-22 06:37:52.695  INFO 22325 --- [           main] o.s.c.d.a.test.NamedChannelTests         : Matched all 'abcd-foo' in logfile for instance DIRECTED-GRAPH-DESTINATION1.log-v1-0 of app log
22-Feb-2019 06:37:52 2019-02-22 06:37:52.695  INFO 22325 --- [           main] o.s.c.d.a.test.NamedChannelTests         : Looking for 'defg-bar' in logfile for log
22-Feb-2019 06:38:02 2019-02-22 06:38:02.695  INFO 22325 --- [           main] o.s.c.d.a.test.NamedChannelTests         : Requesting log for app DIRECTED-GRAPH-DESTINATION2.log-v1-0
22-Feb-2019 06:38:02 2019-02-22 06:38:02.707  INFO 22325 --- [           main] o.s.c.d.a.test.NamedChannelTests         : Retrieved logfile from 'http://10.194.6.14:34458/logfile
22-Feb-2019 06:38:02 2019-02-22 06:38:02.707  INFO 22325 --- [           main] o.s.c.d.a.test.NamedChannelTests         : Matched all 'defg-bar' in logfile for instance DIRECTED-GRAPH-DESTINATION2.log-v1-0 of app log
22-Feb-2019 06:38:02 2019-02-22 06:38:02.708  INFO 22325 --- [           main] junit.logTestName                        : Test directedGraphTest(org.springframework.cloud.dataflow.acceptance.test.NamedChannelTests) Succeeded
22-Feb-2019 06:38:02 2019-02-22 06:38:02.708  INFO 22325 --- [           main] junit.logTestName                        : Finished Test directedGraphTest(org.springframework.cloud.dataflow.acceptance.test.NamedChannelTests)
22-Feb-2019 06:38:02 2019-02-22 06:38:02.708  INFO 22325 --- [           main] o.s.c.d.a.test.NamedChannelTests         : Destroy all streams
22-Feb-2019 06:38:03 Tests run: 4, Failures: 0, Errors: 0, Skipped: 0, Time elapsed: 419.771 sec - in org.springframework.cloud.dataflow.acceptance.test.NamedChannelTests
22-Feb-2019 06:38:03 Running org.springframework.cloud.dataflow.acceptance.test.util.PlatformHelperTests
22-Feb-2019 06:38:03 Tests run: 3, Failures: 0, Errors: 0, Skipped: 0, Time elapsed: 0.208 sec - in org.springframework.cloud.dataflow.acceptance.test.util.PlatformHelperTests
22-Feb-2019 06:38:03 Running org.springframework.cloud.dataflow.acceptance.test.util.ApplicationTests
22-Feb-2019 06:38:03 Tests run: 2, Failures: 0, Errors: 0, Skipped: 0, Time elapsed: 0 sec - in org.springframework.cloud.dataflow.acceptance.test.util.ApplicationTests
22-Feb-2019 06:38:03 2019-02-22 06:38:03.724  INFO 22325 --- [       Thread-6] o.s.c.support.GenericApplicationContext  : Closing org.springframework.context.support.GenericApplicationContext@2f4e40d7: startup date [Fri Feb 22 06:26:06 UTC 2019]; root of context hierarchy
22-Feb-2019 06:38:03
22-Feb-2019 06:38:03 Results :
22-Feb-2019 06:38:03
22-Feb-2019 06:38:03 Tests in error:
22-Feb-2019 06:38:03   AnalyticsTests.analyticsTest:62 NullPointer
22-Feb-2019 06:38:03
22-Feb-2019 06:38:03 Tests run: 19, Failures: 0, Errors: 1, Skipped: 2
22-Feb-2019 06:38:03
22-Feb-2019 06:38:03 [INFO] ------------------------------------------------------------------------
22-Feb-2019 06:38:03 [INFO] BUILD FAILURE
22-Feb-2019 06:38:03 [INFO] ------------------------------------------------------------------------
22-Feb-2019 06:38:03 [INFO] Total time: 15:41 min
22-Feb-2019 06:38:03 [INFO] Finished at: 2019-02-22T06:38:03+00:00
22-Feb-2019 06:38:03 [INFO] Final Memory: 56M/465M
22-Feb-2019 06:38:03 [INFO] ------------------------------------------------------------------------
22-Feb-2019 06:38:03 [ERROR] Failed to execute goal org.apache.maven.plugins:maven-surefire-plugin:2.18.1:test (default-test) on project spring-cloud-dataflow-acceptance-tests: There are test failures.
22-Feb-2019 06:38:03 [ERROR]
22-Feb-2019 06:38:03 [ERROR] Please refer to /opt/bamboo-home/xml-data/build-dir/SCDT-LOCAL20XSKIPPER20X-KAFKA/target/surefire-reports for the individual test results.
22-Feb-2019 06:38:03 [ERROR] -> [Help 1]
22-Feb-2019 06:38:03 [ERROR]
22-Feb-2019 06:38:03 [ERROR] To see the full stack trace of the errors, re-run Maven with the -e switch.
22-Feb-2019 06:38:03 [ERROR] Re-run Maven using the -X switch to enable full debug logging.
22-Feb-2019 06:38:03 [ERROR]
22-Feb-2019 06:38:03 [ERROR] For more information about the errors and possible solutions, please read the following articles:
22-Feb-2019 06:38:03 [ERROR] [Help 1] http://cwiki.apache.org/confluence/display/MAVEN/MojoFailureException
22-Feb-2019 06:38:03 Clean up, clean up, everybody everywhere; clean up clean up, everybody do your share!
22-Feb-2019 06:38:03 Killing process PID [22220]
22-Feb-2019 06:38:04 Killing process PID [22059]
22-Feb-2019 06:38:04 No stopped containers
22-Feb-2019 06:38:04 Stopping mysql_mysql_1 ...
22-Feb-2019 06:38:06
22-Feb-2019 06:38:06 Stopping mysql_mysql_1 ... done
22-Feb-2019 06:38:06 Removing mysql_mysql_1 ...
22-Feb-2019 06:38:06
22-Feb-2019 06:38:06 Removing mysql_mysql_1 ... done
22-Feb-2019 06:38:06 Going to remove mysql_mysql_1
22-Feb-2019 06:38:06 Stopping kafka_kafka_1 ...
22-Feb-2019 06:38:06 Stopping kafka_zookeeper_1 ...
22-Feb-2019 06:38:08
22-Feb-2019 06:38:08 Stopping kafka_kafka_1 ... done
22-Feb-2019 06:38:16
22-Feb-2019 06:38:16 Stopping kafka_zookeeper_1 ... done
22-Feb-2019 06:38:17 Removing kafka_kafka_1 ...
22-Feb-2019 06:38:17 Removing kafka_zookeeper_1 ...
22-Feb-2019 06:38:17
22-Feb-2019 06:38:17 Removing kafka_kafka_1 ... done
22-Feb-2019 06:38:17
22-Feb-2019 06:38:17 Removing kafka_zookeeper_1 ... done
22-Feb-2019 06:38:17 Going to remove kafka_kafka_1, kafka_zookeeper_1
22-Feb-2019 06:38:17
22-Feb-2019 06:38:17 Finished task 'Execute Acceptance Tests' with result: Success
22-Feb-2019 06:38:17 Starting task 'JUnit Parser' of type 'com.atlassian.bamboo.plugins.testresultparser:task.testresultparser.junit'
22-Feb-2019 06:38:17 Parsing test results under /opt/bamboo-home/xml-data/build-dir/SCDT-LOCAL20XSKIPPER20X-KAFKA...
22-Feb-2019 06:38:17 Failing task since 1 failing test cases were found.
22-Feb-2019 06:38:17 Finished task 'JUnit Parser' with result: Failed
22-Feb-2019 06:38:17 Starting task 'clean up' of type 'com.atlassian.bamboo.plugins.scripttask:task.builder.script'
22-Feb-2019 06:38:17
Beginning to execute external process for build 'Spring Cloud Data Flow Acceptance Tests - Local + SCDF-2.0.0.BS + Skipper 2.0.0.BS - Run Data Flow Acceptance Tests for Kafka #31 (SCDT-LOCAL20XSKIPPER20X-KAFKA-31)'
... running command line:
/opt/bamboo-home/temp/SCDT-LOCAL20XSKIPPER20X-KAFKA-31-ScriptBuildTask-6592250870145156997.sh
... in: /opt/bamboo-home/xml-data/build-dir/SCDT-LOCAL20XSKIPPER20X-KAFKA
... using extra environment variables:
bamboo_planRepository_1_branch=master
bamboo_********_username_password=********
bamboo_signing_store_password=********
bamboo_capability_system_builder_ant_Ant_1_9=/opt/ant-1.9
bamboo_capability_system_builder_ant_Ant_1_8=/opt/ant-1.8
bamboo_planRepository_1_branchDisplayName=master
bamboo_repository_274694331_git_username=spring-buildmaster
bamboo_capability_system_jdk_OpenJDK_7u181=/opt/openjdk-7
bamboo_repository_revision_number=2f9a4f593c5a25a98239fa34c1388049f2ed6120
bamboo_capability_system_builder_node_Node_js_6=/usr/bin/node
bamboo_RIAK_BIN=/usr/sbin/riak
bamboo_buildKey=SCDT-LOCAL20XSKIPPER20X-KAFKA
bamboo_repository_274694331_branch_name=master
bamboo_bintray_password=********
bamboo_sonar_token_password=********
bamboo_shortJobName=Run Data Flow Acceptance Tests for Kafka
bamboo_capability_system_builder_gradle___gradlew=./gradlew
bamboo_buildResultsUrl=https://build.spring.io/browse/SCDT-LOCAL20XSKIPPER20X-KAFKA-31
bamboo_capability_system_builder_mvn3_Maven_3_3=/opt/maven-3.3
bamboo_capability_system_builder_mvn3_Maven_3_2=/opt/maven-3.2
bamboo_capability_system_builder_mvn3_Maven_3_1=/opt/maven-3.1
bamboo_planRepository_repositoryUrl=https://github.com/spring-cloud/spring-cloud-dataflow-acceptance-tests.git
bamboo_agentId=208568323
bamboo_capability_system_builder_mvn3_Maven_3_5=/opt/maven-3.5
bamboo_capability_system_builder_mvn3_Maven_3_0=/opt/maven-3.0
bamboo_planRepository_revision=2f9a4f593c5a25a98239fa34c1388049f2ed6120
bamboo_planRepository_previousRevision=e71b1f3a017c833d2e206c6c351d519adb5801fc
bamboo_capability_remote_build=true
bamboo_repository_branch_name=master
bamboo_sonatype_token_password=********
bamboo_repository_274694331_name=Git
bamboo_scdf_acceptance_tests_password=********
bamboo_dependenciesDisabled=false
bamboo_repository_274694331_git_branch=master
bamboo_capability_Agent=bamboo-04.af.pivotal.io
bamboo_planRepository_branch=master
bamboo_planRepository_1_type=gitv2
bamboo_planRepository_branchName=master
bamboo_sonar_password=********
bamboo_hg_cache_directory=/opt/bamboo-home/xml-data/build-dir/_hg-repositories-cache
bamboo_planRepository_1_username=spring-buildmaster
bamboo_repository_274694331_git_repositoryUrl=https://github.com/spring-cloud/spring-cloud-dataflow-acceptance-tests.git
bamboo_planRepository_type=gitv2
bamboo_ManualBuildTriggerReason_userName=igopinathan
bamboo_git_cache_directory=/opt/bamboo-home/xml-data/build-dir/_git-repositories-cache
bamboo_artifactory_username=buildmaster
bamboo_tmp_directory=/opt/bamboo-home/temp
bamboo_planKey=SCDT-LOCAL20XSKIPPER20X
bamboo_planRepository_username=spring-buildmaster
bamboo_JDK8_HOME=/opt/jdk-8
bamboo_repository_274694331_previous_revision_number=e71b1f3a017c833d2e206c6c351d519adb5801fc
bamboo_planRepository_1_branchName=master
bamboo_sonar_version=5.6.3
bamboo_capability_system_jdk_JDK_1_11=/opt/jdk-11
bamboo_resultsUrl=https://build.spring.io/browse/SCDT-LOCAL20XSKIPPER20X-KAFKA-31
bamboo_capability_system_jdk_JDK_1_10=/opt/jdk-10
bamboo_build_working_directory=/opt/bamboo-home/xml-data/build-dir/SCDT-LOCAL20XSKIPPER20X-KAFKA
bamboo_planRepository_1_name=Git
bamboo_capability_system_os=ubuntu1604
bamboo_nexusPush_stagingProfile=buildmaster
bamboo_shortPlanName=Local + SCDF-2.0.0.BS + Skipper 2.0.0.BS
bamboo_planRepository_name=Git
bamboo_buildNumber=31
bamboo_planName=Spring Cloud Data Flow Acceptance Tests - Local + SCDF-2.0.0.BS + Skipper 2.0.0.BS
bamboo_JDK7_HOME=/opt/jdk-7
bamboo_build_commandline_com_atlassian_bamboo_plugins_scripttask_task_builder_script_7=/opt/bamboo-home/temp/SCDT-LOCAL20XSKIPPER20X-KAFKA-31-ScriptBuildTask-5755158628657531977.sh
bamboo_shortPlanKey=LOCAL20XSKIPPER20X
bamboo_shortJobKey=KAFKA
bamboo_artifactory_password=********
bamboo_buildTimeStamp=2019-02-22T06:20:09.878Z
bamboo_repository_previous_revision_number=e71b1f3a017c833d2e206c6c351d519adb5801fc
bamboo_sonar_username=buildmaster
bamboo_********_password=********
bamboo_repository_git_branch=master
bamboo_buildResultKey=SCDT-LOCAL20XSKIPPER20X-KAFKA-31
bamboo_nexusPush_close=true
bamboo_buildPlanName=Spring Cloud Data Flow Acceptance Tests - Local + SCDF-2.0.0.BS + Skipper 2.0.0.BS - Run Data Flow Acceptance Tests for Kafka
bamboo_repository_274694331_revision_number=2f9a4f593c5a25a98239fa34c1388049f2ed6120
bamboo_planRepository_1_revision=2f9a4f593c5a25a98239fa34c1388049f2ed6120
bamboo_repository_name=Git
bamboo_signing_key_password=********
bamboo_buildFailed=true
bamboo_capability_system_docker_executable=/usr/bin/docker
bamboo_capability_system_builder_groovy_Groovy_2_4=/opt/groovy-2.4
bamboo_capability_system_builder_command_Bash=/bin/bash
bamboo_jobFailed=true
bamboo_agentWorkingDirectory=/opt/bamboo-home/xml-data/build-dir
bamboo_capability_system_git_executable=/usr/bin/git
bamboo_repository_git_username=spring-buildmaster
bamboo_planRepository_1_previousRevision=e71b1f3a017c833d2e206c6c351d519adb5801fc
bamboo_capability_os_family=unix
bamboo_planRepository_branchDisplayName=master
bamboo_capability_system_builder_maven_Artifactory_Maven_3_5=/opt/maven-3.5
bamboo_capability_system_builder_maven_Artifactory_Maven_3_3=/opt/maven-3.3
bamboo_capability_system_builder_maven_Artifactory_Maven_3_2=/opt/maven-3.2
bamboo_s3_properties=/home/bamboo/tools/s3.properties
bamboo_capability_system_builder_maven_Artifactory_Maven_3_1=/opt/maven-3.1
bamboo_capability_system_builder_maven_Artifactory_Maven_3_0=/opt/maven-3.0
bamboo_plan_storageTag=plan-274497908
bamboo_bintray_username_password=********
bamboo_repository_git_repositoryUrl=https://github.com/spring-cloud/spring-cloud-dataflow-acceptance-tests.git
bamboo_working_directory=/opt/bamboo-home/xml-data/build-dir/SCDT-LOCAL20XSKIPPER20X-KAFKA
bamboo_planRepository_1_repositoryUrl=https://github.com/spring-cloud/spring-cloud-dataflow-acceptance-tests.git
bamboo_capability_system_jdk_JDK_1_8=/opt/jdk-8
bamboo_capability_system_jdk_JDK_1_9=/opt/jdk-9
bamboo_capability_system_jdk_JDK_1_6=/opt/jdk-6
bamboo_sonatype_password=********
bamboo_capability_system_jdk_JDK_1_7=/opt/jdk-7
bamboo_sonar_ip=10.194.6.9
22-Feb-2019 06:38:17 CLEANING UP RESOURCES AFTER RUNNING TESTS
22-Feb-2019 06:38:17 Environment variable JAVA_HOME must be set
22-Feb-2019 06:38:17 FINISHED CLEANING UP RESOURCES
22-Feb-2019 06:38:17 Finished task 'clean up' with result: Success
22-Feb-2019 06:38:17 Running post build plugin 'Docker Container Cleanup'
22-Feb-2019 06:38:17 Running post build plugin 'NCover Results Collector'
22-Feb-2019 06:38:17 Running post build plugin 'Artifactory Release Management Staging'
22-Feb-2019 06:38:17 Running post build plugin 'Artifactory Build Info Copier'
22-Feb-2019 06:38:17 Running post build plugin 'Artifactory Gradle Properties Info Copier'
22-Feb-2019 06:38:17 Running post build plugin 'Clover Results Collector'
22-Feb-2019 06:38:17 Running post build plugin 'npm Cache Cleanup'
22-Feb-2019 06:38:17 Running post build plugin 'Artifact Copier'
22-Feb-2019 06:38:17 Publishing an artifact: Test Results
22-Feb-2019 06:38:17 Finished publishing of artifact Job artifact: [Test Results], pattern: [**/target/surefire-reports/**/*.*] in 42.23 ms
22-Feb-2019 06:38:17 Publishing an artifact: App and Server Logs
22-Feb-2019 06:38:17 Finished publishing of artifact Job artifact: [App and Server Logs], pattern: [**/*.log] anchored at: [local] in 63.22 ms
22-Feb-2019 06:38:17 Successfully removed working directory at '/opt/bamboo-home/xml-data/build-dir/SCDT-LOCAL20XSKIPPER20X-KAFKA'
22-Feb-2019 06:38:17 Finalising the build...
22-Feb-2019 06:38:17 Stopping timer.
22-Feb-2019 06:38:17 Build SCDT-LOCAL20XSKIPPER20X-KAFKA-31 completed.
22-Feb-2019 06:38:17 Running on server: post build plugin 'NCover Results Collector'
22-Feb-2019 06:38:17 Running on server: post build plugin 'Build Hanging Detection Configuration'
22-Feb-2019 06:38:17 Running on server: post build plugin 'Clover Delta Calculator'
22-Feb-2019 06:38:17 Running on server: post build plugin 'Maven Dependencies Postprocessor'
22-Feb-2019 06:38:17 All post build plugins have finished
22-Feb-2019 06:38:17 Generating build results summary...
22-Feb-2019 06:38:17 Saving build results to disk...
22-Feb-2019 06:38:17 Logging substituted variables...
22-Feb-2019 06:38:17 Indexing build results...
22-Feb-2019 06:38:17 Finished building SCDT-LOCAL20XSKIPPER20X-KAFKA-31.