Build: #35 failed

Job: Run Data Flow Acceptance Tests for Kafka failed

Stages & jobs

  1. Test Stage - Kafka

  2. Test Stage - Rabbit

Build log

The build generated 1,667 lines of output.The output is too long and has been truncated to the last 1,000 lines. Download or view full build log

04-Mar-2019 08:44:39         at org.springframework.cloud.dataflow.rest.client.AppRegistryTemplate.importFromResource(AppRegistryTemplate.java:133)
04-Mar-2019 08:44:39         at org.springframework.cloud.dataflow.acceptance.test.AbstractTaskTests.registerTasks(AbstractTaskTests.java:182)
04-Mar-2019 08:44:39         at org.springframework.cloud.dataflow.acceptance.test.AbstractTaskTests.setup(AbstractTaskTests.java:90)
04-Mar-2019 08:44:39         at sun.reflect.NativeMethodAccessorImpl.invoke0(Native Method)
04-Mar-2019 08:44:39         at sun.reflect.NativeMethodAccessorImpl.invoke(NativeMethodAccessorImpl.java:62)
04-Mar-2019 08:44:39         at sun.reflect.DelegatingMethodAccessorImpl.invoke(DelegatingMethodAccessorImpl.java:43)
04-Mar-2019 08:44:39         at java.lang.reflect.Method.invoke(Method.java:498)
04-Mar-2019 08:44:39         at org.junit.runners.model.FrameworkMethod$1.runReflectiveCall(FrameworkMethod.java:50)
04-Mar-2019 08:44:39         at org.junit.internal.runners.model.ReflectiveCallable.run(ReflectiveCallable.java:12)
04-Mar-2019 08:44:39         at org.junit.runners.model.FrameworkMethod.invokeExplosively(FrameworkMethod.java:47)
04-Mar-2019 08:44:39         at org.junit.internal.runners.statements.RunBefores.evaluate(RunBefores.java:24)
04-Mar-2019 08:44:39         at org.springframework.test.context.junit4.statements.RunBeforeTestMethodCallbacks.evaluate(RunBeforeTestMethodCallbacks.java:75)
04-Mar-2019 08:44:39         at org.junit.internal.runners.statements.RunAfters.evaluate(RunAfters.java:27)
04-Mar-2019 08:44:39         at org.springframework.test.context.junit4.statements.RunAfterTestMethodCallbacks.evaluate(RunAfterTestMethodCallbacks.java:86)
04-Mar-2019 08:44:39         at org.junit.rules.TestWatcher$1.evaluate(TestWatcher.java:55)
04-Mar-2019 08:44:39         at org.junit.rules.RunRules.evaluate(RunRules.java:20)
04-Mar-2019 08:44:39         at org.springframework.test.context.junit4.statements.SpringRepeat.evaluate(SpringRepeat.java:84)
04-Mar-2019 08:44:39         at org.junit.runners.ParentRunner.runLeaf(ParentRunner.java:325)
04-Mar-2019 08:44:39         at org.springframework.test.context.junit4.SpringJUnit4ClassRunner.runChild(SpringJUnit4ClassRunner.java:252)
04-Mar-2019 08:44:39         at org.springframework.test.context.junit4.SpringJUnit4ClassRunner.runChild(SpringJUnit4ClassRunner.java:94)
04-Mar-2019 08:44:39         at org.junit.runners.ParentRunner$3.run(ParentRunner.java:290)
04-Mar-2019 08:44:39         at org.junit.runners.ParentRunner$1.schedule(ParentRunner.java:71)
04-Mar-2019 08:44:39         at org.junit.runners.ParentRunner.runChildren(ParentRunner.java:288)
04-Mar-2019 08:44:39         at org.junit.runners.ParentRunner.access$000(ParentRunner.java:58)
04-Mar-2019 08:44:39         at org.junit.runners.ParentRunner$2.evaluate(ParentRunner.java:268)
04-Mar-2019 08:44:39         at org.springframework.test.context.junit4.statements.RunBeforeTestClassCallbacks.evaluate(RunBeforeTestClassCallbacks.java:61)
04-Mar-2019 08:44:39         at org.springframework.test.context.junit4.statements.RunAfterTestClassCallbacks.evaluate(RunAfterTestClassCallbacks.java:70)
04-Mar-2019 08:44:39         at org.junit.runners.ParentRunner.run(ParentRunner.java:363)
04-Mar-2019 08:44:39         at org.springframework.test.context.junit4.SpringJUnit4ClassRunner.run(SpringJUnit4ClassRunner.java:191)
04-Mar-2019 08:44:39         at org.apache.maven.surefire.junit4.JUnit4Provider.execute(JUnit4Provider.java:283)
04-Mar-2019 08:44:39         at org.apache.maven.surefire.junit4.JUnit4Provider.executeWithRerun(JUnit4Provider.java:173)
04-Mar-2019 08:44:39         at org.apache.maven.surefire.junit4.JUnit4Provider.executeTestSet(JUnit4Provider.java:153)
04-Mar-2019 08:44:39         at org.apache.maven.surefire.junit4.JUnit4Provider.invoke(JUnit4Provider.java:128)
04-Mar-2019 08:44:39         at org.apache.maven.surefire.booter.ForkedBooter.invokeProviderInSameClassLoader(ForkedBooter.java:203)
04-Mar-2019 08:44:39         at org.apache.maven.surefire.booter.ForkedBooter.runSuitesInProcess(ForkedBooter.java:155)
04-Mar-2019 08:44:39         at org.apache.maven.surefire.booter.ForkedBooter.main(ForkedBooter.java:103)
04-Mar-2019 08:44:39
04-Mar-2019 08:44:39 timeStampTestsMultipleLaunch(org.springframework.cloud.dataflow.acceptance.test.TimestampTaskTests)  Time elapsed: 0.132 sec  <<< ERROR!
04-Mar-2019 08:44:39 org.springframework.cloud.dataflow.rest.client.DataFlowClientException: Error reading from URL [http://repo.spring.io/libs-release/org/springframework/cloud/task/app/spring-cloud-task-app-descriptor/Elston.RC1/spring-cloud-task-app-descriptor-Elston.RC1.task-apps-maven]
04-Mar-2019 08:44:39
04-Mar-2019 08:44:39         at org.springframework.cloud.dataflow.rest.client.VndErrorResponseErrorHandler.handleError(VndErrorResponseErrorHandler.java:63)
04-Mar-2019 08:44:39         at org.springframework.web.client.RestTemplate.handleResponse(RestTemplate.java:667)
04-Mar-2019 08:44:39         at org.springframework.web.client.RestTemplate.doExecute(RestTemplate.java:620)
04-Mar-2019 08:44:39         at org.springframework.web.client.RestTemplate.execute(RestTemplate.java:580)
04-Mar-2019 08:44:39         at org.springframework.web.client.RestTemplate.postForObject(RestTemplate.java:380)
04-Mar-2019 08:44:39         at org.springframework.cloud.dataflow.rest.client.AppRegistryTemplate.importFromResource(AppRegistryTemplate.java:133)
04-Mar-2019 08:44:39         at org.springframework.cloud.dataflow.acceptance.test.AbstractTaskTests.registerTasks(AbstractTaskTests.java:182)
04-Mar-2019 08:44:39         at org.springframework.cloud.dataflow.acceptance.test.AbstractTaskTests.setup(AbstractTaskTests.java:90)
04-Mar-2019 08:44:39         at sun.reflect.NativeMethodAccessorImpl.invoke0(Native Method)
04-Mar-2019 08:44:39         at sun.reflect.NativeMethodAccessorImpl.invoke(NativeMethodAccessorImpl.java:62)
04-Mar-2019 08:44:39         at sun.reflect.DelegatingMethodAccessorImpl.invoke(DelegatingMethodAccessorImpl.java:43)
04-Mar-2019 08:44:39         at java.lang.reflect.Method.invoke(Method.java:498)
04-Mar-2019 08:44:39         at org.junit.runners.model.FrameworkMethod$1.runReflectiveCall(FrameworkMethod.java:50)
04-Mar-2019 08:44:39         at org.junit.internal.runners.model.ReflectiveCallable.run(ReflectiveCallable.java:12)
04-Mar-2019 08:44:39         at org.junit.runners.model.FrameworkMethod.invokeExplosively(FrameworkMethod.java:47)
04-Mar-2019 08:44:39         at org.junit.internal.runners.statements.RunBefores.evaluate(RunBefores.java:24)
04-Mar-2019 08:44:39         at org.springframework.test.context.junit4.statements.RunBeforeTestMethodCallbacks.evaluate(RunBeforeTestMethodCallbacks.java:75)
04-Mar-2019 08:44:39         at org.junit.internal.runners.statements.RunAfters.evaluate(RunAfters.java:27)
04-Mar-2019 08:44:39         at org.springframework.test.context.junit4.statements.RunAfterTestMethodCallbacks.evaluate(RunAfterTestMethodCallbacks.java:86)
04-Mar-2019 08:44:39         at org.junit.rules.TestWatcher$1.evaluate(TestWatcher.java:55)
04-Mar-2019 08:44:39         at org.junit.rules.RunRules.evaluate(RunRules.java:20)
04-Mar-2019 08:44:39         at org.springframework.test.context.junit4.statements.SpringRepeat.evaluate(SpringRepeat.java:84)
04-Mar-2019 08:44:39         at org.junit.runners.ParentRunner.runLeaf(ParentRunner.java:325)
04-Mar-2019 08:44:39         at org.springframework.test.context.junit4.SpringJUnit4ClassRunner.runChild(SpringJUnit4ClassRunner.java:252)
04-Mar-2019 08:44:39         at org.springframework.test.context.junit4.SpringJUnit4ClassRunner.runChild(SpringJUnit4ClassRunner.java:94)
04-Mar-2019 08:44:39         at org.junit.runners.ParentRunner$3.run(ParentRunner.java:290)
04-Mar-2019 08:44:39         at org.junit.runners.ParentRunner$1.schedule(ParentRunner.java:71)
04-Mar-2019 08:44:39         at org.junit.runners.ParentRunner.runChildren(ParentRunner.java:288)
04-Mar-2019 08:44:39         at org.junit.runners.ParentRunner.access$000(ParentRunner.java:58)
04-Mar-2019 08:44:39         at org.junit.runners.ParentRunner$2.evaluate(ParentRunner.java:268)
04-Mar-2019 08:44:39         at org.springframework.test.context.junit4.statements.RunBeforeTestClassCallbacks.evaluate(RunBeforeTestClassCallbacks.java:61)
04-Mar-2019 08:44:39         at org.springframework.test.context.junit4.statements.RunAfterTestClassCallbacks.evaluate(RunAfterTestClassCallbacks.java:70)
04-Mar-2019 08:44:39         at org.junit.runners.ParentRunner.run(ParentRunner.java:363)
04-Mar-2019 08:44:39         at org.springframework.test.context.junit4.SpringJUnit4ClassRunner.run(SpringJUnit4ClassRunner.java:191)
04-Mar-2019 08:44:39         at org.apache.maven.surefire.junit4.JUnit4Provider.execute(JUnit4Provider.java:283)
04-Mar-2019 08:44:39         at org.apache.maven.surefire.junit4.JUnit4Provider.executeWithRerun(JUnit4Provider.java:173)
04-Mar-2019 08:44:39         at org.apache.maven.surefire.junit4.JUnit4Provider.executeTestSet(JUnit4Provider.java:153)
04-Mar-2019 08:44:39         at org.apache.maven.surefire.junit4.JUnit4Provider.invoke(JUnit4Provider.java:128)
04-Mar-2019 08:44:39         at org.apache.maven.surefire.booter.ForkedBooter.invokeProviderInSameClassLoader(ForkedBooter.java:203)
04-Mar-2019 08:44:39         at org.apache.maven.surefire.booter.ForkedBooter.runSuitesInProcess(ForkedBooter.java:155)
04-Mar-2019 08:44:39         at org.apache.maven.surefire.booter.ForkedBooter.main(ForkedBooter.java:103)
04-Mar-2019 08:44:39
04-Mar-2019 08:44:39 Running org.springframework.cloud.dataflow.acceptance.test.TickTockTests
04-Mar-2019 08:44:39 2019-03-04 08:44:39.125  INFO 11228 --- [           main] .b.t.c.SpringBootTestContextBootstrapper : Neither @ContextConfiguration nor @ContextHierarchy found for test class [org.springframework.cloud.dataflow.acceptance.test.TickTockTests], using SpringBootContextLoader
04-Mar-2019 08:44:39 2019-03-04 08:44:39.143  INFO 11228 --- [           main] .b.t.c.SpringBootTestContextBootstrapper : Loaded default TestExecutionListener class names from location [META-INF/spring.factories]: [org.springframework.boot.test.mock.mockito.MockitoTestExecutionListener, org.springframework.boot.test.mock.mockito.ResetMocksTestExecutionListener, org.springframework.boot.test.autoconfigure.restdocs.RestDocsTestExecutionListener, org.springframework.boot.test.autoconfigure.web.client.MockRestServiceServerResetTestExecutionListener, org.springframework.boot.test.autoconfigure.web.servlet.MockMvcPrintOnlyOnFailureTestExecutionListener, org.springframework.boot.test.autoconfigure.web.servlet.WebDriverTestExecutionListener, org.springframework.test.context.web.ServletTestExecutionListener, org.springframework.test.context.support.DirtiesContextBeforeModesTestExecutionListener, org.springframework.test.context.support.DependencyInjectionTestExecutionListener, org.springframework.test.context.support.DirtiesContextTestExecutionListener, org.springframework.test.context.transaction.TransactionalTestExecutionListener, org.springframework.test.context.jdbc.SqlScriptsTestExecutionListener]
04-Mar-2019 08:44:39 2019-03-04 08:44:39.146  INFO 11228 --- [           main] .b.t.c.SpringBootTestContextBootstrapper : Using TestExecutionListeners: [org.springframework.test.context.web.ServletTestExecutionListener@765ffb14, org.springframework.test.context.support.DirtiesContextBeforeModesTestExecutionListener@57562473, org.springframework.boot.test.autoconfigure.SpringBootDependencyInjectionTestExecutionListener@7a360554, org.springframework.test.context.support.DirtiesContextTestExecutionListener@424de326, org.springframework.test.context.transaction.TransactionalTestExecutionListener@4bc33720, org.springframework.test.context.jdbc.SqlScriptsTestExecutionListener@2dd0f797, org.springframework.boot.test.autoconfigure.web.servlet.MockMvcPrintOnlyOnFailureTestExecutionListener@67064bdc, org.springframework.boot.test.autoconfigure.web.client.MockRestServiceServerResetTestExecutionListener@4a7fd0c9, org.springframework.boot.test.mock.mockito.ResetMocksTestExecutionListener@18578491, org.springframework.boot.test.autoconfigure.web.servlet.WebDriverTestExecutionListener@3291b443, org.springframework.boot.test.autoconfigure.restdocs.RestDocsTestExecutionListener@671c4166, org.springframework.boot.test.mock.mockito.MockitoTestExecutionListener@53d13cd4]
04-Mar-2019 08:44:39 2019-03-04 08:44:39.223  INFO 11228 --- [           main] junit.logTestName                        : Starting Test tickTockUpdateRollbackTests(org.springframework.cloud.dataflow.acceptance.test.TickTockTests)
04-Mar-2019 08:44:39 2019-03-04 08:44:39.231  INFO 11228 --- [           main] o.s.c.d.acceptance.test.TickTockTests    : Importing stream apps from uri resource: http://repo.spring.io/libs-release/org/springframework/cloud/stream/app/spring-cloud-stream-app-descriptor/Einstein.RELEASE/spring-cloud-stream-app-descriptor-Einstein.RELEASE.stream-apps-kafka-10-maven
04-Mar-2019 08:44:39 2019-03-04 08:44:39.346 ERROR 11228 --- [           main] junit.logTestName                        : !!! Test tickTockUpdateRollbackTests(org.springframework.cloud.dataflow.acceptance.test.TickTockTests) Failed !!!
04-Mar-2019 08:44:39
04-Mar-2019 08:44:39 org.springframework.cloud.dataflow.rest.client.DataFlowClientException: Error reading from URL [http://repo.spring.io/libs-release/org/springframework/cloud/stream/app/spring-cloud-stream-app-descriptor/Einstein.RELEASE/spring-cloud-stream-app-descriptor-Einstein.RELEASE.stream-apps-kafka-10-maven]
04-Mar-2019 08:44:39
04-Mar-2019 08:44:39         at org.springframework.cloud.dataflow.rest.client.VndErrorResponseErrorHandler.handleError(VndErrorResponseErrorHandler.java:63)
04-Mar-2019 08:44:39         at org.springframework.web.client.RestTemplate.handleResponse(RestTemplate.java:667)
04-Mar-2019 08:44:39         at org.springframework.web.client.RestTemplate.doExecute(RestTemplate.java:620)
04-Mar-2019 08:44:39         at org.springframework.web.client.RestTemplate.execute(RestTemplate.java:580)
04-Mar-2019 08:44:39         at org.springframework.web.client.RestTemplate.postForObject(RestTemplate.java:380)
04-Mar-2019 08:44:39         at org.springframework.cloud.dataflow.rest.client.AppRegistryTemplate.importFromResource(AppRegistryTemplate.java:133)
04-Mar-2019 08:44:39         at org.springframework.cloud.dataflow.acceptance.test.AbstractStreamTests.registerApps(AbstractStreamTests.java:230)
04-Mar-2019 08:44:39         at org.springframework.cloud.dataflow.acceptance.test.AbstractStreamTests.setup(AbstractStreamTests.java:129)
04-Mar-2019 08:44:39         at sun.reflect.NativeMethodAccessorImpl.invoke0(Native Method)
04-Mar-2019 08:44:39         at sun.reflect.NativeMethodAccessorImpl.invoke(NativeMethodAccessorImpl.java:62)
04-Mar-2019 08:44:39         at sun.reflect.DelegatingMethodAccessorImpl.invoke(DelegatingMethodAccessorImpl.java:43)
04-Mar-2019 08:44:39         at java.lang.reflect.Method.invoke(Method.java:498)
04-Mar-2019 08:44:39         at org.junit.runners.model.FrameworkMethod$1.runReflectiveCall(FrameworkMethod.java:50)
04-Mar-2019 08:44:39         at org.junit.internal.runners.model.ReflectiveCallable.run(ReflectiveCallable.java:12)
04-Mar-2019 08:44:39         at org.junit.runners.model.FrameworkMethod.invokeExplosively(FrameworkMethod.java:47)
04-Mar-2019 08:44:39         at org.junit.internal.runners.statements.RunBefores.evaluate(RunBefores.java:24)
04-Mar-2019 08:44:39         at org.springframework.test.context.junit4.statements.RunBeforeTestMethodCallbacks.evaluate(RunBeforeTestMethodCallbacks.java:75)
04-Mar-2019 08:44:39         at org.springframework.test.context.junit4.statements.RunAfterTestMethodCallbacks.evaluate(RunAfterTestMethodCallbacks.java:86)
04-Mar-2019 08:44:39         at org.junit.rules.TestWatcher$1.evaluate(TestWatcher.java:55)
04-Mar-2019 08:44:39         at org.junit.rules.ExternalResource$1.evaluate(ExternalResource.java:48)
04-Mar-2019 08:44:39         at org.junit.rules.RunRules.evaluate(RunRules.java:20)
04-Mar-2019 08:44:39         at org.springframework.test.context.junit4.statements.SpringRepeat.evaluate(SpringRepeat.java:84)
04-Mar-2019 08:44:39         at org.junit.runners.ParentRunner.runLeaf(ParentRunner.java:325)
04-Mar-2019 08:44:39         at org.springframework.test.context.junit4.SpringJUnit4ClassRunner.runChild(SpringJUnit4ClassRunner.java:252)
04-Mar-2019 08:44:39         at org.springframework.test.context.junit4.SpringJUnit4ClassRunner.runChild(SpringJUnit4ClassRunner.java:94)
04-Mar-2019 08:44:39         at org.junit.runners.ParentRunner$3.run(ParentRunner.java:290)
04-Mar-2019 08:44:39         at org.junit.runners.ParentRunner$1.schedule(ParentRunner.java:71)
04-Mar-2019 08:44:39         at org.junit.runners.ParentRunner.runChildren(ParentRunner.java:288)
04-Mar-2019 08:44:39         at org.junit.runners.ParentRunner.access$000(ParentRunner.java:58)
04-Mar-2019 08:44:39         at org.junit.runners.ParentRunner$2.evaluate(ParentRunner.java:268)
04-Mar-2019 08:44:39         at org.springframework.test.context.junit4.statements.RunBeforeTestClassCallbacks.evaluate(RunBeforeTestClassCallbacks.java:61)
04-Mar-2019 08:44:39         at org.springframework.test.context.junit4.statements.RunAfterTestClassCallbacks.evaluate(RunAfterTestClassCallbacks.java:70)
04-Mar-2019 08:44:39         at org.junit.runners.ParentRunner.run(ParentRunner.java:363)
04-Mar-2019 08:44:39         at org.springframework.test.context.junit4.SpringJUnit4ClassRunner.run(SpringJUnit4ClassRunner.java:191)
04-Mar-2019 08:44:39         at org.apache.maven.surefire.junit4.JUnit4Provider.execute(JUnit4Provider.java:283)
04-Mar-2019 08:44:39         at org.apache.maven.surefire.junit4.JUnit4Provider.executeWithRerun(JUnit4Provider.java:173)
04-Mar-2019 08:44:39         at org.apache.maven.surefire.junit4.JUnit4Provider.executeTestSet(JUnit4Provider.java:153)
04-Mar-2019 08:44:39         at org.apache.maven.surefire.junit4.JUnit4Provider.invoke(JUnit4Provider.java:128)
04-Mar-2019 08:44:39         at org.apache.maven.surefire.booter.ForkedBooter.invokeProviderInSameClassLoader(ForkedBooter.java:203)
04-Mar-2019 08:44:39         at org.apache.maven.surefire.booter.ForkedBooter.runSuitesInProcess(ForkedBooter.java:155)
04-Mar-2019 08:44:39         at org.apache.maven.surefire.booter.ForkedBooter.main(ForkedBooter.java:103)
04-Mar-2019 08:44:39
04-Mar-2019 08:44:39 2019-03-04 08:44:39.347  INFO 11228 --- [           main] junit.logTestName                        : Finished Test tickTockUpdateRollbackTests(org.springframework.cloud.dataflow.acceptance.test.TickTockTests)
04-Mar-2019 08:44:39 2019-03-04 08:44:39.347  INFO 11228 --- [           main] o.s.c.d.acceptance.test.TickTockTests    : Destroy all streams
04-Mar-2019 08:44:39 2019-03-04 08:44:39.426  INFO 11228 --- [           main] junit.logTestName                        : Starting Test tickTockTests(org.springframework.cloud.dataflow.acceptance.test.TickTockTests)
04-Mar-2019 08:44:39 2019-03-04 08:44:39.427  INFO 11228 --- [           main] o.s.c.d.acceptance.test.TickTockTests    : Importing stream apps from uri resource: http://repo.spring.io/libs-release/org/springframework/cloud/stream/app/spring-cloud-stream-app-descriptor/Einstein.RELEASE/spring-cloud-stream-app-descriptor-Einstein.RELEASE.stream-apps-kafka-10-maven
04-Mar-2019 08:44:39 2019-03-04 08:44:39.551 ERROR 11228 --- [           main] junit.logTestName                        : !!! Test tickTockTests(org.springframework.cloud.dataflow.acceptance.test.TickTockTests) Failed !!!
04-Mar-2019 08:44:39
04-Mar-2019 08:44:39 org.springframework.cloud.dataflow.rest.client.DataFlowClientException: Error reading from URL [http://repo.spring.io/libs-release/org/springframework/cloud/stream/app/spring-cloud-stream-app-descriptor/Einstein.RELEASE/spring-cloud-stream-app-descriptor-Einstein.RELEASE.stream-apps-kafka-10-maven]
04-Mar-2019 08:44:39
04-Mar-2019 08:44:39         at org.springframework.cloud.dataflow.rest.client.VndErrorResponseErrorHandler.handleError(VndErrorResponseErrorHandler.java:63)
04-Mar-2019 08:44:39         at org.springframework.web.client.RestTemplate.handleResponse(RestTemplate.java:667)
04-Mar-2019 08:44:39         at org.springframework.web.client.RestTemplate.doExecute(RestTemplate.java:620)
04-Mar-2019 08:44:39         at org.springframework.web.client.RestTemplate.execute(RestTemplate.java:580)
04-Mar-2019 08:44:39         at org.springframework.web.client.RestTemplate.postForObject(RestTemplate.java:380)
04-Mar-2019 08:44:39         at org.springframework.cloud.dataflow.rest.client.AppRegistryTemplate.importFromResource(AppRegistryTemplate.java:133)
04-Mar-2019 08:44:39         at org.springframework.cloud.dataflow.acceptance.test.AbstractStreamTests.registerApps(AbstractStreamTests.java:230)
04-Mar-2019 08:44:39         at org.springframework.cloud.dataflow.acceptance.test.AbstractStreamTests.setup(AbstractStreamTests.java:129)
04-Mar-2019 08:44:39         at sun.reflect.NativeMethodAccessorImpl.invoke0(Native Method)
04-Mar-2019 08:44:39         at sun.reflect.NativeMethodAccessorImpl.invoke(NativeMethodAccessorImpl.java:62)
04-Mar-2019 08:44:39         at sun.reflect.DelegatingMethodAccessorImpl.invoke(DelegatingMethodAccessorImpl.java:43)
04-Mar-2019 08:44:39         at java.lang.reflect.Method.invoke(Method.java:498)
04-Mar-2019 08:44:39         at org.junit.runners.model.FrameworkMethod$1.runReflectiveCall(FrameworkMethod.java:50)
04-Mar-2019 08:44:39         at org.junit.internal.runners.model.ReflectiveCallable.run(ReflectiveCallable.java:12)
04-Mar-2019 08:44:39         at org.junit.runners.model.FrameworkMethod.invokeExplosively(FrameworkMethod.java:47)
04-Mar-2019 08:44:39         at org.junit.internal.runners.statements.RunBefores.evaluate(RunBefores.java:24)
04-Mar-2019 08:44:39         at org.springframework.test.context.junit4.statements.RunBeforeTestMethodCallbacks.evaluate(RunBeforeTestMethodCallbacks.java:75)
04-Mar-2019 08:44:39         at org.springframework.test.context.junit4.statements.RunAfterTestMethodCallbacks.evaluate(RunAfterTestMethodCallbacks.java:86)
04-Mar-2019 08:44:39         at org.junit.rules.TestWatcher$1.evaluate(TestWatcher.java:55)
04-Mar-2019 08:44:39         at org.junit.rules.ExternalResource$1.evaluate(ExternalResource.java:48)
04-Mar-2019 08:44:39         at org.junit.rules.RunRules.evaluate(RunRules.java:20)
04-Mar-2019 08:44:39         at org.springframework.test.context.junit4.statements.SpringRepeat.evaluate(SpringRepeat.java:84)
04-Mar-2019 08:44:39         at org.junit.runners.ParentRunner.runLeaf(ParentRunner.java:325)
04-Mar-2019 08:44:39         at org.springframework.test.context.junit4.SpringJUnit4ClassRunner.runChild(SpringJUnit4ClassRunner.java:252)
04-Mar-2019 08:44:39         at org.springframework.test.context.junit4.SpringJUnit4ClassRunner.runChild(SpringJUnit4ClassRunner.java:94)
04-Mar-2019 08:44:39         at org.junit.runners.ParentRunner$3.run(ParentRunner.java:290)
04-Mar-2019 08:44:39         at org.junit.runners.ParentRunner$1.schedule(ParentRunner.java:71)
04-Mar-2019 08:44:39         at org.junit.runners.ParentRunner.runChildren(ParentRunner.java:288)
04-Mar-2019 08:44:39         at org.junit.runners.ParentRunner.access$000(ParentRunner.java:58)
04-Mar-2019 08:44:39         at org.junit.runners.ParentRunner$2.evaluate(ParentRunner.java:268)
04-Mar-2019 08:44:39         at org.springframework.test.context.junit4.statements.RunBeforeTestClassCallbacks.evaluate(RunBeforeTestClassCallbacks.java:61)
04-Mar-2019 08:44:39         at org.springframework.test.context.junit4.statements.RunAfterTestClassCallbacks.evaluate(RunAfterTestClassCallbacks.java:70)
04-Mar-2019 08:44:39         at org.junit.runners.ParentRunner.run(ParentRunner.java:363)
04-Mar-2019 08:44:39         at org.springframework.test.context.junit4.SpringJUnit4ClassRunner.run(SpringJUnit4ClassRunner.java:191)
04-Mar-2019 08:44:39         at org.apache.maven.surefire.junit4.JUnit4Provider.execute(JUnit4Provider.java:283)
04-Mar-2019 08:44:39         at org.apache.maven.surefire.junit4.JUnit4Provider.executeWithRerun(JUnit4Provider.java:173)
04-Mar-2019 08:44:39         at org.apache.maven.surefire.junit4.JUnit4Provider.executeTestSet(JUnit4Provider.java:153)
04-Mar-2019 08:44:39         at org.apache.maven.surefire.junit4.JUnit4Provider.invoke(JUnit4Provider.java:128)
04-Mar-2019 08:44:39         at org.apache.maven.surefire.booter.ForkedBooter.invokeProviderInSameClassLoader(ForkedBooter.java:203)
04-Mar-2019 08:44:39         at org.apache.maven.surefire.booter.ForkedBooter.runSuitesInProcess(ForkedBooter.java:155)
04-Mar-2019 08:44:39         at org.apache.maven.surefire.booter.ForkedBooter.main(ForkedBooter.java:103)
04-Mar-2019 08:44:39
04-Mar-2019 08:44:39 2019-03-04 08:44:39.552  INFO 11228 --- [           main] junit.logTestName                        : Finished Test tickTockTests(org.springframework.cloud.dataflow.acceptance.test.TickTockTests)
04-Mar-2019 08:44:39 2019-03-04 08:44:39.552  INFO 11228 --- [           main] o.s.c.d.acceptance.test.TickTockTests    : Destroy all streams
04-Mar-2019 08:44:39 2019-03-04 08:44:39.648  INFO 11228 --- [           main] junit.logTestName                        : Starting Test tickTockTestsFromConfigServer(org.springframework.cloud.dataflow.acceptance.test.TickTockTests)
04-Mar-2019 08:44:39 2019-03-04 08:44:39.649  INFO 11228 --- [           main] o.s.c.d.acceptance.test.TickTockTests    : Importing stream apps from uri resource: http://repo.spring.io/libs-release/org/springframework/cloud/stream/app/spring-cloud-stream-app-descriptor/Einstein.RELEASE/spring-cloud-stream-app-descriptor-Einstein.RELEASE.stream-apps-kafka-10-maven
04-Mar-2019 08:44:40 2019-03-04 08:44:40.515 ERROR 11228 --- [           main] junit.logTestName                        : !!! Test tickTockTestsFromConfigServer(org.springframework.cloud.dataflow.acceptance.test.TickTockTests) Failed !!!
04-Mar-2019 08:44:40
04-Mar-2019 08:44:40 org.springframework.cloud.dataflow.rest.client.DataFlowClientException: Error reading from URL [http://repo.spring.io/libs-release/org/springframework/cloud/stream/app/spring-cloud-stream-app-descriptor/Einstein.RELEASE/spring-cloud-stream-app-descriptor-Einstein.RELEASE.stream-apps-kafka-10-maven]
04-Mar-2019 08:44:40
04-Mar-2019 08:44:40         at org.springframework.cloud.dataflow.rest.client.VndErrorResponseErrorHandler.handleError(VndErrorResponseErrorHandler.java:63)
04-Mar-2019 08:44:40         at org.springframework.web.client.RestTemplate.handleResponse(RestTemplate.java:667)
04-Mar-2019 08:44:40         at org.springframework.web.client.RestTemplate.doExecute(RestTemplate.java:620)
04-Mar-2019 08:44:40         at org.springframework.web.client.RestTemplate.execute(RestTemplate.java:580)
04-Mar-2019 08:44:40         at org.springframework.web.client.RestTemplate.postForObject(RestTemplate.java:380)
04-Mar-2019 08:44:40         at org.springframework.cloud.dataflow.rest.client.AppRegistryTemplate.importFromResource(AppRegistryTemplate.java:133)
04-Mar-2019 08:44:40         at org.springframework.cloud.dataflow.acceptance.test.AbstractStreamTests.registerApps(AbstractStreamTests.java:230)
04-Mar-2019 08:44:40         at org.springframework.cloud.dataflow.acceptance.test.AbstractStreamTests.setup(AbstractStreamTests.java:129)
04-Mar-2019 08:44:40         at sun.reflect.NativeMethodAccessorImpl.invoke0(Native Method)
04-Mar-2019 08:44:40         at sun.reflect.NativeMethodAccessorImpl.invoke(NativeMethodAccessorImpl.java:62)
04-Mar-2019 08:44:40         at sun.reflect.DelegatingMethodAccessorImpl.invoke(DelegatingMethodAccessorImpl.java:43)
04-Mar-2019 08:44:40         at java.lang.reflect.Method.invoke(Method.java:498)
04-Mar-2019 08:44:40         at org.junit.runners.model.FrameworkMethod$1.runReflectiveCall(FrameworkMethod.java:50)
04-Mar-2019 08:44:40         at org.junit.internal.runners.model.ReflectiveCallable.run(ReflectiveCallable.java:12)
04-Mar-2019 08:44:40         at org.junit.runners.model.FrameworkMethod.invokeExplosively(FrameworkMethod.java:47)
04-Mar-2019 08:44:40         at org.junit.internal.runners.statements.RunBefores.evaluate(RunBefores.java:24)
04-Mar-2019 08:44:40         at org.springframework.test.context.junit4.statements.RunBeforeTestMethodCallbacks.evaluate(RunBeforeTestMethodCallbacks.java:75)
04-Mar-2019 08:44:40         at org.springframework.test.context.junit4.statements.RunAfterTestMethodCallbacks.evaluate(RunAfterTestMethodCallbacks.java:86)
04-Mar-2019 08:44:40         at org.junit.rules.TestWatcher$1.evaluate(TestWatcher.java:55)
04-Mar-2019 08:44:40         at org.junit.rules.ExternalResource$1.evaluate(ExternalResource.java:48)
04-Mar-2019 08:44:40         at org.junit.rules.RunRules.evaluate(RunRules.java:20)
04-Mar-2019 08:44:40         at org.springframework.test.context.junit4.statements.SpringRepeat.evaluate(SpringRepeat.java:84)
04-Mar-2019 08:44:40         at org.junit.runners.ParentRunner.runLeaf(ParentRunner.java:325)
04-Mar-2019 08:44:40         at org.springframework.test.context.junit4.SpringJUnit4ClassRunner.runChild(SpringJUnit4ClassRunner.java:252)
04-Mar-2019 08:44:40         at org.springframework.test.context.junit4.SpringJUnit4ClassRunner.runChild(SpringJUnit4ClassRunner.java:94)
04-Mar-2019 08:44:40         at org.junit.runners.ParentRunner$3.run(ParentRunner.java:290)
04-Mar-2019 08:44:40         at org.junit.runners.ParentRunner$1.schedule(ParentRunner.java:71)
04-Mar-2019 08:44:40         at org.junit.runners.ParentRunner.runChildren(ParentRunner.java:288)
04-Mar-2019 08:44:40         at org.junit.runners.ParentRunner.access$000(ParentRunner.java:58)
04-Mar-2019 08:44:40         at org.junit.runners.ParentRunner$2.evaluate(ParentRunner.java:268)
04-Mar-2019 08:44:40         at org.springframework.test.context.junit4.statements.RunBeforeTestClassCallbacks.evaluate(RunBeforeTestClassCallbacks.java:61)
04-Mar-2019 08:44:40         at org.springframework.test.context.junit4.statements.RunAfterTestClassCallbacks.evaluate(RunAfterTestClassCallbacks.java:70)
04-Mar-2019 08:44:40         at org.junit.runners.ParentRunner.run(ParentRunner.java:363)
04-Mar-2019 08:44:40         at org.springframework.test.context.junit4.SpringJUnit4ClassRunner.run(SpringJUnit4ClassRunner.java:191)
04-Mar-2019 08:44:40         at org.apache.maven.surefire.junit4.JUnit4Provider.execute(JUnit4Provider.java:283)
04-Mar-2019 08:44:40         at org.apache.maven.surefire.junit4.JUnit4Provider.executeWithRerun(JUnit4Provider.java:173)
04-Mar-2019 08:44:40         at org.apache.maven.surefire.junit4.JUnit4Provider.executeTestSet(JUnit4Provider.java:153)
04-Mar-2019 08:44:40         at org.apache.maven.surefire.junit4.JUnit4Provider.invoke(JUnit4Provider.java:128)
04-Mar-2019 08:44:40         at org.apache.maven.surefire.booter.ForkedBooter.invokeProviderInSameClassLoader(ForkedBooter.java:203)
04-Mar-2019 08:44:40         at org.apache.maven.surefire.booter.ForkedBooter.runSuitesInProcess(ForkedBooter.java:155)
04-Mar-2019 08:44:40         at org.apache.maven.surefire.booter.ForkedBooter.main(ForkedBooter.java:103)
04-Mar-2019 08:44:40
04-Mar-2019 08:44:40 2019-03-04 08:44:40.515  INFO 11228 --- [           main] junit.logTestName                        : Finished Test tickTockTestsFromConfigServer(org.springframework.cloud.dataflow.acceptance.test.TickTockTests)
04-Mar-2019 08:44:40 2019-03-04 08:44:40.515  INFO 11228 --- [           main] o.s.c.d.acceptance.test.TickTockTests    : Destroy all streams
04-Mar-2019 08:44:40 Tests run: 3, Failures: 0, Errors: 3, Skipped: 0, Time elapsed: 1.373 sec <<< FAILURE! - in org.springframework.cloud.dataflow.acceptance.test.TickTockTests
04-Mar-2019 08:44:40 tickTockUpdateRollbackTests(org.springframework.cloud.dataflow.acceptance.test.TickTockTests)  Time elapsed: 0.13 sec  <<< ERROR!
04-Mar-2019 08:44:40 org.springframework.cloud.dataflow.rest.client.DataFlowClientException: Error reading from URL [http://repo.spring.io/libs-release/org/springframework/cloud/stream/app/spring-cloud-stream-app-descriptor/Einstein.RELEASE/spring-cloud-stream-app-descriptor-Einstein.RELEASE.stream-apps-kafka-10-maven]
04-Mar-2019 08:44:40
04-Mar-2019 08:44:40         at org.springframework.cloud.dataflow.rest.client.VndErrorResponseErrorHandler.handleError(VndErrorResponseErrorHandler.java:63)
04-Mar-2019 08:44:40         at org.springframework.web.client.RestTemplate.handleResponse(RestTemplate.java:667)
04-Mar-2019 08:44:40         at org.springframework.web.client.RestTemplate.doExecute(RestTemplate.java:620)
04-Mar-2019 08:44:40         at org.springframework.web.client.RestTemplate.execute(RestTemplate.java:580)
04-Mar-2019 08:44:40         at org.springframework.web.client.RestTemplate.postForObject(RestTemplate.java:380)
04-Mar-2019 08:44:40         at org.springframework.cloud.dataflow.rest.client.AppRegistryTemplate.importFromResource(AppRegistryTemplate.java:133)
04-Mar-2019 08:44:40         at org.springframework.cloud.dataflow.acceptance.test.AbstractStreamTests.registerApps(AbstractStreamTests.java:230)
04-Mar-2019 08:44:40         at org.springframework.cloud.dataflow.acceptance.test.AbstractStreamTests.setup(AbstractStreamTests.java:129)
04-Mar-2019 08:44:40         at sun.reflect.NativeMethodAccessorImpl.invoke0(Native Method)
04-Mar-2019 08:44:40         at sun.reflect.NativeMethodAccessorImpl.invoke(NativeMethodAccessorImpl.java:62)
04-Mar-2019 08:44:40         at sun.reflect.DelegatingMethodAccessorImpl.invoke(DelegatingMethodAccessorImpl.java:43)
04-Mar-2019 08:44:40         at java.lang.reflect.Method.invoke(Method.java:498)
04-Mar-2019 08:44:40         at org.junit.runners.model.FrameworkMethod$1.runReflectiveCall(FrameworkMethod.java:50)
04-Mar-2019 08:44:40         at org.junit.internal.runners.model.ReflectiveCallable.run(ReflectiveCallable.java:12)
04-Mar-2019 08:44:40         at org.junit.runners.model.FrameworkMethod.invokeExplosively(FrameworkMethod.java:47)
04-Mar-2019 08:44:40         at org.junit.internal.runners.statements.RunBefores.evaluate(RunBefores.java:24)
04-Mar-2019 08:44:40         at org.springframework.test.context.junit4.statements.RunBeforeTestMethodCallbacks.evaluate(RunBeforeTestMethodCallbacks.java:75)
04-Mar-2019 08:44:40         at org.springframework.test.context.junit4.statements.RunAfterTestMethodCallbacks.evaluate(RunAfterTestMethodCallbacks.java:86)
04-Mar-2019 08:44:40         at org.junit.rules.TestWatcher$1.evaluate(TestWatcher.java:55)
04-Mar-2019 08:44:40         at org.junit.rules.ExternalResource$1.evaluate(ExternalResource.java:48)
04-Mar-2019 08:44:40         at org.junit.rules.RunRules.evaluate(RunRules.java:20)
04-Mar-2019 08:44:40         at org.springframework.test.context.junit4.statements.SpringRepeat.evaluate(SpringRepeat.java:84)
04-Mar-2019 08:44:40         at org.junit.runners.ParentRunner.runLeaf(ParentRunner.java:325)
04-Mar-2019 08:44:40         at org.springframework.test.context.junit4.SpringJUnit4ClassRunner.runChild(SpringJUnit4ClassRunner.java:252)
04-Mar-2019 08:44:40         at org.springframework.test.context.junit4.SpringJUnit4ClassRunner.runChild(SpringJUnit4ClassRunner.java:94)
04-Mar-2019 08:44:40         at org.junit.runners.ParentRunner$3.run(ParentRunner.java:290)
04-Mar-2019 08:44:40         at org.junit.runners.ParentRunner$1.schedule(ParentRunner.java:71)
04-Mar-2019 08:44:40         at org.junit.runners.ParentRunner.runChildren(ParentRunner.java:288)
04-Mar-2019 08:44:40         at org.junit.runners.ParentRunner.access$000(ParentRunner.java:58)
04-Mar-2019 08:44:40         at org.junit.runners.ParentRunner$2.evaluate(ParentRunner.java:268)
04-Mar-2019 08:44:40         at org.springframework.test.context.junit4.statements.RunBeforeTestClassCallbacks.evaluate(RunBeforeTestClassCallbacks.java:61)
04-Mar-2019 08:44:40         at org.springframework.test.context.junit4.statements.RunAfterTestClassCallbacks.evaluate(RunAfterTestClassCallbacks.java:70)
04-Mar-2019 08:44:40         at org.junit.runners.ParentRunner.run(ParentRunner.java:363)
04-Mar-2019 08:44:40         at org.springframework.test.context.junit4.SpringJUnit4ClassRunner.run(SpringJUnit4ClassRunner.java:191)
04-Mar-2019 08:44:40         at org.apache.maven.surefire.junit4.JUnit4Provider.execute(JUnit4Provider.java:283)
04-Mar-2019 08:44:40         at org.apache.maven.surefire.junit4.JUnit4Provider.executeWithRerun(JUnit4Provider.java:173)
04-Mar-2019 08:44:40         at org.apache.maven.surefire.junit4.JUnit4Provider.executeTestSet(JUnit4Provider.java:153)
04-Mar-2019 08:44:40         at org.apache.maven.surefire.junit4.JUnit4Provider.invoke(JUnit4Provider.java:128)
04-Mar-2019 08:44:40         at org.apache.maven.surefire.booter.ForkedBooter.invokeProviderInSameClassLoader(ForkedBooter.java:203)
04-Mar-2019 08:44:40         at org.apache.maven.surefire.booter.ForkedBooter.runSuitesInProcess(ForkedBooter.java:155)
04-Mar-2019 08:44:40         at org.apache.maven.surefire.booter.ForkedBooter.main(ForkedBooter.java:103)
04-Mar-2019 08:44:40
04-Mar-2019 08:44:40 tickTockTests(org.springframework.cloud.dataflow.acceptance.test.TickTockTests)  Time elapsed: 0.134 sec  <<< ERROR!
04-Mar-2019 08:44:40 org.springframework.cloud.dataflow.rest.client.DataFlowClientException: Error reading from URL [http://repo.spring.io/libs-release/org/springframework/cloud/stream/app/spring-cloud-stream-app-descriptor/Einstein.RELEASE/spring-cloud-stream-app-descriptor-Einstein.RELEASE.stream-apps-kafka-10-maven]
04-Mar-2019 08:44:40
04-Mar-2019 08:44:40         at org.springframework.cloud.dataflow.rest.client.VndErrorResponseErrorHandler.handleError(VndErrorResponseErrorHandler.java:63)
04-Mar-2019 08:44:40         at org.springframework.web.client.RestTemplate.handleResponse(RestTemplate.java:667)
04-Mar-2019 08:44:40         at org.springframework.web.client.RestTemplate.doExecute(RestTemplate.java:620)
04-Mar-2019 08:44:40         at org.springframework.web.client.RestTemplate.execute(RestTemplate.java:580)
04-Mar-2019 08:44:40         at org.springframework.web.client.RestTemplate.postForObject(RestTemplate.java:380)
04-Mar-2019 08:44:40         at org.springframework.cloud.dataflow.rest.client.AppRegistryTemplate.importFromResource(AppRegistryTemplate.java:133)
04-Mar-2019 08:44:40         at org.springframework.cloud.dataflow.acceptance.test.AbstractStreamTests.registerApps(AbstractStreamTests.java:230)
04-Mar-2019 08:44:40         at org.springframework.cloud.dataflow.acceptance.test.AbstractStreamTests.setup(AbstractStreamTests.java:129)
04-Mar-2019 08:44:40         at sun.reflect.NativeMethodAccessorImpl.invoke0(Native Method)
04-Mar-2019 08:44:40         at sun.reflect.NativeMethodAccessorImpl.invoke(NativeMethodAccessorImpl.java:62)
04-Mar-2019 08:44:40         at sun.reflect.DelegatingMethodAccessorImpl.invoke(DelegatingMethodAccessorImpl.java:43)
04-Mar-2019 08:44:40         at java.lang.reflect.Method.invoke(Method.java:498)
04-Mar-2019 08:44:40         at org.junit.runners.model.FrameworkMethod$1.runReflectiveCall(FrameworkMethod.java:50)
04-Mar-2019 08:44:40         at org.junit.internal.runners.model.ReflectiveCallable.run(ReflectiveCallable.java:12)
04-Mar-2019 08:44:40         at org.junit.runners.model.FrameworkMethod.invokeExplosively(FrameworkMethod.java:47)
04-Mar-2019 08:44:40         at org.junit.internal.runners.statements.RunBefores.evaluate(RunBefores.java:24)
04-Mar-2019 08:44:40         at org.springframework.test.context.junit4.statements.RunBeforeTestMethodCallbacks.evaluate(RunBeforeTestMethodCallbacks.java:75)
04-Mar-2019 08:44:40         at org.springframework.test.context.junit4.statements.RunAfterTestMethodCallbacks.evaluate(RunAfterTestMethodCallbacks.java:86)
04-Mar-2019 08:44:40         at org.junit.rules.TestWatcher$1.evaluate(TestWatcher.java:55)
04-Mar-2019 08:44:40         at org.junit.rules.ExternalResource$1.evaluate(ExternalResource.java:48)
04-Mar-2019 08:44:40         at org.junit.rules.RunRules.evaluate(RunRules.java:20)
04-Mar-2019 08:44:40         at org.springframework.test.context.junit4.statements.SpringRepeat.evaluate(SpringRepeat.java:84)
04-Mar-2019 08:44:40         at org.junit.runners.ParentRunner.runLeaf(ParentRunner.java:325)
04-Mar-2019 08:44:40         at org.springframework.test.context.junit4.SpringJUnit4ClassRunner.runChild(SpringJUnit4ClassRunner.java:252)
04-Mar-2019 08:44:40         at org.springframework.test.context.junit4.SpringJUnit4ClassRunner.runChild(SpringJUnit4ClassRunner.java:94)
04-Mar-2019 08:44:40         at org.junit.runners.ParentRunner$3.run(ParentRunner.java:290)
04-Mar-2019 08:44:40         at org.junit.runners.ParentRunner$1.schedule(ParentRunner.java:71)
04-Mar-2019 08:44:40         at org.junit.runners.ParentRunner.runChildren(ParentRunner.java:288)
04-Mar-2019 08:44:40         at org.junit.runners.ParentRunner.access$000(ParentRunner.java:58)
04-Mar-2019 08:44:40         at org.junit.runners.ParentRunner$2.evaluate(ParentRunner.java:268)
04-Mar-2019 08:44:40         at org.springframework.test.context.junit4.statements.RunBeforeTestClassCallbacks.evaluate(RunBeforeTestClassCallbacks.java:61)
04-Mar-2019 08:44:40         at org.springframework.test.context.junit4.statements.RunAfterTestClassCallbacks.evaluate(RunAfterTestClassCallbacks.java:70)
04-Mar-2019 08:44:40         at org.junit.runners.ParentRunner.run(ParentRunner.java:363)
04-Mar-2019 08:44:40         at org.springframework.test.context.junit4.SpringJUnit4ClassRunner.run(SpringJUnit4ClassRunner.java:191)
04-Mar-2019 08:44:40         at org.apache.maven.surefire.junit4.JUnit4Provider.execute(JUnit4Provider.java:283)
04-Mar-2019 08:44:40         at org.apache.maven.surefire.junit4.JUnit4Provider.executeWithRerun(JUnit4Provider.java:173)
04-Mar-2019 08:44:40         at org.apache.maven.surefire.junit4.JUnit4Provider.executeTestSet(JUnit4Provider.java:153)
04-Mar-2019 08:44:40         at org.apache.maven.surefire.junit4.JUnit4Provider.invoke(JUnit4Provider.java:128)
04-Mar-2019 08:44:40         at org.apache.maven.surefire.booter.ForkedBooter.invokeProviderInSameClassLoader(ForkedBooter.java:203)
04-Mar-2019 08:44:40         at org.apache.maven.surefire.booter.ForkedBooter.runSuitesInProcess(ForkedBooter.java:155)
04-Mar-2019 08:44:40         at org.apache.maven.surefire.booter.ForkedBooter.main(ForkedBooter.java:103)
04-Mar-2019 08:44:40
04-Mar-2019 08:44:40 tickTockTestsFromConfigServer(org.springframework.cloud.dataflow.acceptance.test.TickTockTests)  Time elapsed: 0.878 sec  <<< ERROR!
04-Mar-2019 08:44:40 org.springframework.cloud.dataflow.rest.client.DataFlowClientException: Error reading from URL [http://repo.spring.io/libs-release/org/springframework/cloud/stream/app/spring-cloud-stream-app-descriptor/Einstein.RELEASE/spring-cloud-stream-app-descriptor-Einstein.RELEASE.stream-apps-kafka-10-maven]
04-Mar-2019 08:44:40
04-Mar-2019 08:44:40         at org.springframework.cloud.dataflow.rest.client.VndErrorResponseErrorHandler.handleError(VndErrorResponseErrorHandler.java:63)
04-Mar-2019 08:44:40         at org.springframework.web.client.RestTemplate.handleResponse(RestTemplate.java:667)
04-Mar-2019 08:44:40         at org.springframework.web.client.RestTemplate.doExecute(RestTemplate.java:620)
04-Mar-2019 08:44:40         at org.springframework.web.client.RestTemplate.execute(RestTemplate.java:580)
04-Mar-2019 08:44:40         at org.springframework.web.client.RestTemplate.postForObject(RestTemplate.java:380)
04-Mar-2019 08:44:40         at org.springframework.cloud.dataflow.rest.client.AppRegistryTemplate.importFromResource(AppRegistryTemplate.java:133)
04-Mar-2019 08:44:40         at org.springframework.cloud.dataflow.acceptance.test.AbstractStreamTests.registerApps(AbstractStreamTests.java:230)
04-Mar-2019 08:44:40         at org.springframework.cloud.dataflow.acceptance.test.AbstractStreamTests.setup(AbstractStreamTests.java:129)
04-Mar-2019 08:44:40         at sun.reflect.NativeMethodAccessorImpl.invoke0(Native Method)
04-Mar-2019 08:44:40         at sun.reflect.NativeMethodAccessorImpl.invoke(NativeMethodAccessorImpl.java:62)
04-Mar-2019 08:44:40         at sun.reflect.DelegatingMethodAccessorImpl.invoke(DelegatingMethodAccessorImpl.java:43)
04-Mar-2019 08:44:40         at java.lang.reflect.Method.invoke(Method.java:498)
04-Mar-2019 08:44:40         at org.junit.runners.model.FrameworkMethod$1.runReflectiveCall(FrameworkMethod.java:50)
04-Mar-2019 08:44:40         at org.junit.internal.runners.model.ReflectiveCallable.run(ReflectiveCallable.java:12)
04-Mar-2019 08:44:40         at org.junit.runners.model.FrameworkMethod.invokeExplosively(FrameworkMethod.java:47)
04-Mar-2019 08:44:40         at org.junit.internal.runners.statements.RunBefores.evaluate(RunBefores.java:24)
04-Mar-2019 08:44:40         at org.springframework.test.context.junit4.statements.RunBeforeTestMethodCallbacks.evaluate(RunBeforeTestMethodCallbacks.java:75)
04-Mar-2019 08:44:40         at org.springframework.test.context.junit4.statements.RunAfterTestMethodCallbacks.evaluate(RunAfterTestMethodCallbacks.java:86)
04-Mar-2019 08:44:40         at org.junit.rules.TestWatcher$1.evaluate(TestWatcher.java:55)
04-Mar-2019 08:44:40         at org.junit.rules.ExternalResource$1.evaluate(ExternalResource.java:48)
04-Mar-2019 08:44:40         at org.junit.rules.RunRules.evaluate(RunRules.java:20)
04-Mar-2019 08:44:40         at org.springframework.test.context.junit4.statements.SpringRepeat.evaluate(SpringRepeat.java:84)
04-Mar-2019 08:44:40         at org.junit.runners.ParentRunner.runLeaf(ParentRunner.java:325)
04-Mar-2019 08:44:40         at org.springframework.test.context.junit4.SpringJUnit4ClassRunner.runChild(SpringJUnit4ClassRunner.java:252)
04-Mar-2019 08:44:40         at org.springframework.test.context.junit4.SpringJUnit4ClassRunner.runChild(SpringJUnit4ClassRunner.java:94)
04-Mar-2019 08:44:40         at org.junit.runners.ParentRunner$3.run(ParentRunner.java:290)
04-Mar-2019 08:44:40         at org.junit.runners.ParentRunner$1.schedule(ParentRunner.java:71)
04-Mar-2019 08:44:40         at org.junit.runners.ParentRunner.runChildren(ParentRunner.java:288)
04-Mar-2019 08:44:40         at org.junit.runners.ParentRunner.access$000(ParentRunner.java:58)
04-Mar-2019 08:44:40         at org.junit.runners.ParentRunner$2.evaluate(ParentRunner.java:268)
04-Mar-2019 08:44:40         at org.springframework.test.context.junit4.statements.RunBeforeTestClassCallbacks.evaluate(RunBeforeTestClassCallbacks.java:61)
04-Mar-2019 08:44:40         at org.springframework.test.context.junit4.statements.RunAfterTestClassCallbacks.evaluate(RunAfterTestClassCallbacks.java:70)
04-Mar-2019 08:44:40         at org.junit.runners.ParentRunner.run(ParentRunner.java:363)
04-Mar-2019 08:44:40         at org.springframework.test.context.junit4.SpringJUnit4ClassRunner.run(SpringJUnit4ClassRunner.java:191)
04-Mar-2019 08:44:40         at org.apache.maven.surefire.junit4.JUnit4Provider.execute(JUnit4Provider.java:283)
04-Mar-2019 08:44:40         at org.apache.maven.surefire.junit4.JUnit4Provider.executeWithRerun(JUnit4Provider.java:173)
04-Mar-2019 08:44:40         at org.apache.maven.surefire.junit4.JUnit4Provider.executeTestSet(JUnit4Provider.java:153)
04-Mar-2019 08:44:40         at org.apache.maven.surefire.junit4.JUnit4Provider.invoke(JUnit4Provider.java:128)
04-Mar-2019 08:44:40         at org.apache.maven.surefire.booter.ForkedBooter.invokeProviderInSameClassLoader(ForkedBooter.java:203)
04-Mar-2019 08:44:40         at org.apache.maven.surefire.booter.ForkedBooter.runSuitesInProcess(ForkedBooter.java:155)
04-Mar-2019 08:44:40         at org.apache.maven.surefire.booter.ForkedBooter.main(ForkedBooter.java:103)
04-Mar-2019 08:44:40
04-Mar-2019 08:44:40 Running org.springframework.cloud.dataflow.acceptance.test.TransformTests
04-Mar-2019 08:44:40 2019-03-04 08:44:40.522  INFO 11228 --- [           main] .b.t.c.SpringBootTestContextBootstrapper : Neither @ContextConfiguration nor @ContextHierarchy found for test class [org.springframework.cloud.dataflow.acceptance.test.TransformTests], using SpringBootContextLoader
04-Mar-2019 08:44:40 2019-03-04 08:44:40.526  INFO 11228 --- [           main] .b.t.c.SpringBootTestContextBootstrapper : Loaded default TestExecutionListener class names from location [META-INF/spring.factories]: [org.springframework.boot.test.mock.mockito.MockitoTestExecutionListener, org.springframework.boot.test.mock.mockito.ResetMocksTestExecutionListener, org.springframework.boot.test.autoconfigure.restdocs.RestDocsTestExecutionListener, org.springframework.boot.test.autoconfigure.web.client.MockRestServiceServerResetTestExecutionListener, org.springframework.boot.test.autoconfigure.web.servlet.MockMvcPrintOnlyOnFailureTestExecutionListener, org.springframework.boot.test.autoconfigure.web.servlet.WebDriverTestExecutionListener, org.springframework.test.context.web.ServletTestExecutionListener, org.springframework.test.context.support.DirtiesContextBeforeModesTestExecutionListener, org.springframework.test.context.support.DependencyInjectionTestExecutionListener, org.springframework.test.context.support.DirtiesContextTestExecutionListener, org.springframework.test.context.transaction.TransactionalTestExecutionListener, org.springframework.test.context.jdbc.SqlScriptsTestExecutionListener]
04-Mar-2019 08:44:40 2019-03-04 08:44:40.527  INFO 11228 --- [           main] .b.t.c.SpringBootTestContextBootstrapper : Using TestExecutionListeners: [org.springframework.test.context.web.ServletTestExecutionListener@3d64c581, org.springframework.test.context.support.DirtiesContextBeforeModesTestExecutionListener@5ec5ea63, org.springframework.boot.test.autoconfigure.SpringBootDependencyInjectionTestExecutionListener@4190bc8a, org.springframework.test.context.support.DirtiesContextTestExecutionListener@47d023b7, org.springframework.test.context.transaction.TransactionalTestExecutionListener@5c83ae01, org.springframework.test.context.jdbc.SqlScriptsTestExecutionListener@2d64c100, org.springframework.boot.test.autoconfigure.web.servlet.MockMvcPrintOnlyOnFailureTestExecutionListener@69d45cca, org.springframework.boot.test.autoconfigure.web.client.MockRestServiceServerResetTestExecutionListener@2fdf17dc, org.springframework.boot.test.mock.mockito.ResetMocksTestExecutionListener@6e6d4780, org.springframework.boot.test.autoconfigure.web.servlet.WebDriverTestExecutionListener@650ae78c, org.springframework.boot.test.autoconfigure.restdocs.RestDocsTestExecutionListener@2e73d5eb, org.springframework.boot.test.mock.mockito.MockitoTestExecutionListener@79c5460e]
04-Mar-2019 08:44:40 2019-03-04 08:44:40.590  INFO 11228 --- [           main] junit.logTestName                        : Starting Test transformTests(org.springframework.cloud.dataflow.acceptance.test.TransformTests)
04-Mar-2019 08:44:40 2019-03-04 08:44:40.591  INFO 11228 --- [           main] o.s.c.d.acceptance.test.TransformTests   : Importing stream apps from uri resource: http://repo.spring.io/libs-release/org/springframework/cloud/stream/app/spring-cloud-stream-app-descriptor/Einstein.RELEASE/spring-cloud-stream-app-descriptor-Einstein.RELEASE.stream-apps-kafka-10-maven
04-Mar-2019 08:44:40 2019-03-04 08:44:40.716 ERROR 11228 --- [           main] junit.logTestName                        : !!! Test transformTests(org.springframework.cloud.dataflow.acceptance.test.TransformTests) Failed !!!
04-Mar-2019 08:44:40
04-Mar-2019 08:44:40 org.springframework.cloud.dataflow.rest.client.DataFlowClientException: Error reading from URL [http://repo.spring.io/libs-release/org/springframework/cloud/stream/app/spring-cloud-stream-app-descriptor/Einstein.RELEASE/spring-cloud-stream-app-descriptor-Einstein.RELEASE.stream-apps-kafka-10-maven]
04-Mar-2019 08:44:40
04-Mar-2019 08:44:40         at org.springframework.cloud.dataflow.rest.client.VndErrorResponseErrorHandler.handleError(VndErrorResponseErrorHandler.java:63)
04-Mar-2019 08:44:40         at org.springframework.web.client.RestTemplate.handleResponse(RestTemplate.java:667)
04-Mar-2019 08:44:40         at org.springframework.web.client.RestTemplate.doExecute(RestTemplate.java:620)
04-Mar-2019 08:44:40         at org.springframework.web.client.RestTemplate.execute(RestTemplate.java:580)
04-Mar-2019 08:44:40         at org.springframework.web.client.RestTemplate.postForObject(RestTemplate.java:380)
04-Mar-2019 08:44:40         at org.springframework.cloud.dataflow.rest.client.AppRegistryTemplate.importFromResource(AppRegistryTemplate.java:133)
04-Mar-2019 08:44:40         at org.springframework.cloud.dataflow.acceptance.test.AbstractStreamTests.registerApps(AbstractStreamTests.java:230)
04-Mar-2019 08:44:40         at org.springframework.cloud.dataflow.acceptance.test.AbstractStreamTests.setup(AbstractStreamTests.java:129)
04-Mar-2019 08:44:40         at sun.reflect.NativeMethodAccessorImpl.invoke0(Native Method)
04-Mar-2019 08:44:40         at sun.reflect.NativeMethodAccessorImpl.invoke(NativeMethodAccessorImpl.java:62)
04-Mar-2019 08:44:40         at sun.reflect.DelegatingMethodAccessorImpl.invoke(DelegatingMethodAccessorImpl.java:43)
04-Mar-2019 08:44:40         at java.lang.reflect.Method.invoke(Method.java:498)
04-Mar-2019 08:44:40         at org.junit.runners.model.FrameworkMethod$1.runReflectiveCall(FrameworkMethod.java:50)
04-Mar-2019 08:44:40         at org.junit.internal.runners.model.ReflectiveCallable.run(ReflectiveCallable.java:12)
04-Mar-2019 08:44:40         at org.junit.runners.model.FrameworkMethod.invokeExplosively(FrameworkMethod.java:47)
04-Mar-2019 08:44:40         at org.junit.internal.runners.statements.RunBefores.evaluate(RunBefores.java:24)
04-Mar-2019 08:44:40         at org.springframework.test.context.junit4.statements.RunBeforeTestMethodCallbacks.evaluate(RunBeforeTestMethodCallbacks.java:75)
04-Mar-2019 08:44:40         at org.springframework.test.context.junit4.statements.RunAfterTestMethodCallbacks.evaluate(RunAfterTestMethodCallbacks.java:86)
04-Mar-2019 08:44:40         at org.junit.rules.TestWatcher$1.evaluate(TestWatcher.java:55)
04-Mar-2019 08:44:40         at org.junit.rules.ExternalResource$1.evaluate(ExternalResource.java:48)
04-Mar-2019 08:44:40         at org.junit.rules.RunRules.evaluate(RunRules.java:20)
04-Mar-2019 08:44:40         at org.springframework.test.context.junit4.statements.SpringRepeat.evaluate(SpringRepeat.java:84)
04-Mar-2019 08:44:40         at org.junit.runners.ParentRunner.runLeaf(ParentRunner.java:325)
04-Mar-2019 08:44:40         at org.springframework.test.context.junit4.SpringJUnit4ClassRunner.runChild(SpringJUnit4ClassRunner.java:252)
04-Mar-2019 08:44:40         at org.springframework.test.context.junit4.SpringJUnit4ClassRunner.runChild(SpringJUnit4ClassRunner.java:94)
04-Mar-2019 08:44:40         at org.junit.runners.ParentRunner$3.run(ParentRunner.java:290)
04-Mar-2019 08:44:40         at org.junit.runners.ParentRunner$1.schedule(ParentRunner.java:71)
04-Mar-2019 08:44:40         at org.junit.runners.ParentRunner.runChildren(ParentRunner.java:288)
04-Mar-2019 08:44:40         at org.junit.runners.ParentRunner.access$000(ParentRunner.java:58)
04-Mar-2019 08:44:40         at org.junit.runners.ParentRunner$2.evaluate(ParentRunner.java:268)
04-Mar-2019 08:44:40         at org.springframework.test.context.junit4.statements.RunBeforeTestClassCallbacks.evaluate(RunBeforeTestClassCallbacks.java:61)
04-Mar-2019 08:44:40         at org.springframework.test.context.junit4.statements.RunAfterTestClassCallbacks.evaluate(RunAfterTestClassCallbacks.java:70)
04-Mar-2019 08:44:40         at org.junit.runners.ParentRunner.run(ParentRunner.java:363)
04-Mar-2019 08:44:40         at org.springframework.test.context.junit4.SpringJUnit4ClassRunner.run(SpringJUnit4ClassRunner.java:191)
04-Mar-2019 08:44:40         at org.apache.maven.surefire.junit4.JUnit4Provider.execute(JUnit4Provider.java:283)
04-Mar-2019 08:44:40         at org.apache.maven.surefire.junit4.JUnit4Provider.executeWithRerun(JUnit4Provider.java:173)
04-Mar-2019 08:44:40         at org.apache.maven.surefire.junit4.JUnit4Provider.executeTestSet(JUnit4Provider.java:153)
04-Mar-2019 08:44:40         at org.apache.maven.surefire.junit4.JUnit4Provider.invoke(JUnit4Provider.java:128)
04-Mar-2019 08:44:40         at org.apache.maven.surefire.booter.ForkedBooter.invokeProviderInSameClassLoader(ForkedBooter.java:203)
04-Mar-2019 08:44:40         at org.apache.maven.surefire.booter.ForkedBooter.runSuitesInProcess(ForkedBooter.java:155)
04-Mar-2019 08:44:40         at org.apache.maven.surefire.booter.ForkedBooter.main(ForkedBooter.java:103)
04-Mar-2019 08:44:40
04-Mar-2019 08:44:40 2019-03-04 08:44:40.716  INFO 11228 --- [           main] junit.logTestName                        : Finished Test transformTests(org.springframework.cloud.dataflow.acceptance.test.TransformTests)
04-Mar-2019 08:44:40 2019-03-04 08:44:40.716  INFO 11228 --- [           main] o.s.c.d.acceptance.test.TransformTests   : Destroy all streams
04-Mar-2019 08:44:40 Tests run: 1, Failures: 0, Errors: 1, Skipped: 0, Time elapsed: 0.152 sec <<< FAILURE! - in org.springframework.cloud.dataflow.acceptance.test.TransformTests
04-Mar-2019 08:44:40 transformTests(org.springframework.cloud.dataflow.acceptance.test.TransformTests)  Time elapsed: 0.131 sec  <<< ERROR!
04-Mar-2019 08:44:40 org.springframework.cloud.dataflow.rest.client.DataFlowClientException: Error reading from URL [http://repo.spring.io/libs-release/org/springframework/cloud/stream/app/spring-cloud-stream-app-descriptor/Einstein.RELEASE/spring-cloud-stream-app-descriptor-Einstein.RELEASE.stream-apps-kafka-10-maven]
04-Mar-2019 08:44:40
04-Mar-2019 08:44:40         at org.springframework.cloud.dataflow.rest.client.VndErrorResponseErrorHandler.handleError(VndErrorResponseErrorHandler.java:63)
04-Mar-2019 08:44:40         at org.springframework.web.client.RestTemplate.handleResponse(RestTemplate.java:667)
04-Mar-2019 08:44:40         at org.springframework.web.client.RestTemplate.doExecute(RestTemplate.java:620)
04-Mar-2019 08:44:40         at org.springframework.web.client.RestTemplate.execute(RestTemplate.java:580)
04-Mar-2019 08:44:40         at org.springframework.web.client.RestTemplate.postForObject(RestTemplate.java:380)
04-Mar-2019 08:44:40         at org.springframework.cloud.dataflow.rest.client.AppRegistryTemplate.importFromResource(AppRegistryTemplate.java:133)
04-Mar-2019 08:44:40         at org.springframework.cloud.dataflow.acceptance.test.AbstractStreamTests.registerApps(AbstractStreamTests.java:230)
04-Mar-2019 08:44:40         at org.springframework.cloud.dataflow.acceptance.test.AbstractStreamTests.setup(AbstractStreamTests.java:129)
04-Mar-2019 08:44:40         at sun.reflect.NativeMethodAccessorImpl.invoke0(Native Method)
04-Mar-2019 08:44:40         at sun.reflect.NativeMethodAccessorImpl.invoke(NativeMethodAccessorImpl.java:62)
04-Mar-2019 08:44:40         at sun.reflect.DelegatingMethodAccessorImpl.invoke(DelegatingMethodAccessorImpl.java:43)
04-Mar-2019 08:44:40         at java.lang.reflect.Method.invoke(Method.java:498)
04-Mar-2019 08:44:40         at org.junit.runners.model.FrameworkMethod$1.runReflectiveCall(FrameworkMethod.java:50)
04-Mar-2019 08:44:40         at org.junit.internal.runners.model.ReflectiveCallable.run(ReflectiveCallable.java:12)
04-Mar-2019 08:44:40         at org.junit.runners.model.FrameworkMethod.invokeExplosively(FrameworkMethod.java:47)
04-Mar-2019 08:44:40         at org.junit.internal.runners.statements.RunBefores.evaluate(RunBefores.java:24)
04-Mar-2019 08:44:40         at org.springframework.test.context.junit4.statements.RunBeforeTestMethodCallbacks.evaluate(RunBeforeTestMethodCallbacks.java:75)
04-Mar-2019 08:44:40         at org.springframework.test.context.junit4.statements.RunAfterTestMethodCallbacks.evaluate(RunAfterTestMethodCallbacks.java:86)
04-Mar-2019 08:44:40         at org.junit.rules.TestWatcher$1.evaluate(TestWatcher.java:55)
04-Mar-2019 08:44:40         at org.junit.rules.ExternalResource$1.evaluate(ExternalResource.java:48)
04-Mar-2019 08:44:40         at org.junit.rules.RunRules.evaluate(RunRules.java:20)
04-Mar-2019 08:44:40         at org.springframework.test.context.junit4.statements.SpringRepeat.evaluate(SpringRepeat.java:84)
04-Mar-2019 08:44:40         at org.junit.runners.ParentRunner.runLeaf(ParentRunner.java:325)
04-Mar-2019 08:44:40         at org.springframework.test.context.junit4.SpringJUnit4ClassRunner.runChild(SpringJUnit4ClassRunner.java:252)
04-Mar-2019 08:44:40         at org.springframework.test.context.junit4.SpringJUnit4ClassRunner.runChild(SpringJUnit4ClassRunner.java:94)
04-Mar-2019 08:44:40         at org.junit.runners.ParentRunner$3.run(ParentRunner.java:290)
04-Mar-2019 08:44:40         at org.junit.runners.ParentRunner$1.schedule(ParentRunner.java:71)
04-Mar-2019 08:44:40         at org.junit.runners.ParentRunner.runChildren(ParentRunner.java:288)
04-Mar-2019 08:44:40         at org.junit.runners.ParentRunner.access$000(ParentRunner.java:58)
04-Mar-2019 08:44:40         at org.junit.runners.ParentRunner$2.evaluate(ParentRunner.java:268)
04-Mar-2019 08:44:40         at org.springframework.test.context.junit4.statements.RunBeforeTestClassCallbacks.evaluate(RunBeforeTestClassCallbacks.java:61)
04-Mar-2019 08:44:40         at org.springframework.test.context.junit4.statements.RunAfterTestClassCallbacks.evaluate(RunAfterTestClassCallbacks.java:70)
04-Mar-2019 08:44:40         at org.junit.runners.ParentRunner.run(ParentRunner.java:363)
04-Mar-2019 08:44:40         at org.springframework.test.context.junit4.SpringJUnit4ClassRunner.run(SpringJUnit4ClassRunner.java:191)
04-Mar-2019 08:44:40         at org.apache.maven.surefire.junit4.JUnit4Provider.execute(JUnit4Provider.java:283)
04-Mar-2019 08:44:40         at org.apache.maven.surefire.junit4.JUnit4Provider.executeWithRerun(JUnit4Provider.java:173)
04-Mar-2019 08:44:40         at org.apache.maven.surefire.junit4.JUnit4Provider.executeTestSet(JUnit4Provider.java:153)
04-Mar-2019 08:44:40         at org.apache.maven.surefire.junit4.JUnit4Provider.invoke(JUnit4Provider.java:128)
04-Mar-2019 08:44:40         at org.apache.maven.surefire.booter.ForkedBooter.invokeProviderInSameClassLoader(ForkedBooter.java:203)
04-Mar-2019 08:44:40         at org.apache.maven.surefire.booter.ForkedBooter.runSuitesInProcess(ForkedBooter.java:155)
04-Mar-2019 08:44:40         at org.apache.maven.surefire.booter.ForkedBooter.main(ForkedBooter.java:103)
04-Mar-2019 08:44:40
04-Mar-2019 08:44:40 Running org.springframework.cloud.dataflow.acceptance.test.SchedulerTests
04-Mar-2019 08:44:40 2019-03-04 08:44:40.806  INFO 11228 --- [           main] s.c.a.AnnotationConfigApplicationContext : Refreshing org.springframework.context.annotation.AnnotationConfigApplicationContext@5377414a: startup date [Mon Mar 04 08:44:40 UTC 2019]; root of context hierarchy
04-Mar-2019 08:44:40 2019-03-04 08:44:40.828  INFO 11228 --- [           main] trationDelegate$BeanPostProcessorChecker : Bean 'configurationPropertiesRebinderAutoConfiguration' of type [class org.springframework.cloud.autoconfigure.ConfigurationPropertiesRebinderAutoConfiguration$$EnhancerBySpringCGLIB$$44458212] is not eligible for getting processed by all BeanPostProcessors (for example: not eligible for auto-proxying)
04-Mar-2019 08:44:40
04-Mar-2019 08:44:40   .   ____          _            __ _ _
04-Mar-2019 08:44:40 /\\ / ___'_ __ _ _(_)_ __  __ _ \ \ \ \
04-Mar-2019 08:44:40 ( ( )\___ | '_ | '_| | '_ \/ _` | \ \ \ \
04-Mar-2019 08:44:40 \\/  ___)| |_)| | | | | || (_| |  ) ) ) )
04-Mar-2019 08:44:40   '  |____| .__|_| |_|_| |_\__, | / / / /
04-Mar-2019 08:44:40 =========|_|==============|___/=/_/_/_/
04-Mar-2019 08:44:40 :: Spring Boot ::        (v1.4.1.RELEASE)
04-Mar-2019 08:44:40
04-Mar-2019 08:44:40 2019-03-04 08:44:40.931  INFO 11228 --- [           main] c.c.c.ConfigServicePropertySourceLocator : Fetching config from server at: http://localhost:8888
04-Mar-2019 08:44:40 2019-03-04 08:44:40.934  WARN 11228 --- [           main] c.c.c.ConfigServicePropertySourceLocator : Could not locate PropertySource: I/O error on GET request for "http://localhost:8888//blah": Connection refused (Connection refused); nested exception is java.net.ConnectException: Connection refused (Connection refused)
04-Mar-2019 08:44:40 2019-03-04 08:44:40.935  INFO 11228 --- [           main] o.a.maven.surefire.booter.ForkedBooter   : The following profiles are active: blah
04-Mar-2019 08:44:40 2019-03-04 08:44:40.937  INFO 11228 --- [           main] s.c.a.AnnotationConfigApplicationContext : Refreshing org.springframework.context.annotation.AnnotationConfigApplicationContext@58f4b31a: startup date [Mon Mar 04 08:44:40 UTC 2019]; parent: org.springframework.context.annotation.AnnotationConfigApplicationContext@5377414a
04-Mar-2019 08:44:41 2019-03-04 08:44:41.046  INFO 11228 --- [           main] o.a.maven.surefire.booter.ForkedBooter   : Started ForkedBooter in 0.314 seconds (JVM running for 7.003)
04-Mar-2019 08:44:41 2019-03-04 08:44:41.046  INFO 11228 --- [           main] s.c.a.AnnotationConfigApplicationContext : Closing org.springframework.context.annotation.AnnotationConfigApplicationContext@58f4b31a: startup date [Mon Mar 04 08:44:40 UTC 2019]; parent: org.springframework.context.annotation.AnnotationConfigApplicationContext@5377414a
04-Mar-2019 08:44:41 2019-03-04 08:44:41.047 ERROR 11228 --- [           main] o.s.c.d.a.test.util.SchedulerRule        : SCHEDULER IS NOT AVAILABLE, SKIPPING TESTS
04-Mar-2019 08:44:41
04-Mar-2019 08:44:41 java.lang.IllegalArgumentException: no SchedulerOperations bean is available.  Skipping test.
04-Mar-2019 08:44:41         at org.springframework.util.Assert.notNull(Assert.java:115)
04-Mar-2019 08:44:41         at org.springframework.cloud.dataflow.acceptance.test.util.SchedulerRule.obtainResource(SchedulerRule.java:57)
04-Mar-2019 08:44:41         at org.springframework.cloud.scheduler.spi.junit.AbstractExternalResourceTestSupport.apply(AbstractExternalResourceTestSupport.java:58)
04-Mar-2019 08:44:41         at org.junit.rules.RunRules.applyAll(RunRules.java:26)
04-Mar-2019 08:44:41         at org.junit.rules.RunRules.<init>(RunRules.java:15)
04-Mar-2019 08:44:41         at org.junit.runners.ParentRunner.withClassRules(ParentRunner.java:245)
04-Mar-2019 08:44:41         at org.junit.runners.ParentRunner.classBlock(ParentRunner.java:194)
04-Mar-2019 08:44:41         at org.junit.runners.ParentRunner.run(ParentRunner.java:362)
04-Mar-2019 08:44:41         at org.springframework.test.context.junit4.SpringJUnit4ClassRunner.run(SpringJUnit4ClassRunner.java:191)
04-Mar-2019 08:44:41         at org.apache.maven.surefire.junit4.JUnit4Provider.execute(JUnit4Provider.java:283)
04-Mar-2019 08:44:41         at org.apache.maven.surefire.junit4.JUnit4Provider.executeWithRerun(JUnit4Provider.java:173)
04-Mar-2019 08:44:41         at org.apache.maven.surefire.junit4.JUnit4Provider.executeTestSet(JUnit4Provider.java:153)
04-Mar-2019 08:44:41         at org.apache.maven.surefire.junit4.JUnit4Provider.invoke(JUnit4Provider.java:128)
04-Mar-2019 08:44:41         at org.apache.maven.surefire.booter.ForkedBooter.invokeProviderInSameClassLoader(ForkedBooter.java:203)
04-Mar-2019 08:44:41         at org.apache.maven.surefire.booter.ForkedBooter.runSuitesInProcess(ForkedBooter.java:155)
04-Mar-2019 08:44:41         at org.apache.maven.surefire.booter.ForkedBooter.main(ForkedBooter.java:103)
04-Mar-2019 08:44:41
04-Mar-2019 08:44:41 Tests run: 1, Failures: 0, Errors: 0, Skipped: 1, Time elapsed: 0.303 sec - in org.springframework.cloud.dataflow.acceptance.test.SchedulerTests
04-Mar-2019 08:44:41 Running org.springframework.cloud.dataflow.acceptance.test.NamedChannelTests
04-Mar-2019 08:44:41 2019-03-04 08:44:41.049  INFO 11228 --- [           main] .b.t.c.SpringBootTestContextBootstrapper : Neither @ContextConfiguration nor @ContextHierarchy found for test class [org.springframework.cloud.dataflow.acceptance.test.NamedChannelTests], using SpringBootContextLoader
04-Mar-2019 08:44:41 2019-03-04 08:44:41.055  INFO 11228 --- [           main] .b.t.c.SpringBootTestContextBootstrapper : Loaded default TestExecutionListener class names from location [META-INF/spring.factories]: [org.springframework.boot.test.mock.mockito.MockitoTestExecutionListener, org.springframework.boot.test.mock.mockito.ResetMocksTestExecutionListener, org.springframework.boot.test.autoconfigure.restdocs.RestDocsTestExecutionListener, org.springframework.boot.test.autoconfigure.web.client.MockRestServiceServerResetTestExecutionListener, org.springframework.boot.test.autoconfigure.web.servlet.MockMvcPrintOnlyOnFailureTestExecutionListener, org.springframework.boot.test.autoconfigure.web.servlet.WebDriverTestExecutionListener, org.springframework.test.context.web.ServletTestExecutionListener, org.springframework.test.context.support.DirtiesContextBeforeModesTestExecutionListener, org.springframework.test.context.support.DependencyInjectionTestExecutionListener, org.springframework.test.context.support.DirtiesContextTestExecutionListener, org.springframework.test.context.transaction.TransactionalTestExecutionListener, org.springframework.test.context.jdbc.SqlScriptsTestExecutionListener]
04-Mar-2019 08:44:41 2019-03-04 08:44:41.058  INFO 11228 --- [           main] .b.t.c.SpringBootTestContextBootstrapper : Using TestExecutionListeners: [org.springframework.test.context.web.ServletTestExecutionListener@26ca61bf, org.springframework.test.context.support.DirtiesContextBeforeModesTestExecutionListener@73a0f2b, org.springframework.boot.test.autoconfigure.SpringBootDependencyInjectionTestExecutionListener@fa5f81c, org.springframework.test.context.support.DirtiesContextTestExecutionListener@6a1d526c, org.springframework.test.context.transaction.TransactionalTestExecutionListener@1f2f0109, org.springframework.test.context.jdbc.SqlScriptsTestExecutionListener@483b0690, org.springframework.boot.test.autoconfigure.web.servlet.MockMvcPrintOnlyOnFailureTestExecutionListener@687e6293, org.springframework.boot.test.autoconfigure.web.client.MockRestServiceServerResetTestExecutionListener@6870c3c2, org.springframework.boot.test.mock.mockito.ResetMocksTestExecutionListener@fb0a08c, org.springframework.boot.test.autoconfigure.web.servlet.WebDriverTestExecutionListener@1faf386c, org.springframework.boot.test.autoconfigure.restdocs.RestDocsTestExecutionListener@4debbf0, org.springframework.boot.test.mock.mockito.MockitoTestExecutionListener@6a5e167a]
04-Mar-2019 08:44:41 2019-03-04 08:44:41.114  INFO 11228 --- [           main] junit.logTestName                        : Starting Test testDestination(org.springframework.cloud.dataflow.acceptance.test.NamedChannelTests)
04-Mar-2019 08:44:41 2019-03-04 08:44:41.115  INFO 11228 --- [           main] o.s.c.d.a.test.NamedChannelTests         : Importing stream apps from uri resource: http://repo.spring.io/libs-release/org/springframework/cloud/stream/app/spring-cloud-stream-app-descriptor/Einstein.RELEASE/spring-cloud-stream-app-descriptor-Einstein.RELEASE.stream-apps-kafka-10-maven
04-Mar-2019 08:44:41 2019-03-04 08:44:41.411 ERROR 11228 --- [           main] junit.logTestName                        : !!! Test testDestination(org.springframework.cloud.dataflow.acceptance.test.NamedChannelTests) Failed !!!
04-Mar-2019 08:44:41
04-Mar-2019 08:44:41 org.springframework.cloud.dataflow.rest.client.DataFlowClientException: Error reading from URL [http://repo.spring.io/libs-release/org/springframework/cloud/stream/app/spring-cloud-stream-app-descriptor/Einstein.RELEASE/spring-cloud-stream-app-descriptor-Einstein.RELEASE.stream-apps-kafka-10-maven]
04-Mar-2019 08:44:41
04-Mar-2019 08:44:41         at org.springframework.cloud.dataflow.rest.client.VndErrorResponseErrorHandler.handleError(VndErrorResponseErrorHandler.java:63)
04-Mar-2019 08:44:41         at org.springframework.web.client.RestTemplate.handleResponse(RestTemplate.java:667)
04-Mar-2019 08:44:41         at org.springframework.web.client.RestTemplate.doExecute(RestTemplate.java:620)
04-Mar-2019 08:44:41         at org.springframework.web.client.RestTemplate.execute(RestTemplate.java:580)
04-Mar-2019 08:44:41         at org.springframework.web.client.RestTemplate.postForObject(RestTemplate.java:380)
04-Mar-2019 08:44:41         at org.springframework.cloud.dataflow.rest.client.AppRegistryTemplate.importFromResource(AppRegistryTemplate.java:133)
04-Mar-2019 08:44:41         at org.springframework.cloud.dataflow.acceptance.test.AbstractStreamTests.registerApps(AbstractStreamTests.java:230)
04-Mar-2019 08:44:41         at org.springframework.cloud.dataflow.acceptance.test.AbstractStreamTests.setup(AbstractStreamTests.java:129)
04-Mar-2019 08:44:41         at sun.reflect.NativeMethodAccessorImpl.invoke0(Native Method)
04-Mar-2019 08:44:41         at sun.reflect.NativeMethodAccessorImpl.invoke(NativeMethodAccessorImpl.java:62)
04-Mar-2019 08:44:41         at sun.reflect.DelegatingMethodAccessorImpl.invoke(DelegatingMethodAccessorImpl.java:43)
04-Mar-2019 08:44:41         at java.lang.reflect.Method.invoke(Method.java:498)
04-Mar-2019 08:44:41         at org.junit.runners.model.FrameworkMethod$1.runReflectiveCall(FrameworkMethod.java:50)
04-Mar-2019 08:44:41         at org.junit.internal.runners.model.ReflectiveCallable.run(ReflectiveCallable.java:12)
04-Mar-2019 08:44:41         at org.junit.runners.model.FrameworkMethod.invokeExplosively(FrameworkMethod.java:47)
04-Mar-2019 08:44:41         at org.junit.internal.runners.statements.RunBefores.evaluate(RunBefores.java:24)
04-Mar-2019 08:44:41         at org.springframework.test.context.junit4.statements.RunBeforeTestMethodCallbacks.evaluate(RunBeforeTestMethodCallbacks.java:75)
04-Mar-2019 08:44:41         at org.springframework.test.context.junit4.statements.RunAfterTestMethodCallbacks.evaluate(RunAfterTestMethodCallbacks.java:86)
04-Mar-2019 08:44:41         at org.junit.rules.TestWatcher$1.evaluate(TestWatcher.java:55)
04-Mar-2019 08:44:41         at org.junit.rules.ExternalResource$1.evaluate(ExternalResource.java:48)
04-Mar-2019 08:44:41         at org.junit.rules.RunRules.evaluate(RunRules.java:20)
04-Mar-2019 08:44:41         at org.springframework.test.context.junit4.statements.SpringRepeat.evaluate(SpringRepeat.java:84)
04-Mar-2019 08:44:41         at org.junit.runners.ParentRunner.runLeaf(ParentRunner.java:325)
04-Mar-2019 08:44:41         at org.springframework.test.context.junit4.SpringJUnit4ClassRunner.runChild(SpringJUnit4ClassRunner.java:252)
04-Mar-2019 08:44:41         at org.springframework.test.context.junit4.SpringJUnit4ClassRunner.runChild(SpringJUnit4ClassRunner.java:94)
04-Mar-2019 08:44:41         at org.junit.runners.ParentRunner$3.run(ParentRunner.java:290)
04-Mar-2019 08:44:41         at org.junit.runners.ParentRunner$1.schedule(ParentRunner.java:71)
04-Mar-2019 08:44:41         at org.junit.runners.ParentRunner.runChildren(ParentRunner.java:288)
04-Mar-2019 08:44:41         at org.junit.runners.ParentRunner.access$000(ParentRunner.java:58)
04-Mar-2019 08:44:41         at org.junit.runners.ParentRunner$2.evaluate(ParentRunner.java:268)
04-Mar-2019 08:44:41         at org.springframework.test.context.junit4.statements.RunBeforeTestClassCallbacks.evaluate(RunBeforeTestClassCallbacks.java:61)
04-Mar-2019 08:44:41         at org.springframework.test.context.junit4.statements.RunAfterTestClassCallbacks.evaluate(RunAfterTestClassCallbacks.java:70)
04-Mar-2019 08:44:41         at org.junit.runners.ParentRunner.run(ParentRunner.java:363)
04-Mar-2019 08:44:41         at org.springframework.test.context.junit4.SpringJUnit4ClassRunner.run(SpringJUnit4ClassRunner.java:191)
04-Mar-2019 08:44:41         at org.apache.maven.surefire.junit4.JUnit4Provider.execute(JUnit4Provider.java:283)
04-Mar-2019 08:44:41         at org.apache.maven.surefire.junit4.JUnit4Provider.executeWithRerun(JUnit4Provider.java:173)
04-Mar-2019 08:44:41         at org.apache.maven.surefire.junit4.JUnit4Provider.executeTestSet(JUnit4Provider.java:153)
04-Mar-2019 08:44:41         at org.apache.maven.surefire.junit4.JUnit4Provider.invoke(JUnit4Provider.java:128)
04-Mar-2019 08:44:41         at org.apache.maven.surefire.booter.ForkedBooter.invokeProviderInSameClassLoader(ForkedBooter.java:203)
04-Mar-2019 08:44:41         at org.apache.maven.surefire.booter.ForkedBooter.runSuitesInProcess(ForkedBooter.java:155)
04-Mar-2019 08:44:41         at org.apache.maven.surefire.booter.ForkedBooter.main(ForkedBooter.java:103)
04-Mar-2019 08:44:41
04-Mar-2019 08:44:41 2019-03-04 08:44:41.411  INFO 11228 --- [           main] junit.logTestName                        : Finished Test testDestination(org.springframework.cloud.dataflow.acceptance.test.NamedChannelTests)
04-Mar-2019 08:44:41 2019-03-04 08:44:41.411  INFO 11228 --- [           main] o.s.c.d.a.test.NamedChannelTests         : Destroy all streams
04-Mar-2019 08:44:41 2019-03-04 08:44:41.495  INFO 11228 --- [           main] junit.logTestName                        : Starting Test testTap(org.springframework.cloud.dataflow.acceptance.test.NamedChannelTests)
04-Mar-2019 08:44:41 2019-03-04 08:44:41.495  INFO 11228 --- [           main] o.s.c.d.a.test.NamedChannelTests         : Importing stream apps from uri resource: http://repo.spring.io/libs-release/org/springframework/cloud/stream/app/spring-cloud-stream-app-descriptor/Einstein.RELEASE/spring-cloud-stream-app-descriptor-Einstein.RELEASE.stream-apps-kafka-10-maven
04-Mar-2019 08:44:41 2019-03-04 08:44:41.607 ERROR 11228 --- [           main] junit.logTestName                        : !!! Test testTap(org.springframework.cloud.dataflow.acceptance.test.NamedChannelTests) Failed !!!
04-Mar-2019 08:44:41
04-Mar-2019 08:44:41 org.springframework.cloud.dataflow.rest.client.DataFlowClientException: Error reading from URL [http://repo.spring.io/libs-release/org/springframework/cloud/stream/app/spring-cloud-stream-app-descriptor/Einstein.RELEASE/spring-cloud-stream-app-descriptor-Einstein.RELEASE.stream-apps-kafka-10-maven]
04-Mar-2019 08:44:41
04-Mar-2019 08:44:41         at org.springframework.cloud.dataflow.rest.client.VndErrorResponseErrorHandler.handleError(VndErrorResponseErrorHandler.java:63)
04-Mar-2019 08:44:41         at org.springframework.web.client.RestTemplate.handleResponse(RestTemplate.java:667)
04-Mar-2019 08:44:41         at org.springframework.web.client.RestTemplate.doExecute(RestTemplate.java:620)
04-Mar-2019 08:44:41         at org.springframework.web.client.RestTemplate.execute(RestTemplate.java:580)
04-Mar-2019 08:44:41         at org.springframework.web.client.RestTemplate.postForObject(RestTemplate.java:380)
04-Mar-2019 08:44:41         at org.springframework.cloud.dataflow.rest.client.AppRegistryTemplate.importFromResource(AppRegistryTemplate.java:133)
04-Mar-2019 08:44:41         at org.springframework.cloud.dataflow.acceptance.test.AbstractStreamTests.registerApps(AbstractStreamTests.java:230)
04-Mar-2019 08:44:41         at org.springframework.cloud.dataflow.acceptance.test.AbstractStreamTests.setup(AbstractStreamTests.java:129)
04-Mar-2019 08:44:41         at sun.reflect.NativeMethodAccessorImpl.invoke0(Native Method)
04-Mar-2019 08:44:41         at sun.reflect.NativeMethodAccessorImpl.invoke(NativeMethodAccessorImpl.java:62)
04-Mar-2019 08:44:41         at sun.reflect.DelegatingMethodAccessorImpl.invoke(DelegatingMethodAccessorImpl.java:43)
04-Mar-2019 08:44:41         at java.lang.reflect.Method.invoke(Method.java:498)
04-Mar-2019 08:44:41         at org.junit.runners.model.FrameworkMethod$1.runReflectiveCall(FrameworkMethod.java:50)
04-Mar-2019 08:44:41         at org.junit.internal.runners.model.ReflectiveCallable.run(ReflectiveCallable.java:12)
04-Mar-2019 08:44:41         at org.junit.runners.model.FrameworkMethod.invokeExplosively(FrameworkMethod.java:47)
04-Mar-2019 08:44:41         at org.junit.internal.runners.statements.RunBefores.evaluate(RunBefores.java:24)
04-Mar-2019 08:44:41         at org.springframework.test.context.junit4.statements.RunBeforeTestMethodCallbacks.evaluate(RunBeforeTestMethodCallbacks.java:75)
04-Mar-2019 08:44:41         at org.springframework.test.context.junit4.statements.RunAfterTestMethodCallbacks.evaluate(RunAfterTestMethodCallbacks.java:86)
04-Mar-2019 08:44:41         at org.junit.rules.TestWatcher$1.evaluate(TestWatcher.java:55)
04-Mar-2019 08:44:41         at org.junit.rules.ExternalResource$1.evaluate(ExternalResource.java:48)
04-Mar-2019 08:44:41         at org.junit.rules.RunRules.evaluate(RunRules.java:20)
04-Mar-2019 08:44:41         at org.springframework.test.context.junit4.statements.SpringRepeat.evaluate(SpringRepeat.java:84)
04-Mar-2019 08:44:41         at org.junit.runners.ParentRunner.runLeaf(ParentRunner.java:325)
04-Mar-2019 08:44:41         at org.springframework.test.context.junit4.SpringJUnit4ClassRunner.runChild(SpringJUnit4ClassRunner.java:252)
04-Mar-2019 08:44:41         at org.springframework.test.context.junit4.SpringJUnit4ClassRunner.runChild(SpringJUnit4ClassRunner.java:94)
04-Mar-2019 08:44:41         at org.junit.runners.ParentRunner$3.run(ParentRunner.java:290)
04-Mar-2019 08:44:41         at org.junit.runners.ParentRunner$1.schedule(ParentRunner.java:71)
04-Mar-2019 08:44:41         at org.junit.runners.ParentRunner.runChildren(ParentRunner.java:288)
04-Mar-2019 08:44:41         at org.junit.runners.ParentRunner.access$000(ParentRunner.java:58)
04-Mar-2019 08:44:41         at org.junit.runners.ParentRunner$2.evaluate(ParentRunner.java:268)
04-Mar-2019 08:44:41         at org.springframework.test.context.junit4.statements.RunBeforeTestClassCallbacks.evaluate(RunBeforeTestClassCallbacks.java:61)
04-Mar-2019 08:44:41         at org.springframework.test.context.junit4.statements.RunAfterTestClassCallbacks.evaluate(RunAfterTestClassCallbacks.java:70)
04-Mar-2019 08:44:41         at org.junit.runners.ParentRunner.run(ParentRunner.java:363)
04-Mar-2019 08:44:41         at org.springframework.test.context.junit4.SpringJUnit4ClassRunner.run(SpringJUnit4ClassRunner.java:191)
04-Mar-2019 08:44:41         at org.apache.maven.surefire.junit4.JUnit4Provider.execute(JUnit4Provider.java:283)
04-Mar-2019 08:44:41         at org.apache.maven.surefire.junit4.JUnit4Provider.executeWithRerun(JUnit4Provider.java:173)
04-Mar-2019 08:44:41         at org.apache.maven.surefire.junit4.JUnit4Provider.executeTestSet(JUnit4Provider.java:153)
04-Mar-2019 08:44:41         at org.apache.maven.surefire.junit4.JUnit4Provider.invoke(JUnit4Provider.java:128)
04-Mar-2019 08:44:41         at org.apache.maven.surefire.booter.ForkedBooter.invokeProviderInSameClassLoader(ForkedBooter.java:203)
04-Mar-2019 08:44:41         at org.apache.maven.surefire.booter.ForkedBooter.runSuitesInProcess(ForkedBooter.java:155)
04-Mar-2019 08:44:41         at org.apache.maven.surefire.booter.ForkedBooter.main(ForkedBooter.java:103)
04-Mar-2019 08:44:41
04-Mar-2019 08:44:41 2019-03-04 08:44:41.608  INFO 11228 --- [           main] junit.logTestName                        : Finished Test testTap(org.springframework.cloud.dataflow.acceptance.test.NamedChannelTests)
04-Mar-2019 08:44:41 2019-03-04 08:44:41.608  INFO 11228 --- [           main] o.s.c.d.a.test.NamedChannelTests         : Destroy all streams
04-Mar-2019 08:44:41 2019-03-04 08:44:41.680  INFO 11228 --- [           main] junit.logTestName                        : Starting Test manyToOneTest(org.springframework.cloud.dataflow.acceptance.test.NamedChannelTests)
04-Mar-2019 08:44:41 2019-03-04 08:44:41.681  INFO 11228 --- [           main] o.s.c.d.a.test.NamedChannelTests         : Importing stream apps from uri resource: http://repo.spring.io/libs-release/org/springframework/cloud/stream/app/spring-cloud-stream-app-descriptor/Einstein.RELEASE/spring-cloud-stream-app-descriptor-Einstein.RELEASE.stream-apps-kafka-10-maven
04-Mar-2019 08:44:41 2019-03-04 08:44:41.797 ERROR 11228 --- [           main] junit.logTestName                        : !!! Test manyToOneTest(org.springframework.cloud.dataflow.acceptance.test.NamedChannelTests) Failed !!!
04-Mar-2019 08:44:41
04-Mar-2019 08:44:41 org.springframework.cloud.dataflow.rest.client.DataFlowClientException: Error reading from URL [http://repo.spring.io/libs-release/org/springframework/cloud/stream/app/spring-cloud-stream-app-descriptor/Einstein.RELEASE/spring-cloud-stream-app-descriptor-Einstein.RELEASE.stream-apps-kafka-10-maven]
04-Mar-2019 08:44:41
04-Mar-2019 08:44:41         at org.springframework.cloud.dataflow.rest.client.VndErrorResponseErrorHandler.handleError(VndErrorResponseErrorHandler.java:63)
04-Mar-2019 08:44:41         at org.springframework.web.client.RestTemplate.handleResponse(RestTemplate.java:667)
04-Mar-2019 08:44:41         at org.springframework.web.client.RestTemplate.doExecute(RestTemplate.java:620)
04-Mar-2019 08:44:41         at org.springframework.web.client.RestTemplate.execute(RestTemplate.java:580)
04-Mar-2019 08:44:41         at org.springframework.web.client.RestTemplate.postForObject(RestTemplate.java:380)
04-Mar-2019 08:44:41         at org.springframework.cloud.dataflow.rest.client.AppRegistryTemplate.importFromResource(AppRegistryTemplate.java:133)
04-Mar-2019 08:44:41         at org.springframework.cloud.dataflow.acceptance.test.AbstractStreamTests.registerApps(AbstractStreamTests.java:230)
04-Mar-2019 08:44:41         at org.springframework.cloud.dataflow.acceptance.test.AbstractStreamTests.setup(AbstractStreamTests.java:129)
04-Mar-2019 08:44:41         at sun.reflect.NativeMethodAccessorImpl.invoke0(Native Method)
04-Mar-2019 08:44:41         at sun.reflect.NativeMethodAccessorImpl.invoke(NativeMethodAccessorImpl.java:62)
04-Mar-2019 08:44:41         at sun.reflect.DelegatingMethodAccessorImpl.invoke(DelegatingMethodAccessorImpl.java:43)
04-Mar-2019 08:44:41         at java.lang.reflect.Method.invoke(Method.java:498)
04-Mar-2019 08:44:41         at org.junit.runners.model.FrameworkMethod$1.runReflectiveCall(FrameworkMethod.java:50)
04-Mar-2019 08:44:41         at org.junit.internal.runners.model.ReflectiveCallable.run(ReflectiveCallable.java:12)
04-Mar-2019 08:44:41         at org.junit.runners.model.FrameworkMethod.invokeExplosively(FrameworkMethod.java:47)
04-Mar-2019 08:44:41         at org.junit.internal.runners.statements.RunBefores.evaluate(RunBefores.java:24)
04-Mar-2019 08:44:41         at org.springframework.test.context.junit4.statements.RunBeforeTestMethodCallbacks.evaluate(RunBeforeTestMethodCallbacks.java:75)
04-Mar-2019 08:44:41         at org.springframework.test.context.junit4.statements.RunAfterTestMethodCallbacks.evaluate(RunAfterTestMethodCallbacks.java:86)
04-Mar-2019 08:44:41         at org.junit.rules.TestWatcher$1.evaluate(TestWatcher.java:55)
04-Mar-2019 08:44:41         at org.junit.rules.ExternalResource$1.evaluate(ExternalResource.java:48)
04-Mar-2019 08:44:41         at org.junit.rules.RunRules.evaluate(RunRules.java:20)
04-Mar-2019 08:44:41         at org.springframework.test.context.junit4.statements.SpringRepeat.evaluate(SpringRepeat.java:84)
04-Mar-2019 08:44:41         at org.junit.runners.ParentRunner.runLeaf(ParentRunner.java:325)
04-Mar-2019 08:44:41         at org.springframework.test.context.junit4.SpringJUnit4ClassRunner.runChild(SpringJUnit4ClassRunner.java:252)
04-Mar-2019 08:44:41         at org.springframework.test.context.junit4.SpringJUnit4ClassRunner.runChild(SpringJUnit4ClassRunner.java:94)
04-Mar-2019 08:44:41         at org.junit.runners.ParentRunner$3.run(ParentRunner.java:290)
04-Mar-2019 08:44:41         at org.junit.runners.ParentRunner$1.schedule(ParentRunner.java:71)
04-Mar-2019 08:44:41         at org.junit.runners.ParentRunner.runChildren(ParentRunner.java:288)
04-Mar-2019 08:44:41         at org.junit.runners.ParentRunner.access$000(ParentRunner.java:58)
04-Mar-2019 08:44:41         at org.junit.runners.ParentRunner$2.evaluate(ParentRunner.java:268)
04-Mar-2019 08:44:41         at org.springframework.test.context.junit4.statements.RunBeforeTestClassCallbacks.evaluate(RunBeforeTestClassCallbacks.java:61)
04-Mar-2019 08:44:41         at org.springframework.test.context.junit4.statements.RunAfterTestClassCallbacks.evaluate(RunAfterTestClassCallbacks.java:70)
04-Mar-2019 08:44:41         at org.junit.runners.ParentRunner.run(ParentRunner.java:363)
04-Mar-2019 08:44:41         at org.springframework.test.context.junit4.SpringJUnit4ClassRunner.run(SpringJUnit4ClassRunner.java:191)
04-Mar-2019 08:44:41         at org.apache.maven.surefire.junit4.JUnit4Provider.execute(JUnit4Provider.java:283)
04-Mar-2019 08:44:41         at org.apache.maven.surefire.junit4.JUnit4Provider.executeWithRerun(JUnit4Provider.java:173)
04-Mar-2019 08:44:41         at org.apache.maven.surefire.junit4.JUnit4Provider.executeTestSet(JUnit4Provider.java:153)
04-Mar-2019 08:44:41         at org.apache.maven.surefire.junit4.JUnit4Provider.invoke(JUnit4Provider.java:128)
04-Mar-2019 08:44:41         at org.apache.maven.surefire.booter.ForkedBooter.invokeProviderInSameClassLoader(ForkedBooter.java:203)
04-Mar-2019 08:44:41         at org.apache.maven.surefire.booter.ForkedBooter.runSuitesInProcess(ForkedBooter.java:155)
04-Mar-2019 08:44:41         at org.apache.maven.surefire.booter.ForkedBooter.main(ForkedBooter.java:103)
04-Mar-2019 08:44:41
04-Mar-2019 08:44:41 2019-03-04 08:44:41.798  INFO 11228 --- [           main] junit.logTestName                        : Finished Test manyToOneTest(org.springframework.cloud.dataflow.acceptance.test.NamedChannelTests)
04-Mar-2019 08:44:41 2019-03-04 08:44:41.798  INFO 11228 --- [           main] o.s.c.d.a.test.NamedChannelTests         : Destroy all streams
04-Mar-2019 08:44:41 2019-03-04 08:44:41.903  INFO 11228 --- [           main] junit.logTestName                        : Starting Test directedGraphTest(org.springframework.cloud.dataflow.acceptance.test.NamedChannelTests)
04-Mar-2019 08:44:41 2019-03-04 08:44:41.904  INFO 11228 --- [           main] o.s.c.d.a.test.NamedChannelTests         : Importing stream apps from uri resource: http://repo.spring.io/libs-release/org/springframework/cloud/stream/app/spring-cloud-stream-app-descriptor/Einstein.RELEASE/spring-cloud-stream-app-descriptor-Einstein.RELEASE.stream-apps-kafka-10-maven
04-Mar-2019 08:44:42 2019-03-04 08:44:42.018 ERROR 11228 --- [           main] junit.logTestName                        : !!! Test directedGraphTest(org.springframework.cloud.dataflow.acceptance.test.NamedChannelTests) Failed !!!
04-Mar-2019 08:44:42
04-Mar-2019 08:44:42 org.springframework.cloud.dataflow.rest.client.DataFlowClientException: Error reading from URL [http://repo.spring.io/libs-release/org/springframework/cloud/stream/app/spring-cloud-stream-app-descriptor/Einstein.RELEASE/spring-cloud-stream-app-descriptor-Einstein.RELEASE.stream-apps-kafka-10-maven]
04-Mar-2019 08:44:42
04-Mar-2019 08:44:42         at org.springframework.cloud.dataflow.rest.client.VndErrorResponseErrorHandler.handleError(VndErrorResponseErrorHandler.java:63)
04-Mar-2019 08:44:42         at org.springframework.web.client.RestTemplate.handleResponse(RestTemplate.java:667)
04-Mar-2019 08:44:42         at org.springframework.web.client.RestTemplate.doExecute(RestTemplate.java:620)
04-Mar-2019 08:44:42         at org.springframework.web.client.RestTemplate.execute(RestTemplate.java:580)
04-Mar-2019 08:44:42         at org.springframework.web.client.RestTemplate.postForObject(RestTemplate.java:380)
04-Mar-2019 08:44:42         at org.springframework.cloud.dataflow.rest.client.AppRegistryTemplate.importFromResource(AppRegistryTemplate.java:133)
04-Mar-2019 08:44:42         at org.springframework.cloud.dataflow.acceptance.test.AbstractStreamTests.registerApps(AbstractStreamTests.java:230)
04-Mar-2019 08:44:42         at org.springframework.cloud.dataflow.acceptance.test.AbstractStreamTests.setup(AbstractStreamTests.java:129)
04-Mar-2019 08:44:42         at sun.reflect.NativeMethodAccessorImpl.invoke0(Native Method)
04-Mar-2019 08:44:42         at sun.reflect.NativeMethodAccessorImpl.invoke(NativeMethodAccessorImpl.java:62)
04-Mar-2019 08:44:42         at sun.reflect.DelegatingMethodAccessorImpl.invoke(DelegatingMethodAccessorImpl.java:43)
04-Mar-2019 08:44:42         at java.lang.reflect.Method.invoke(Method.java:498)
04-Mar-2019 08:44:42         at org.junit.runners.model.FrameworkMethod$1.runReflectiveCall(FrameworkMethod.java:50)
04-Mar-2019 08:44:42         at org.junit.internal.runners.model.ReflectiveCallable.run(ReflectiveCallable.java:12)
04-Mar-2019 08:44:42         at org.junit.runners.model.FrameworkMethod.invokeExplosively(FrameworkMethod.java:47)
04-Mar-2019 08:44:42         at org.junit.internal.runners.statements.RunBefores.evaluate(RunBefores.java:24)
04-Mar-2019 08:44:42         at org.springframework.test.context.junit4.statements.RunBeforeTestMethodCallbacks.evaluate(RunBeforeTestMethodCallbacks.java:75)
04-Mar-2019 08:44:42         at org.springframework.test.context.junit4.statements.RunAfterTestMethodCallbacks.evaluate(RunAfterTestMethodCallbacks.java:86)
04-Mar-2019 08:44:42         at org.junit.rules.TestWatcher$1.evaluate(TestWatcher.java:55)
04-Mar-2019 08:44:42         at org.junit.rules.ExternalResource$1.evaluate(ExternalResource.java:48)
04-Mar-2019 08:44:42         at org.junit.rules.RunRules.evaluate(RunRules.java:20)
04-Mar-2019 08:44:42         at org.springframework.test.context.junit4.statements.SpringRepeat.evaluate(SpringRepeat.java:84)
04-Mar-2019 08:44:42         at org.junit.runners.ParentRunner.runLeaf(ParentRunner.java:325)
04-Mar-2019 08:44:42         at org.springframework.test.context.junit4.SpringJUnit4ClassRunner.runChild(SpringJUnit4ClassRunner.java:252)
04-Mar-2019 08:44:42         at org.springframework.test.context.junit4.SpringJUnit4ClassRunner.runChild(SpringJUnit4ClassRunner.java:94)
04-Mar-2019 08:44:42         at org.junit.runners.ParentRunner$3.run(ParentRunner.java:290)
04-Mar-2019 08:44:42         at org.junit.runners.ParentRunner$1.schedule(ParentRunner.java:71)
04-Mar-2019 08:44:42         at org.junit.runners.ParentRunner.runChildren(ParentRunner.java:288)
04-Mar-2019 08:44:42         at org.junit.runners.ParentRunner.access$000(ParentRunner.java:58)
04-Mar-2019 08:44:42         at org.junit.runners.ParentRunner$2.evaluate(ParentRunner.java:268)
04-Mar-2019 08:44:42         at org.springframework.test.context.junit4.statements.RunBeforeTestClassCallbacks.evaluate(RunBeforeTestClassCallbacks.java:61)
04-Mar-2019 08:44:42         at org.springframework.test.context.junit4.statements.RunAfterTestClassCallbacks.evaluate(RunAfterTestClassCallbacks.java:70)
04-Mar-2019 08:44:42         at org.junit.runners.ParentRunner.run(ParentRunner.java:363)
04-Mar-2019 08:44:42         at org.springframework.test.context.junit4.SpringJUnit4ClassRunner.run(SpringJUnit4ClassRunner.java:191)
04-Mar-2019 08:44:42         at org.apache.maven.surefire.junit4.JUnit4Provider.execute(JUnit4Provider.java:283)
04-Mar-2019 08:44:42         at org.apache.maven.surefire.junit4.JUnit4Provider.executeWithRerun(JUnit4Provider.java:173)
04-Mar-2019 08:44:42         at org.apache.maven.surefire.junit4.JUnit4Provider.executeTestSet(JUnit4Provider.java:153)
04-Mar-2019 08:44:42         at org.apache.maven.surefire.junit4.JUnit4Provider.invoke(JUnit4Provider.java:128)
04-Mar-2019 08:44:42         at org.apache.maven.surefire.booter.ForkedBooter.invokeProviderInSameClassLoader(ForkedBooter.java:203)
04-Mar-2019 08:44:42         at org.apache.maven.surefire.booter.ForkedBooter.runSuitesInProcess(ForkedBooter.java:155)
04-Mar-2019 08:44:42         at org.apache.maven.surefire.booter.ForkedBooter.main(ForkedBooter.java:103)
04-Mar-2019 08:44:42
04-Mar-2019 08:44:42 2019-03-04 08:44:42.019  INFO 11228 --- [           main] junit.logTestName                        : Finished Test directedGraphTest(org.springframework.cloud.dataflow.acceptance.test.NamedChannelTests)
04-Mar-2019 08:44:42 2019-03-04 08:44:42.019  INFO 11228 --- [           main] o.s.c.d.a.test.NamedChannelTests         : Destroy all streams
04-Mar-2019 08:44:42 Tests run: 4, Failures: 0, Errors: 4, Skipped: 0, Time elapsed: 0.965 sec <<< FAILURE! - in org.springframework.cloud.dataflow.acceptance.test.NamedChannelTests
04-Mar-2019 08:44:42 testDestination(org.springframework.cloud.dataflow.acceptance.test.NamedChannelTests)  Time elapsed: 0.313 sec  <<< ERROR!
04-Mar-2019 08:44:42 org.springframework.cloud.dataflow.rest.client.DataFlowClientException: Error reading from URL [http://repo.spring.io/libs-release/org/springframework/cloud/stream/app/spring-cloud-stream-app-descriptor/Einstein.RELEASE/spring-cloud-stream-app-descriptor-Einstein.RELEASE.stream-apps-kafka-10-maven]
04-Mar-2019 08:44:42
04-Mar-2019 08:44:42         at org.springframework.cloud.dataflow.rest.client.VndErrorResponseErrorHandler.handleError(VndErrorResponseErrorHandler.java:63)
04-Mar-2019 08:44:42         at org.springframework.web.client.RestTemplate.handleResponse(RestTemplate.java:667)
04-Mar-2019 08:44:42         at org.springframework.web.client.RestTemplate.doExecute(RestTemplate.java:620)
04-Mar-2019 08:44:42         at org.springframework.web.client.RestTemplate.execute(RestTemplate.java:580)
04-Mar-2019 08:44:42         at org.springframework.web.client.RestTemplate.postForObject(RestTemplate.java:380)
04-Mar-2019 08:44:42         at org.springframework.cloud.dataflow.rest.client.AppRegistryTemplate.importFromResource(AppRegistryTemplate.java:133)
04-Mar-2019 08:44:42         at org.springframework.cloud.dataflow.acceptance.test.AbstractStreamTests.registerApps(AbstractStreamTests.java:230)
04-Mar-2019 08:44:42         at org.springframework.cloud.dataflow.acceptance.test.AbstractStreamTests.setup(AbstractStreamTests.java:129)
04-Mar-2019 08:44:42         at sun.reflect.NativeMethodAccessorImpl.invoke0(Native Method)
04-Mar-2019 08:44:42         at sun.reflect.NativeMethodAccessorImpl.invoke(NativeMethodAccessorImpl.java:62)
04-Mar-2019 08:44:42         at sun.reflect.DelegatingMethodAccessorImpl.invoke(DelegatingMethodAccessorImpl.java:43)
04-Mar-2019 08:44:42         at java.lang.reflect.Method.invoke(Method.java:498)
04-Mar-2019 08:44:42         at org.junit.runners.model.FrameworkMethod$1.runReflectiveCall(FrameworkMethod.java:50)
04-Mar-2019 08:44:42         at org.junit.internal.runners.model.ReflectiveCallable.run(ReflectiveCallable.java:12)
04-Mar-2019 08:44:42         at org.junit.runners.model.FrameworkMethod.invokeExplosively(FrameworkMethod.java:47)
04-Mar-2019 08:44:42         at org.junit.internal.runners.statements.RunBefores.evaluate(RunBefores.java:24)
04-Mar-2019 08:44:42         at org.springframework.test.context.junit4.statements.RunBeforeTestMethodCallbacks.evaluate(RunBeforeTestMethodCallbacks.java:75)
04-Mar-2019 08:44:42         at org.springframework.test.context.junit4.statements.RunAfterTestMethodCallbacks.evaluate(RunAfterTestMethodCallbacks.java:86)
04-Mar-2019 08:44:42         at org.junit.rules.TestWatcher$1.evaluate(TestWatcher.java:55)
04-Mar-2019 08:44:42         at org.junit.rules.ExternalResource$1.evaluate(ExternalResource.java:48)
04-Mar-2019 08:44:42         at org.junit.rules.RunRules.evaluate(RunRules.java:20)
04-Mar-2019 08:44:42         at org.springframework.test.context.junit4.statements.SpringRepeat.evaluate(SpringRepeat.java:84)
04-Mar-2019 08:44:42         at org.junit.runners.ParentRunner.runLeaf(ParentRunner.java:325)
04-Mar-2019 08:44:42         at org.springframework.test.context.junit4.SpringJUnit4ClassRunner.runChild(SpringJUnit4ClassRunner.java:252)
04-Mar-2019 08:44:42         at org.springframework.test.context.junit4.SpringJUnit4ClassRunner.runChild(SpringJUnit4ClassRunner.java:94)
04-Mar-2019 08:44:42         at org.junit.runners.ParentRunner$3.run(ParentRunner.java:290)
04-Mar-2019 08:44:42         at org.junit.runners.ParentRunner$1.schedule(ParentRunner.java:71)
04-Mar-2019 08:44:42         at org.junit.runners.ParentRunner.runChildren(ParentRunner.java:288)
04-Mar-2019 08:44:42         at org.junit.runners.ParentRunner.access$000(ParentRunner.java:58)
04-Mar-2019 08:44:42         at org.junit.runners.ParentRunner$2.evaluate(ParentRunner.java:268)
04-Mar-2019 08:44:42         at org.springframework.test.context.junit4.statements.RunBeforeTestClassCallbacks.evaluate(RunBeforeTestClassCallbacks.java:61)
04-Mar-2019 08:44:42         at org.springframework.test.context.junit4.statements.RunAfterTestClassCallbacks.evaluate(RunAfterTestClassCallbacks.java:70)
04-Mar-2019 08:44:42         at org.junit.runners.ParentRunner.run(ParentRunner.java:363)
04-Mar-2019 08:44:42         at org.springframework.test.context.junit4.SpringJUnit4ClassRunner.run(SpringJUnit4ClassRunner.java:191)
04-Mar-2019 08:44:42         at org.apache.maven.surefire.junit4.JUnit4Provider.execute(JUnit4Provider.java:283)
04-Mar-2019 08:44:42         at org.apache.maven.surefire.junit4.JUnit4Provider.executeWithRerun(JUnit4Provider.java:173)
04-Mar-2019 08:44:42         at org.apache.maven.surefire.junit4.JUnit4Provider.executeTestSet(JUnit4Provider.java:153)
04-Mar-2019 08:44:42         at org.apache.maven.surefire.junit4.JUnit4Provider.invoke(JUnit4Provider.java:128)
04-Mar-2019 08:44:42         at org.apache.maven.surefire.booter.ForkedBooter.invokeProviderInSameClassLoader(ForkedBooter.java:203)
04-Mar-2019 08:44:42         at org.apache.maven.surefire.booter.ForkedBooter.runSuitesInProcess(ForkedBooter.java:155)
04-Mar-2019 08:44:42         at org.apache.maven.surefire.booter.ForkedBooter.main(ForkedBooter.java:103)
04-Mar-2019 08:44:42
04-Mar-2019 08:44:42 testTap(org.springframework.cloud.dataflow.acceptance.test.NamedChannelTests)  Time elapsed: 0.12 sec  <<< ERROR!
04-Mar-2019 08:44:42 org.springframework.cloud.dataflow.rest.client.DataFlowClientException: Error reading from URL [http://repo.spring.io/libs-release/org/springframework/cloud/stream/app/spring-cloud-stream-app-descriptor/Einstein.RELEASE/spring-cloud-stream-app-descriptor-Einstein.RELEASE.stream-apps-kafka-10-maven]
04-Mar-2019 08:44:42
04-Mar-2019 08:44:42         at org.springframework.cloud.dataflow.rest.client.VndErrorResponseErrorHandler.handleError(VndErrorResponseErrorHandler.java:63)
04-Mar-2019 08:44:42         at org.springframework.web.client.RestTemplate.handleResponse(RestTemplate.java:667)
04-Mar-2019 08:44:42         at org.springframework.web.client.RestTemplate.doExecute(RestTemplate.java:620)
04-Mar-2019 08:44:42         at org.springframework.web.client.RestTemplate.execute(RestTemplate.java:580)
04-Mar-2019 08:44:42         at org.springframework.web.client.RestTemplate.postForObject(RestTemplate.java:380)
04-Mar-2019 08:44:42         at org.springframework.cloud.dataflow.rest.client.AppRegistryTemplate.importFromResource(AppRegistryTemplate.java:133)
04-Mar-2019 08:44:42         at org.springframework.cloud.dataflow.acceptance.test.AbstractStreamTests.registerApps(AbstractStreamTests.java:230)
04-Mar-2019 08:44:42         at org.springframework.cloud.dataflow.acceptance.test.AbstractStreamTests.setup(AbstractStreamTests.java:129)
04-Mar-2019 08:44:42         at sun.reflect.NativeMethodAccessorImpl.invoke0(Native Method)
04-Mar-2019 08:44:42         at sun.reflect.NativeMethodAccessorImpl.invoke(NativeMethodAccessorImpl.java:62)
04-Mar-2019 08:44:42         at sun.reflect.DelegatingMethodAccessorImpl.invoke(DelegatingMethodAccessorImpl.java:43)
04-Mar-2019 08:44:42         at java.lang.reflect.Method.invoke(Method.java:498)
04-Mar-2019 08:44:42         at org.junit.runners.model.FrameworkMethod$1.runReflectiveCall(FrameworkMethod.java:50)
04-Mar-2019 08:44:42         at org.junit.internal.runners.model.ReflectiveCallable.run(ReflectiveCallable.java:12)
04-Mar-2019 08:44:42         at org.junit.runners.model.FrameworkMethod.invokeExplosively(FrameworkMethod.java:47)
04-Mar-2019 08:44:42         at org.junit.internal.runners.statements.RunBefores.evaluate(RunBefores.java:24)
04-Mar-2019 08:44:42         at org.springframework.test.context.junit4.statements.RunBeforeTestMethodCallbacks.evaluate(RunBeforeTestMethodCallbacks.java:75)
04-Mar-2019 08:44:42         at org.springframework.test.context.junit4.statements.RunAfterTestMethodCallbacks.evaluate(RunAfterTestMethodCallbacks.java:86)
04-Mar-2019 08:44:42         at org.junit.rules.TestWatcher$1.evaluate(TestWatcher.java:55)
04-Mar-2019 08:44:42         at org.junit.rules.ExternalResource$1.evaluate(ExternalResource.java:48)
04-Mar-2019 08:44:42         at org.junit.rules.RunRules.evaluate(RunRules.java:20)
04-Mar-2019 08:44:42         at org.springframework.test.context.junit4.statements.SpringRepeat.evaluate(SpringRepeat.java:84)
04-Mar-2019 08:44:42         at org.junit.runners.ParentRunner.runLeaf(ParentRunner.java:325)
04-Mar-2019 08:44:42         at org.springframework.test.context.junit4.SpringJUnit4ClassRunner.runChild(SpringJUnit4ClassRunner.java:252)
04-Mar-2019 08:44:42         at org.springframework.test.context.junit4.SpringJUnit4ClassRunner.runChild(SpringJUnit4ClassRunner.java:94)
04-Mar-2019 08:44:42         at org.junit.runners.ParentRunner$3.run(ParentRunner.java:290)
04-Mar-2019 08:44:42         at org.junit.runners.ParentRunner$1.schedule(ParentRunner.java:71)
04-Mar-2019 08:44:42         at org.junit.runners.ParentRunner.runChildren(ParentRunner.java:288)
04-Mar-2019 08:44:42         at org.junit.runners.ParentRunner.access$000(ParentRunner.java:58)
04-Mar-2019 08:44:42         at org.junit.runners.ParentRunner$2.evaluate(ParentRunner.java:268)
04-Mar-2019 08:44:42         at org.springframework.test.context.junit4.statements.RunBeforeTestClassCallbacks.evaluate(RunBeforeTestClassCallbacks.java:61)
04-Mar-2019 08:44:42         at org.springframework.test.context.junit4.statements.RunAfterTestClassCallbacks.evaluate(RunAfterTestClassCallbacks.java:70)
04-Mar-2019 08:44:42         at org.junit.runners.ParentRunner.run(ParentRunner.java:363)
04-Mar-2019 08:44:42         at org.springframework.test.context.junit4.SpringJUnit4ClassRunner.run(SpringJUnit4ClassRunner.java:191)
04-Mar-2019 08:44:42         at org.apache.maven.surefire.junit4.JUnit4Provider.execute(JUnit4Provider.java:283)
04-Mar-2019 08:44:42         at org.apache.maven.surefire.junit4.JUnit4Provider.executeWithRerun(JUnit4Provider.java:173)
04-Mar-2019 08:44:42         at org.apache.maven.surefire.junit4.JUnit4Provider.executeTestSet(JUnit4Provider.java:153)
04-Mar-2019 08:44:42         at org.apache.maven.surefire.junit4.JUnit4Provider.invoke(JUnit4Provider.java:128)
04-Mar-2019 08:44:42         at org.apache.maven.surefire.booter.ForkedBooter.invokeProviderInSameClassLoader(ForkedBooter.java:203)
04-Mar-2019 08:44:42         at org.apache.maven.surefire.booter.ForkedBooter.runSuitesInProcess(ForkedBooter.java:155)
04-Mar-2019 08:44:42         at org.apache.maven.surefire.booter.ForkedBooter.main(ForkedBooter.java:103)
04-Mar-2019 08:44:42
04-Mar-2019 08:44:42 manyToOneTest(org.springframework.cloud.dataflow.acceptance.test.NamedChannelTests)  Time elapsed: 0.123 sec  <<< ERROR!
04-Mar-2019 08:44:42 org.springframework.cloud.dataflow.rest.client.DataFlowClientException: Error reading from URL [http://repo.spring.io/libs-release/org/springframework/cloud/stream/app/spring-cloud-stream-app-descriptor/Einstein.RELEASE/spring-cloud-stream-app-descriptor-Einstein.RELEASE.stream-apps-kafka-10-maven]
04-Mar-2019 08:44:42
04-Mar-2019 08:44:42         at org.springframework.cloud.dataflow.rest.client.VndErrorResponseErrorHandler.handleError(VndErrorResponseErrorHandler.java:63)
04-Mar-2019 08:44:42         at org.springframework.web.client.RestTemplate.handleResponse(RestTemplate.java:667)
04-Mar-2019 08:44:42         at org.springframework.web.client.RestTemplate.doExecute(RestTemplate.java:620)
04-Mar-2019 08:44:42         at org.springframework.web.client.RestTemplate.execute(RestTemplate.java:580)
04-Mar-2019 08:44:42         at org.springframework.web.client.RestTemplate.postForObject(RestTemplate.java:380)
04-Mar-2019 08:44:42         at org.springframework.cloud.dataflow.rest.client.AppRegistryTemplate.importFromResource(AppRegistryTemplate.java:133)
04-Mar-2019 08:44:42         at org.springframework.cloud.dataflow.acceptance.test.AbstractStreamTests.registerApps(AbstractStreamTests.java:230)
04-Mar-2019 08:44:42         at org.springframework.cloud.dataflow.acceptance.test.AbstractStreamTests.setup(AbstractStreamTests.java:129)
04-Mar-2019 08:44:42         at sun.reflect.NativeMethodAccessorImpl.invoke0(Native Method)
04-Mar-2019 08:44:42         at sun.reflect.NativeMethodAccessorImpl.invoke(NativeMethodAccessorImpl.java:62)
04-Mar-2019 08:44:42         at sun.reflect.DelegatingMethodAccessorImpl.invoke(DelegatingMethodAccessorImpl.java:43)
04-Mar-2019 08:44:42         at java.lang.reflect.Method.invoke(Method.java:498)
04-Mar-2019 08:44:42         at org.junit.runners.model.FrameworkMethod$1.runReflectiveCall(FrameworkMethod.java:50)
04-Mar-2019 08:44:42         at org.junit.internal.runners.model.ReflectiveCallable.run(ReflectiveCallable.java:12)
04-Mar-2019 08:44:42         at org.junit.runners.model.FrameworkMethod.invokeExplosively(FrameworkMethod.java:47)
04-Mar-2019 08:44:42         at org.junit.internal.runners.statements.RunBefores.evaluate(RunBefores.java:24)
04-Mar-2019 08:44:42         at org.springframework.test.context.junit4.statements.RunBeforeTestMethodCallbacks.evaluate(RunBeforeTestMethodCallbacks.java:75)
04-Mar-2019 08:44:42         at org.springframework.test.context.junit4.statements.RunAfterTestMethodCallbacks.evaluate(RunAfterTestMethodCallbacks.java:86)
04-Mar-2019 08:44:42         at org.junit.rules.TestWatcher$1.evaluate(TestWatcher.java:55)
04-Mar-2019 08:44:42         at org.junit.rules.ExternalResource$1.evaluate(ExternalResource.java:48)
04-Mar-2019 08:44:42         at org.junit.rules.RunRules.evaluate(RunRules.java:20)
04-Mar-2019 08:44:42         at org.springframework.test.context.junit4.statements.SpringRepeat.evaluate(SpringRepeat.java:84)
04-Mar-2019 08:44:42         at org.junit.runners.ParentRunner.runLeaf(ParentRunner.java:325)
04-Mar-2019 08:44:42         at org.springframework.test.context.junit4.SpringJUnit4ClassRunner.runChild(SpringJUnit4ClassRunner.java:252)
04-Mar-2019 08:44:42         at org.springframework.test.context.junit4.SpringJUnit4ClassRunner.runChild(SpringJUnit4ClassRunner.java:94)
04-Mar-2019 08:44:42         at org.junit.runners.ParentRunner$3.run(ParentRunner.java:290)
04-Mar-2019 08:44:42         at org.junit.runners.ParentRunner$1.schedule(ParentRunner.java:71)
04-Mar-2019 08:44:42         at org.junit.runners.ParentRunner.runChildren(ParentRunner.java:288)
04-Mar-2019 08:44:42         at org.junit.runners.ParentRunner.access$000(ParentRunner.java:58)
04-Mar-2019 08:44:42         at org.junit.runners.ParentRunner$2.evaluate(ParentRunner.java:268)
04-Mar-2019 08:44:42         at org.springframework.test.context.junit4.statements.RunBeforeTestClassCallbacks.evaluate(RunBeforeTestClassCallbacks.java:61)
04-Mar-2019 08:44:42         at org.springframework.test.context.junit4.statements.RunAfterTestClassCallbacks.evaluate(RunAfterTestClassCallbacks.java:70)
04-Mar-2019 08:44:42         at org.junit.runners.ParentRunner.run(ParentRunner.java:363)
04-Mar-2019 08:44:42         at org.springframework.test.context.junit4.SpringJUnit4ClassRunner.run(SpringJUnit4ClassRunner.java:191)
04-Mar-2019 08:44:42         at org.apache.maven.surefire.junit4.JUnit4Provider.execute(JUnit4Provider.java:283)
04-Mar-2019 08:44:42         at org.apache.maven.surefire.junit4.JUnit4Provider.executeWithRerun(JUnit4Provider.java:173)
04-Mar-2019 08:44:42         at org.apache.maven.surefire.junit4.JUnit4Provider.executeTestSet(JUnit4Provider.java:153)
04-Mar-2019 08:44:42         at org.apache.maven.surefire.junit4.JUnit4Provider.invoke(JUnit4Provider.java:128)
04-Mar-2019 08:44:42         at org.apache.maven.surefire.booter.ForkedBooter.invokeProviderInSameClassLoader(ForkedBooter.java:203)
04-Mar-2019 08:44:42         at org.apache.maven.surefire.booter.ForkedBooter.runSuitesInProcess(ForkedBooter.java:155)
04-Mar-2019 08:44:42         at org.apache.maven.surefire.booter.ForkedBooter.main(ForkedBooter.java:103)
04-Mar-2019 08:44:42
04-Mar-2019 08:44:42 directedGraphTest(org.springframework.cloud.dataflow.acceptance.test.NamedChannelTests)  Time elapsed: 0.122 sec  <<< ERROR!
04-Mar-2019 08:44:42 org.springframework.cloud.dataflow.rest.client.DataFlowClientException: Error reading from URL [http://repo.spring.io/libs-release/org/springframework/cloud/stream/app/spring-cloud-stream-app-descriptor/Einstein.RELEASE/spring-cloud-stream-app-descriptor-Einstein.RELEASE.stream-apps-kafka-10-maven]
04-Mar-2019 08:44:42
04-Mar-2019 08:44:42         at org.springframework.cloud.dataflow.rest.client.VndErrorResponseErrorHandler.handleError(VndErrorResponseErrorHandler.java:63)
04-Mar-2019 08:44:42         at org.springframework.web.client.RestTemplate.handleResponse(RestTemplate.java:667)
04-Mar-2019 08:44:42         at org.springframework.web.client.RestTemplate.doExecute(RestTemplate.java:620)
04-Mar-2019 08:44:42         at org.springframework.web.client.RestTemplate.execute(RestTemplate.java:580)
04-Mar-2019 08:44:42         at org.springframework.web.client.RestTemplate.postForObject(RestTemplate.java:380)
04-Mar-2019 08:44:42         at org.springframework.cloud.dataflow.rest.client.AppRegistryTemplate.importFromResource(AppRegistryTemplate.java:133)
04-Mar-2019 08:44:42         at org.springframework.cloud.dataflow.acceptance.test.AbstractStreamTests.registerApps(AbstractStreamTests.java:230)
04-Mar-2019 08:44:42         at org.springframework.cloud.dataflow.acceptance.test.AbstractStreamTests.setup(AbstractStreamTests.java:129)
04-Mar-2019 08:44:42         at sun.reflect.NativeMethodAccessorImpl.invoke0(Native Method)
04-Mar-2019 08:44:42         at sun.reflect.NativeMethodAccessorImpl.invoke(NativeMethodAccessorImpl.java:62)
04-Mar-2019 08:44:42         at sun.reflect.DelegatingMethodAccessorImpl.invoke(DelegatingMethodAccessorImpl.java:43)
04-Mar-2019 08:44:42         at java.lang.reflect.Method.invoke(Method.java:498)
04-Mar-2019 08:44:42         at org.junit.runners.model.FrameworkMethod$1.runReflectiveCall(FrameworkMethod.java:50)
04-Mar-2019 08:44:42         at org.junit.internal.runners.model.ReflectiveCallable.run(ReflectiveCallable.java:12)
04-Mar-2019 08:44:42         at org.junit.runners.model.FrameworkMethod.invokeExplosively(FrameworkMethod.java:47)
04-Mar-2019 08:44:42         at org.junit.internal.runners.statements.RunBefores.evaluate(RunBefores.java:24)
04-Mar-2019 08:44:42         at org.springframework.test.context.junit4.statements.RunBeforeTestMethodCallbacks.evaluate(RunBeforeTestMethodCallbacks.java:75)
04-Mar-2019 08:44:42         at org.springframework.test.context.junit4.statements.RunAfterTestMethodCallbacks.evaluate(RunAfterTestMethodCallbacks.java:86)
04-Mar-2019 08:44:42         at org.junit.rules.TestWatcher$1.evaluate(TestWatcher.java:55)
04-Mar-2019 08:44:42         at org.junit.rules.ExternalResource$1.evaluate(ExternalResource.java:48)
04-Mar-2019 08:44:42         at org.junit.rules.RunRules.evaluate(RunRules.java:20)
04-Mar-2019 08:44:42         at org.springframework.test.context.junit4.statements.SpringRepeat.evaluate(SpringRepeat.java:84)
04-Mar-2019 08:44:42         at org.junit.runners.ParentRunner.runLeaf(ParentRunner.java:325)
04-Mar-2019 08:44:42         at org.springframework.test.context.junit4.SpringJUnit4ClassRunner.runChild(SpringJUnit4ClassRunner.java:252)
04-Mar-2019 08:44:42         at org.springframework.test.context.junit4.SpringJUnit4ClassRunner.runChild(SpringJUnit4ClassRunner.java:94)
04-Mar-2019 08:44:42         at org.junit.runners.ParentRunner$3.run(ParentRunner.java:290)
04-Mar-2019 08:44:42         at org.junit.runners.ParentRunner$1.schedule(ParentRunner.java:71)
04-Mar-2019 08:44:42         at org.junit.runners.ParentRunner.runChildren(ParentRunner.java:288)
04-Mar-2019 08:44:42         at org.junit.runners.ParentRunner.access$000(ParentRunner.java:58)
04-Mar-2019 08:44:42         at org.junit.runners.ParentRunner$2.evaluate(ParentRunner.java:268)
04-Mar-2019 08:44:42         at org.springframework.test.context.junit4.statements.RunBeforeTestClassCallbacks.evaluate(RunBeforeTestClassCallbacks.java:61)
04-Mar-2019 08:44:42         at org.springframework.test.context.junit4.statements.RunAfterTestClassCallbacks.evaluate(RunAfterTestClassCallbacks.java:70)
04-Mar-2019 08:44:42         at org.junit.runners.ParentRunner.run(ParentRunner.java:363)
04-Mar-2019 08:44:42         at org.springframework.test.context.junit4.SpringJUnit4ClassRunner.run(SpringJUnit4ClassRunner.java:191)
04-Mar-2019 08:44:42         at org.apache.maven.surefire.junit4.JUnit4Provider.execute(JUnit4Provider.java:283)
04-Mar-2019 08:44:42         at org.apache.maven.surefire.junit4.JUnit4Provider.executeWithRerun(JUnit4Provider.java:173)
04-Mar-2019 08:44:42         at org.apache.maven.surefire.junit4.JUnit4Provider.executeTestSet(JUnit4Provider.java:153)
04-Mar-2019 08:44:42         at org.apache.maven.surefire.junit4.JUnit4Provider.invoke(JUnit4Provider.java:128)
04-Mar-2019 08:44:42         at org.apache.maven.surefire.booter.ForkedBooter.invokeProviderInSameClassLoader(ForkedBooter.java:203)
04-Mar-2019 08:44:42         at org.apache.maven.surefire.booter.ForkedBooter.runSuitesInProcess(ForkedBooter.java:155)
04-Mar-2019 08:44:42         at org.apache.maven.surefire.booter.ForkedBooter.main(ForkedBooter.java:103)
04-Mar-2019 08:44:42
04-Mar-2019 08:44:42 Running org.springframework.cloud.dataflow.acceptance.test.util.PlatformHelperTests
04-Mar-2019 08:44:42 Tests run: 3, Failures: 0, Errors: 0, Skipped: 0, Time elapsed: 0.057 sec - in org.springframework.cloud.dataflow.acceptance.test.util.PlatformHelperTests
04-Mar-2019 08:44:42 Running org.springframework.cloud.dataflow.acceptance.test.util.ApplicationTests
04-Mar-2019 08:44:42 Tests run: 2, Failures: 0, Errors: 0, Skipped: 0, Time elapsed: 0 sec - in org.springframework.cloud.dataflow.acceptance.test.util.ApplicationTests
04-Mar-2019 08:44:42 2019-03-04 08:44:42.125  INFO 11228 --- [       Thread-6] o.s.c.support.GenericApplicationContext  : Closing org.springframework.context.support.GenericApplicationContext@3a66e67e: startup date [Mon Mar 04 08:44:37 UTC 2019]; root of context hierarchy
04-Mar-2019 08:44:42
04-Mar-2019 08:44:42 Results :
04-Mar-2019 08:44:42
04-Mar-2019 08:44:42 Tests in error:
04-Mar-2019 08:44:42   AnalyticsTests>AbstractStreamTests.setup:129->AbstractStreamTests.registerApps:230 » DataFlowClient
04-Mar-2019 08:44:42   HttpSourceTests>AbstractStreamTests.setup:129->AbstractStreamTests.registerApps:230 » DataFlowClient
04-Mar-2019 08:44:42   NamedChannelTests>AbstractStreamTests.setup:129->AbstractStreamTests.registerApps:230 » DataFlowClient
04-Mar-2019 08:44:42   NamedChannelTests>AbstractStreamTests.setup:129->AbstractStreamTests.registerApps:230 » DataFlowClient
04-Mar-2019 08:44:42   NamedChannelTests>AbstractStreamTests.setup:129->AbstractStreamTests.registerApps:230 » DataFlowClient
04-Mar-2019 08:44:42   NamedChannelTests>AbstractStreamTests.setup:129->AbstractStreamTests.registerApps:230 » DataFlowClient
04-Mar-2019 08:44:42   TickTockTests>AbstractStreamTests.setup:129->AbstractStreamTests.registerApps:230 » DataFlowClient
04-Mar-2019 08:44:42   TickTockTests>AbstractStreamTests.setup:129->AbstractStreamTests.registerApps:230 » DataFlowClient
04-Mar-2019 08:44:42   TickTockTests>AbstractStreamTests.setup:129->AbstractStreamTests.registerApps:230 » DataFlowClient
04-Mar-2019 08:44:42   TimestampTaskTests>AbstractTaskTests.setup:90->AbstractTaskTests.registerTasks:182 » DataFlowClient
04-Mar-2019 08:44:42   TimestampTaskTests>AbstractTaskTests.setup:90->AbstractTaskTests.registerTasks:182 » DataFlowClient
04-Mar-2019 08:44:42   TransformTests>AbstractStreamTests.setup:129->AbstractStreamTests.registerApps:230 » DataFlowClient
04-Mar-2019 08:44:42   WoodChuckTests>AbstractStreamTests.setup:129->AbstractStreamTests.registerApps:230 » DataFlowClient
04-Mar-2019 08:44:42
04-Mar-2019 08:44:42 Tests run: 19, Failures: 0, Errors: 13, Skipped: 1
04-Mar-2019 08:44:42
04-Mar-2019 08:44:42 [INFO] ------------------------------------------------------------------------
04-Mar-2019 08:44:42 [INFO] BUILD FAILURE
04-Mar-2019 08:44:42 [INFO] ------------------------------------------------------------------------
04-Mar-2019 08:44:42 [INFO] Total time: 11.119 s
04-Mar-2019 08:44:42 [INFO] Finished at: 2019-03-04T08:44:42+00:00
04-Mar-2019 08:44:42 [INFO] Final Memory: 56M/465M
04-Mar-2019 08:44:42 [INFO] ------------------------------------------------------------------------
04-Mar-2019 08:44:42 [ERROR] Failed to execute goal org.apache.maven.plugins:maven-surefire-plugin:2.18.1:test (default-test) on project spring-cloud-dataflow-acceptance-tests: There are test failures.
04-Mar-2019 08:44:42 [ERROR]
04-Mar-2019 08:44:42 [ERROR] Please refer to /opt/bamboo-home/xml-data/build-dir/SCDT-LOCAL20XSKIPPER20X-KAFKA/target/surefire-reports for the individual test results.
04-Mar-2019 08:44:42 [ERROR] -> [Help 1]
04-Mar-2019 08:44:42 [ERROR]
04-Mar-2019 08:44:42 [ERROR] To see the full stack trace of the errors, re-run Maven with the -e switch.
04-Mar-2019 08:44:42 [ERROR] Re-run Maven using the -X switch to enable full debug logging.
04-Mar-2019 08:44:42 [ERROR]
04-Mar-2019 08:44:42 [ERROR] For more information about the errors and possible solutions, please read the following articles:
04-Mar-2019 08:44:42 [ERROR] [Help 1] http://cwiki.apache.org/confluence/display/MAVEN/MojoFailureException
04-Mar-2019 08:44:42 Clean up, clean up, everybody everywhere; clean up clean up, everybody do your share!
04-Mar-2019 08:44:42 Killing process PID [11078]
04-Mar-2019 08:44:42 Killing process PID [10991]
04-Mar-2019 08:44:42 No stopped containers
04-Mar-2019 08:44:43 Stopping mysql_mysql_1 ...
04-Mar-2019 08:44:45
04-Mar-2019 08:44:45 Stopping mysql_mysql_1 ... done
04-Mar-2019 08:44:45 Removing mysql_mysql_1 ...
04-Mar-2019 08:44:45
04-Mar-2019 08:44:45 Removing mysql_mysql_1 ... done
04-Mar-2019 08:44:45 Going to remove mysql_mysql_1
04-Mar-2019 08:44:45 Stopping kafka_kafka_1 ...
04-Mar-2019 08:44:45 Stopping kafka_zookeeper_1 ...
04-Mar-2019 08:44:47
04-Mar-2019 08:44:47 Stopping kafka_kafka_1 ... done
04-Mar-2019 08:44:55
04-Mar-2019 08:44:55 Stopping kafka_zookeeper_1 ... done
04-Mar-2019 08:44:56 Removing kafka_kafka_1 ...
04-Mar-2019 08:44:56 Removing kafka_zookeeper_1 ...
04-Mar-2019 08:44:56
04-Mar-2019 08:44:56 Removing kafka_kafka_1 ... done
04-Mar-2019 08:44:56
04-Mar-2019 08:44:56 Removing kafka_zookeeper_1 ... done
04-Mar-2019 08:44:56 Going to remove kafka_kafka_1, kafka_zookeeper_1
04-Mar-2019 08:44:56
04-Mar-2019 08:44:56 Finished task 'Execute Acceptance Tests' with result: Success
04-Mar-2019 08:44:56 Starting task 'JUnit Parser' of type 'com.atlassian.bamboo.plugins.testresultparser:task.testresultparser.junit'
04-Mar-2019 08:44:56 Parsing test results under /opt/bamboo-home/xml-data/build-dir/SCDT-LOCAL20XSKIPPER20X-KAFKA...
04-Mar-2019 08:44:56 Failing task since 13 failing test cases were found.
04-Mar-2019 08:44:56 Finished task 'JUnit Parser' with result: Failed
04-Mar-2019 08:44:56 Starting task 'clean up' of type 'com.atlassian.bamboo.plugins.scripttask:task.builder.script'
04-Mar-2019 08:44:56
Beginning to execute external process for build 'Spring Cloud Data Flow Acceptance Tests - Local + SCDF-2.0.0.BS + Skipper 2.0.0.BS - Run Data Flow Acceptance Tests for Kafka #35 (SCDT-LOCAL20XSKIPPER20X-KAFKA-35)'
... running command line:
/opt/bamboo-home/temp/SCDT-LOCAL20XSKIPPER20X-KAFKA-35-ScriptBuildTask-1155451330298602644.sh
... in: /opt/bamboo-home/xml-data/build-dir/SCDT-LOCAL20XSKIPPER20X-KAFKA
... using extra environment variables:
bamboo_planRepository_1_branch=master
bamboo_********_username_password=********
bamboo_signing_store_password=********
bamboo_capability_system_builder_ant_Ant_1_9=/opt/ant-1.9
bamboo_capability_system_builder_ant_Ant_1_8=/opt/ant-1.8
bamboo_planRepository_1_branchDisplayName=master
bamboo_repository_274694331_git_username=spring-buildmaster
bamboo_capability_system_jdk_OpenJDK_7u181=/opt/openjdk-7
bamboo_repository_revision_number=04b684b2eb51b186ae481810bd9a093620774df0
bamboo_capability_system_builder_node_Node_js_6=/usr/bin/node
bamboo_RIAK_BIN=/usr/sbin/riak
bamboo_buildKey=SCDT-LOCAL20XSKIPPER20X-KAFKA
bamboo_repository_274694331_branch_name=master
bamboo_bintray_password=********
bamboo_sonar_token_password=********
bamboo_shortJobName=Run Data Flow Acceptance Tests for Kafka
bamboo_capability_system_builder_gradle___gradlew=./gradlew
bamboo_buildResultsUrl=https://build.spring.io/browse/SCDT-LOCAL20XSKIPPER20X-KAFKA-35
bamboo_capability_system_builder_mvn3_Maven_3_3=/opt/maven-3.3
bamboo_capability_system_builder_mvn3_Maven_3_2=/opt/maven-3.2
bamboo_capability_system_builder_mvn3_Maven_3_1=/opt/maven-3.1
bamboo_planRepository_repositoryUrl=https://github.com/spring-cloud/spring-cloud-dataflow-acceptance-tests.git
bamboo_agentId=208568329
bamboo_capability_system_builder_mvn3_Maven_3_5=/opt/maven-3.5
bamboo_capability_system_builder_mvn3_Maven_3_0=/opt/maven-3.0
bamboo_planRepository_revision=04b684b2eb51b186ae481810bd9a093620774df0
bamboo_planRepository_previousRevision=04b684b2eb51b186ae481810bd9a093620774df0
bamboo_capability_remote_build=true
bamboo_repository_branch_name=master
bamboo_sonatype_token_password=********
bamboo_repository_274694331_name=Git
bamboo_scdf_acceptance_tests_password=********
bamboo_dependenciesDisabled=false
bamboo_repository_274694331_git_branch=master
bamboo_capability_Agent=bamboo-07.af.pivotal.io
bamboo_planRepository_branch=master
bamboo_planRepository_1_type=gitv2
bamboo_planRepository_branchName=master
bamboo_sonar_password=********
bamboo_hg_cache_directory=/opt/bamboo-home/xml-data/build-dir/_hg-repositories-cache
bamboo_planRepository_1_username=spring-buildmaster
bamboo_repository_274694331_git_repositoryUrl=https://github.com/spring-cloud/spring-cloud-dataflow-acceptance-tests.git
bamboo_planRepository_type=gitv2
bamboo_ManualBuildTriggerReason_userName=igopinathan
bamboo_git_cache_directory=/opt/bamboo-home/xml-data/build-dir/_git-repositories-cache
bamboo_artifactory_username=buildmaster
bamboo_tmp_directory=/opt/bamboo-home/temp
bamboo_planKey=SCDT-LOCAL20XSKIPPER20X
bamboo_planRepository_username=spring-buildmaster
bamboo_JDK8_HOME=/opt/jdk-8
bamboo_repository_274694331_previous_revision_number=04b684b2eb51b186ae481810bd9a093620774df0
bamboo_planRepository_1_branchName=master
bamboo_sonar_version=5.6.3
bamboo_capability_system_jdk_JDK_1_11=/opt/jdk-11
bamboo_resultsUrl=https://build.spring.io/browse/SCDT-LOCAL20XSKIPPER20X-KAFKA-35
bamboo_capability_system_jdk_JDK_1_10=/opt/jdk-10
bamboo_build_working_directory=/opt/bamboo-home/xml-data/build-dir/SCDT-LOCAL20XSKIPPER20X-KAFKA
bamboo_planRepository_1_name=Git
bamboo_capability_system_os=ubuntu1604
bamboo_nexusPush_stagingProfile=buildmaster
bamboo_shortPlanName=Local + SCDF-2.0.0.BS + Skipper 2.0.0.BS
bamboo_planRepository_name=Git
bamboo_buildNumber=35
bamboo_planName=Spring Cloud Data Flow Acceptance Tests - Local + SCDF-2.0.0.BS + Skipper 2.0.0.BS
bamboo_JDK7_HOME=/opt/jdk-7
bamboo_build_commandline_com_atlassian_bamboo_plugins_scripttask_task_builder_script_7=/opt/bamboo-home/temp/SCDT-LOCAL20XSKIPPER20X-KAFKA-35-ScriptBuildTask-5664516931263335125.sh
bamboo_shortPlanKey=LOCAL20XSKIPPER20X
bamboo_shortJobKey=KAFKA
bamboo_artifactory_password=********
bamboo_buildTimeStamp=2019-03-04T08:42:24.410Z
bamboo_repository_previous_revision_number=04b684b2eb51b186ae481810bd9a093620774df0
bamboo_sonar_username=buildmaster
bamboo_********_password=********
bamboo_repository_git_branch=master
bamboo_buildResultKey=SCDT-LOCAL20XSKIPPER20X-KAFKA-35
bamboo_nexusPush_close=true
bamboo_buildPlanName=Spring Cloud Data Flow Acceptance Tests - Local + SCDF-2.0.0.BS + Skipper 2.0.0.BS - Run Data Flow Acceptance Tests for Kafka
bamboo_repository_274694331_revision_number=04b684b2eb51b186ae481810bd9a093620774df0
bamboo_planRepository_1_revision=04b684b2eb51b186ae481810bd9a093620774df0
bamboo_repository_name=Git
bamboo_signing_key_password=********
bamboo_buildFailed=true
bamboo_capability_system_docker_executable=/usr/bin/docker
bamboo_capability_system_builder_groovy_Groovy_2_4=/opt/groovy-2.4
bamboo_capability_system_builder_command_Bash=/bin/bash
bamboo_jobFailed=true
bamboo_agentWorkingDirectory=/opt/bamboo-home/xml-data/build-dir
bamboo_capability_system_git_executable=/usr/bin/git
bamboo_repository_git_username=spring-buildmaster
bamboo_planRepository_1_previousRevision=04b684b2eb51b186ae481810bd9a093620774df0
bamboo_capability_os_family=unix
bamboo_planRepository_branchDisplayName=master
bamboo_capability_system_builder_maven_Artifactory_Maven_3_5=/opt/maven-3.5
bamboo_capability_system_builder_maven_Artifactory_Maven_3_3=/opt/maven-3.3
bamboo_capability_system_builder_maven_Artifactory_Maven_3_2=/opt/maven-3.2
bamboo_s3_properties=/home/bamboo/tools/s3.properties
bamboo_capability_system_builder_maven_Artifactory_Maven_3_1=/opt/maven-3.1
bamboo_capability_system_builder_maven_Artifactory_Maven_3_0=/opt/maven-3.0
bamboo_plan_storageTag=plan-274497908
bamboo_bintray_username_password=********
bamboo_repository_git_repositoryUrl=https://github.com/spring-cloud/spring-cloud-dataflow-acceptance-tests.git
bamboo_working_directory=/opt/bamboo-home/xml-data/build-dir/SCDT-LOCAL20XSKIPPER20X-KAFKA
bamboo_planRepository_1_repositoryUrl=https://github.com/spring-cloud/spring-cloud-dataflow-acceptance-tests.git
bamboo_capability_system_jdk_JDK_1_8=/opt/jdk-8
bamboo_capability_system_jdk_JDK_1_9=/opt/jdk-9
bamboo_capability_system_jdk_JDK_1_6=/opt/jdk-6
bamboo_sonatype_password=********
bamboo_capability_system_jdk_JDK_1_7=/opt/jdk-7
bamboo_sonar_ip=10.194.6.9
04-Mar-2019 08:44:56 CLEANING UP RESOURCES AFTER RUNNING TESTS
04-Mar-2019 08:44:56 Environment variable JAVA_HOME must be set
04-Mar-2019 08:44:56 FINISHED CLEANING UP RESOURCES
04-Mar-2019 08:44:56 Finished task 'clean up' with result: Success
04-Mar-2019 08:44:56 Running post build plugin 'Docker Container Cleanup'
04-Mar-2019 08:44:56 Running post build plugin 'NCover Results Collector'
04-Mar-2019 08:44:56 Running post build plugin 'Artifactory Release Management Staging'
04-Mar-2019 08:44:56 Running post build plugin 'Artifactory Build Info Copier'
04-Mar-2019 08:44:56 Running post build plugin 'Artifactory Gradle Properties Info Copier'
04-Mar-2019 08:44:56 Running post build plugin 'Clover Results Collector'
04-Mar-2019 08:44:56 Running post build plugin 'npm Cache Cleanup'
04-Mar-2019 08:44:56 Running post build plugin 'Artifact Copier'
04-Mar-2019 08:44:56 Publishing an artifact: Test Results
04-Mar-2019 08:44:56 Finished publishing of artifact Job artifact: [Test Results], pattern: [**/target/surefire-reports/**/*.*] in 36.99 ms
04-Mar-2019 08:44:56 Publishing an artifact: App and Server Logs
04-Mar-2019 08:44:56 Finished publishing of artifact Job artifact: [App and Server Logs], pattern: [**/*.log] anchored at: [local] in 12.83 ms
04-Mar-2019 08:44:56 Successfully removed working directory at '/opt/bamboo-home/xml-data/build-dir/SCDT-LOCAL20XSKIPPER20X-KAFKA'
04-Mar-2019 08:44:56 Finalising the build...
04-Mar-2019 08:44:56 Stopping timer.
04-Mar-2019 08:44:56 Build SCDT-LOCAL20XSKIPPER20X-KAFKA-35 completed.
04-Mar-2019 08:44:56 Running on server: post build plugin 'NCover Results Collector'
04-Mar-2019 08:44:56 Running on server: post build plugin 'Build Hanging Detection Configuration'
04-Mar-2019 08:44:56 Running on server: post build plugin 'Clover Delta Calculator'
04-Mar-2019 08:44:56 Running on server: post build plugin 'Maven Dependencies Postprocessor'
04-Mar-2019 08:44:56 All post build plugins have finished
04-Mar-2019 08:44:56 Generating build results summary...
04-Mar-2019 08:44:56 Saving build results to disk...
04-Mar-2019 08:44:56 Logging substituted variables...
04-Mar-2019 08:44:56 Indexing build results...
04-Mar-2019 08:44:56 Finished building SCDT-LOCAL20XSKIPPER20X-KAFKA-35.