Build: #35 failed

Job: Run Data Flow Acceptance Tests for Kafka failed

Stages & jobs

  1. Test Stage - Kafka

  2. Test Stage - Rabbit

Test results

  • 19 tests in total
  • 13 tests failed
  • 11 failures are new
  • 1 test was quarantined / skipped
  • 4 seconds taken in total.

Build 35 has the following 13 errors: 11 new failure(s) occurred since the previous build.

New test failures 11
Status Test Duration
Collapse Failed HttpSourceTests httpSourceTests History
< 1 sec
org.springframework.cloud.dataflow.rest.client.DataFlowClientException: Error reading from URL [http://repo.spring.io/libs-release/org/springframework/cloud/stream/app/spring-cloud-stream-app-descriptor/Einstein.RELEASE/spring-cloud-stream-app-descriptor-Einstein.RELEASE.stream-apps-kafka-10-maven]

	at org.springframework.cloud.dataflow.rest.client.VndErrorResponseErrorHandler.handleError(VndErrorResponseErrorHandler.java:63)
	at org.springframework.web.client.RestTemplate.handleResponse(RestTemplate.java:667)
	at org.springframework.web.client.RestTemplate.doExecute(RestTemplate.java:620)
	at org.springframework.web.client.RestTemplate.execute(RestTemplate.java:580)
	at org.springframework.web.client.RestTemplate.postForObject(RestTemplate.java:380)
	at org.springframework.cloud.dataflow.rest.client.AppRegistryTemplate.importFromResource(AppRegistryTemplate.java:133)
(35 more lines...)
Collapse Failed NamedChannelTests directedGraphTest History
< 1 sec
org.springframework.cloud.dataflow.rest.client.DataFlowClientException: Error reading from URL [http://repo.spring.io/libs-release/org/springframework/cloud/stream/app/spring-cloud-stream-app-descriptor/Einstein.RELEASE/spring-cloud-stream-app-descriptor-Einstein.RELEASE.stream-apps-kafka-10-maven]

	at org.springframework.cloud.dataflow.rest.client.VndErrorResponseErrorHandler.handleError(VndErrorResponseErrorHandler.java:63)
	at org.springframework.web.client.RestTemplate.handleResponse(RestTemplate.java:667)
	at org.springframework.web.client.RestTemplate.doExecute(RestTemplate.java:620)
	at org.springframework.web.client.RestTemplate.execute(RestTemplate.java:580)
	at org.springframework.web.client.RestTemplate.postForObject(RestTemplate.java:380)
	at org.springframework.cloud.dataflow.rest.client.AppRegistryTemplate.importFromResource(AppRegistryTemplate.java:133)
(35 more lines...)
Collapse Failed NamedChannelTests manyToOneTest History
< 1 sec
org.springframework.cloud.dataflow.rest.client.DataFlowClientException: Error reading from URL [http://repo.spring.io/libs-release/org/springframework/cloud/stream/app/spring-cloud-stream-app-descriptor/Einstein.RELEASE/spring-cloud-stream-app-descriptor-Einstein.RELEASE.stream-apps-kafka-10-maven]

	at org.springframework.cloud.dataflow.rest.client.VndErrorResponseErrorHandler.handleError(VndErrorResponseErrorHandler.java:63)
	at org.springframework.web.client.RestTemplate.handleResponse(RestTemplate.java:667)
	at org.springframework.web.client.RestTemplate.doExecute(RestTemplate.java:620)
	at org.springframework.web.client.RestTemplate.execute(RestTemplate.java:580)
	at org.springframework.web.client.RestTemplate.postForObject(RestTemplate.java:380)
	at org.springframework.cloud.dataflow.rest.client.AppRegistryTemplate.importFromResource(AppRegistryTemplate.java:133)
(35 more lines...)
Collapse Failed NamedChannelTests testDestination History
< 1 sec
org.springframework.cloud.dataflow.rest.client.DataFlowClientException: Error reading from URL [http://repo.spring.io/libs-release/org/springframework/cloud/stream/app/spring-cloud-stream-app-descriptor/Einstein.RELEASE/spring-cloud-stream-app-descriptor-Einstein.RELEASE.stream-apps-kafka-10-maven]

	at org.springframework.cloud.dataflow.rest.client.VndErrorResponseErrorHandler.handleError(VndErrorResponseErrorHandler.java:63)
	at org.springframework.web.client.RestTemplate.handleResponse(RestTemplate.java:667)
	at org.springframework.web.client.RestTemplate.doExecute(RestTemplate.java:620)
	at org.springframework.web.client.RestTemplate.execute(RestTemplate.java:580)
	at org.springframework.web.client.RestTemplate.postForObject(RestTemplate.java:380)
	at org.springframework.cloud.dataflow.rest.client.AppRegistryTemplate.importFromResource(AppRegistryTemplate.java:133)
(35 more lines...)
Collapse Failed NamedChannelTests testTap History
< 1 sec
org.springframework.cloud.dataflow.rest.client.DataFlowClientException: Error reading from URL [http://repo.spring.io/libs-release/org/springframework/cloud/stream/app/spring-cloud-stream-app-descriptor/Einstein.RELEASE/spring-cloud-stream-app-descriptor-Einstein.RELEASE.stream-apps-kafka-10-maven]

	at org.springframework.cloud.dataflow.rest.client.VndErrorResponseErrorHandler.handleError(VndErrorResponseErrorHandler.java:63)
	at org.springframework.web.client.RestTemplate.handleResponse(RestTemplate.java:667)
	at org.springframework.web.client.RestTemplate.doExecute(RestTemplate.java:620)
	at org.springframework.web.client.RestTemplate.execute(RestTemplate.java:580)
	at org.springframework.web.client.RestTemplate.postForObject(RestTemplate.java:380)
	at org.springframework.cloud.dataflow.rest.client.AppRegistryTemplate.importFromResource(AppRegistryTemplate.java:133)
(35 more lines...)
Collapse Failed TickTockTests tickTockTests History
< 1 sec
org.springframework.cloud.dataflow.rest.client.DataFlowClientException: Error reading from URL [http://repo.spring.io/libs-release/org/springframework/cloud/stream/app/spring-cloud-stream-app-descriptor/Einstein.RELEASE/spring-cloud-stream-app-descriptor-Einstein.RELEASE.stream-apps-kafka-10-maven]

	at org.springframework.cloud.dataflow.rest.client.VndErrorResponseErrorHandler.handleError(VndErrorResponseErrorHandler.java:63)
	at org.springframework.web.client.RestTemplate.handleResponse(RestTemplate.java:667)
	at org.springframework.web.client.RestTemplate.doExecute(RestTemplate.java:620)
	at org.springframework.web.client.RestTemplate.execute(RestTemplate.java:580)
	at org.springframework.web.client.RestTemplate.postForObject(RestTemplate.java:380)
	at org.springframework.cloud.dataflow.rest.client.AppRegistryTemplate.importFromResource(AppRegistryTemplate.java:133)
(35 more lines...)
Collapse Failed TickTockTests tickTockUpdateRollbackTests History
< 1 sec
org.springframework.cloud.dataflow.rest.client.DataFlowClientException: Error reading from URL [http://repo.spring.io/libs-release/org/springframework/cloud/stream/app/spring-cloud-stream-app-descriptor/Einstein.RELEASE/spring-cloud-stream-app-descriptor-Einstein.RELEASE.stream-apps-kafka-10-maven]

	at org.springframework.cloud.dataflow.rest.client.VndErrorResponseErrorHandler.handleError(VndErrorResponseErrorHandler.java:63)
	at org.springframework.web.client.RestTemplate.handleResponse(RestTemplate.java:667)
	at org.springframework.web.client.RestTemplate.doExecute(RestTemplate.java:620)
	at org.springframework.web.client.RestTemplate.execute(RestTemplate.java:580)
	at org.springframework.web.client.RestTemplate.postForObject(RestTemplate.java:380)
	at org.springframework.cloud.dataflow.rest.client.AppRegistryTemplate.importFromResource(AppRegistryTemplate.java:133)
(35 more lines...)
Collapse Failed TimestampTaskTests timeStampTests History
< 1 sec
org.springframework.cloud.dataflow.rest.client.DataFlowClientException: Error reading from URL [http://repo.spring.io/libs-release/org/springframework/cloud/task/app/spring-cloud-task-app-descriptor/Elston.RC1/spring-cloud-task-app-descriptor-Elston.RC1.task-apps-maven]

	at org.springframework.cloud.dataflow.rest.client.VndErrorResponseErrorHandler.handleError(VndErrorResponseErrorHandler.java:63)
	at org.springframework.web.client.RestTemplate.handleResponse(RestTemplate.java:667)
	at org.springframework.web.client.RestTemplate.doExecute(RestTemplate.java:620)
	at org.springframework.web.client.RestTemplate.execute(RestTemplate.java:580)
	at org.springframework.web.client.RestTemplate.postForObject(RestTemplate.java:380)
	at org.springframework.cloud.dataflow.rest.client.AppRegistryTemplate.importFromResource(AppRegistryTemplate.java:133)
(35 more lines...)
Collapse Failed TimestampTaskTests timeStampTestsMultipleLaunch History
< 1 sec
org.springframework.cloud.dataflow.rest.client.DataFlowClientException: Error reading from URL [http://repo.spring.io/libs-release/org/springframework/cloud/task/app/spring-cloud-task-app-descriptor/Elston.RC1/spring-cloud-task-app-descriptor-Elston.RC1.task-apps-maven]

	at org.springframework.cloud.dataflow.rest.client.VndErrorResponseErrorHandler.handleError(VndErrorResponseErrorHandler.java:63)
	at org.springframework.web.client.RestTemplate.handleResponse(RestTemplate.java:667)
	at org.springframework.web.client.RestTemplate.doExecute(RestTemplate.java:620)
	at org.springframework.web.client.RestTemplate.execute(RestTemplate.java:580)
	at org.springframework.web.client.RestTemplate.postForObject(RestTemplate.java:380)
	at org.springframework.cloud.dataflow.rest.client.AppRegistryTemplate.importFromResource(AppRegistryTemplate.java:133)
(35 more lines...)
Collapse Failed TransformTests transformTests History
< 1 sec
org.springframework.cloud.dataflow.rest.client.DataFlowClientException: Error reading from URL [http://repo.spring.io/libs-release/org/springframework/cloud/stream/app/spring-cloud-stream-app-descriptor/Einstein.RELEASE/spring-cloud-stream-app-descriptor-Einstein.RELEASE.stream-apps-kafka-10-maven]

	at org.springframework.cloud.dataflow.rest.client.VndErrorResponseErrorHandler.handleError(VndErrorResponseErrorHandler.java:63)
	at org.springframework.web.client.RestTemplate.handleResponse(RestTemplate.java:667)
	at org.springframework.web.client.RestTemplate.doExecute(RestTemplate.java:620)
	at org.springframework.web.client.RestTemplate.execute(RestTemplate.java:580)
	at org.springframework.web.client.RestTemplate.postForObject(RestTemplate.java:380)
	at org.springframework.cloud.dataflow.rest.client.AppRegistryTemplate.importFromResource(AppRegistryTemplate.java:133)
(35 more lines...)
Collapse Failed WoodChuckTests testPartitioning History
< 1 sec
org.springframework.cloud.dataflow.rest.client.DataFlowClientException: Error reading from URL [http://repo.spring.io/libs-release/org/springframework/cloud/stream/app/spring-cloud-stream-app-descriptor/Einstein.RELEASE/spring-cloud-stream-app-descriptor-Einstein.RELEASE.stream-apps-kafka-10-maven]

	at org.springframework.cloud.dataflow.rest.client.VndErrorResponseErrorHandler.handleError(VndErrorResponseErrorHandler.java:63)
	at org.springframework.web.client.RestTemplate.handleResponse(RestTemplate.java:667)
	at org.springframework.web.client.RestTemplate.doExecute(RestTemplate.java:620)
	at org.springframework.web.client.RestTemplate.execute(RestTemplate.java:580)
	at org.springframework.web.client.RestTemplate.postForObject(RestTemplate.java:380)
	at org.springframework.cloud.dataflow.rest.client.AppRegistryTemplate.importFromResource(AppRegistryTemplate.java:133)
(35 more lines...)
Existing test failures 2
Status Test Failing since Duration
org.springframework.cloud.dataflow.rest.client.DataFlowClientException: Error reading from URL [http://repo.spring.io/libs-release/org/springframework/cloud/stream/app/spring-cloud-stream-app-descriptor/Einstein.RELEASE/spring-cloud-stream-app-descriptor-Einstein.RELEASE.stream-apps-kafka-10-maven]

	at org.springframework.cloud.dataflow.rest.client.VndErrorResponseErrorHandler.handleError(VndErrorResponseErrorHandler.java:63)
	at org.springframework.web.client.RestTemplate.handleResponse(RestTemplate.java:667)
	at org.springframework.web.client.RestTemplate.doExecute(RestTemplate.java:620)
	at org.springframework.web.client.RestTemplate.execute(RestTemplate.java:580)
	at org.springframework.web.client.RestTemplate.postForObject(RestTemplate.java:380)
	at org.springframework.cloud.dataflow.rest.client.AppRegistryTemplate.importFromResource(AppRegistryTemplate.java:133)
(36 more lines...)
org.springframework.cloud.dataflow.rest.client.DataFlowClientException: Error reading from URL [http://repo.spring.io/libs-release/org/springframework/cloud/stream/app/spring-cloud-stream-app-descriptor/Einstein.RELEASE/spring-cloud-stream-app-descriptor-Einstein.RELEASE.stream-apps-kafka-10-maven]

	at org.springframework.cloud.dataflow.rest.client.VndErrorResponseErrorHandler.handleError(VndErrorResponseErrorHandler.java:63)
	at org.springframework.web.client.RestTemplate.handleResponse(RestTemplate.java:667)
	at org.springframework.web.client.RestTemplate.doExecute(RestTemplate.java:620)
	at org.springframework.web.client.RestTemplate.execute(RestTemplate.java:580)
	at org.springframework.web.client.RestTemplate.postForObject(RestTemplate.java:380)
	at org.springframework.cloud.dataflow.rest.client.AppRegistryTemplate.importFromResource(AppRegistryTemplate.java:133)
(35 more lines...)