Build: #39 failed

Job: Run Data Flow Acceptance Tests for Kafka failed

Stages & jobs

  1. Test Stage - Kafka

  2. Test Stage - Rabbit

Build log

The build generated 1,229 lines of output.The output is too long and has been truncated to the last 1,000 lines. Download or view full build log

04-Mar-2019 13:53:50 2019-03-04 13:53:50.920  INFO   --- [           main] .b.t.c.SpringBootTestContextBootstrapper : Neither @ContextConfiguration nor @ContextHierarchy found for test class [org.springframework.cloud.dataflow.acceptance.test.HttpSourceTests], using SpringBootContextLoader
04-Mar-2019 13:53:50 2019-03-04 13:53:50.929  INFO   --- [           main] .b.t.c.SpringBootTestContextBootstrapper : Loaded default TestExecutionListener class names from location [META-INF/spring.factories]: [org.springframework.boot.test.mock.mockito.MockitoTestExecutionListener, org.springframework.boot.test.mock.mockito.ResetMocksTestExecutionListener, org.springframework.boot.test.autoconfigure.restdocs.RestDocsTestExecutionListener, org.springframework.boot.test.autoconfigure.web.client.MockRestServiceServerResetTestExecutionListener, org.springframework.boot.test.autoconfigure.web.servlet.MockMvcPrintOnlyOnFailureTestExecutionListener, org.springframework.boot.test.autoconfigure.web.servlet.WebDriverTestExecutionListener, org.springframework.test.context.web.ServletTestExecutionListener, org.springframework.test.context.support.DirtiesContextBeforeModesTestExecutionListener, org.springframework.test.context.support.DependencyInjectionTestExecutionListener, org.springframework.test.context.support.DirtiesContextTestExecutionListener, org.springframework.test.context.transaction.TransactionalTestExecutionListener, org.springframework.test.context.jdbc.SqlScriptsTestExecutionListener]
04-Mar-2019 13:53:50 2019-03-04 13:53:50.932  INFO   --- [           main] .b.t.c.SpringBootTestContextBootstrapper : Using TestExecutionListeners: [org.springframework.test.context.web.ServletTestExecutionListener@1a677343, org.springframework.test.context.support.DirtiesContextBeforeModesTestExecutionListener@15de0b3c, org.springframework.boot.test.autoconfigure.SpringBootDependencyInjectionTestExecutionListener@489115ef, org.springframework.test.context.support.DirtiesContextTestExecutionListener@3857f613, org.springframework.test.context.transaction.TransactionalTestExecutionListener@198b6731, org.springframework.test.context.jdbc.SqlScriptsTestExecutionListener@7c6908d7, org.springframework.boot.test.autoconfigure.web.servlet.MockMvcPrintOnlyOnFailureTestExecutionListener@3c9754d8, org.springframework.boot.test.autoconfigure.web.client.MockRestServiceServerResetTestExecutionListener@3bf7ca37, org.springframework.boot.test.mock.mockito.ResetMocksTestExecutionListener@79079097, org.springframework.boot.test.autoconfigure.web.servlet.WebDriverTestExecutionListener@4d1c00d0, org.springframework.boot.test.autoconfigure.restdocs.RestDocsTestExecutionListener@4b2bac3f, org.springframework.boot.test.mock.mockito.MockitoTestExecutionListener@4e08711f]
04-Mar-2019 13:53:50 2019-03-04 13:53:50.947  INFO   --- [           main] .b.t.c.SpringBootTestContextBootstrapper : Neither @ContextConfiguration nor @ContextHierarchy found for test class [org.springframework.cloud.dataflow.acceptance.test.TickTockTests], using SpringBootContextLoader
04-Mar-2019 13:53:50 2019-03-04 13:53:50.955  INFO   --- [           main] .b.t.c.SpringBootTestContextBootstrapper : Loaded default TestExecutionListener class names from location [META-INF/spring.factories]: [org.springframework.boot.test.mock.mockito.MockitoTestExecutionListener, org.springframework.boot.test.mock.mockito.ResetMocksTestExecutionListener, org.springframework.boot.test.autoconfigure.restdocs.RestDocsTestExecutionListener, org.springframework.boot.test.autoconfigure.web.client.MockRestServiceServerResetTestExecutionListener, org.springframework.boot.test.autoconfigure.web.servlet.MockMvcPrintOnlyOnFailureTestExecutionListener, org.springframework.boot.test.autoconfigure.web.servlet.WebDriverTestExecutionListener, org.springframework.test.context.web.ServletTestExecutionListener, org.springframework.test.context.support.DirtiesContextBeforeModesTestExecutionListener, org.springframework.test.context.support.DependencyInjectionTestExecutionListener, org.springframework.test.context.support.DirtiesContextTestExecutionListener, org.springframework.test.context.transaction.TransactionalTestExecutionListener, org.springframework.test.context.jdbc.SqlScriptsTestExecutionListener]
04-Mar-2019 13:53:50 2019-03-04 13:53:50.957  INFO   --- [           main] .b.t.c.SpringBootTestContextBootstrapper : Using TestExecutionListeners: [org.springframework.test.context.web.ServletTestExecutionListener@67080771, org.springframework.test.context.support.DirtiesContextBeforeModesTestExecutionListener@72cde7cc, org.springframework.boot.test.autoconfigure.SpringBootDependencyInjectionTestExecutionListener@5fd4f8f5, org.springframework.test.context.support.DirtiesContextTestExecutionListener@696da30b, org.springframework.test.context.transaction.TransactionalTestExecutionListener@4e7912d8, org.springframework.test.context.jdbc.SqlScriptsTestExecutionListener@53976f5c, org.springframework.boot.test.autoconfigure.web.servlet.MockMvcPrintOnlyOnFailureTestExecutionListener@2bfc268b, org.springframework.boot.test.autoconfigure.web.client.MockRestServiceServerResetTestExecutionListener@2f8dad04, org.springframework.boot.test.mock.mockito.ResetMocksTestExecutionListener@29e495ff, org.springframework.boot.test.autoconfigure.web.servlet.WebDriverTestExecutionListener@41e1e210, org.springframework.boot.test.autoconfigure.restdocs.RestDocsTestExecutionListener@be35cd9, org.springframework.boot.test.mock.mockito.MockitoTestExecutionListener@4944252c]
04-Mar-2019 13:53:50 2019-03-04 13:53:50.959  INFO   --- [           main] .b.t.c.SpringBootTestContextBootstrapper : Neither @ContextConfiguration nor @ContextHierarchy found for test class [org.springframework.cloud.dataflow.acceptance.test.TransformTests], using SpringBootContextLoader
04-Mar-2019 13:53:50 2019-03-04 13:53:50.966  INFO   --- [           main] .b.t.c.SpringBootTestContextBootstrapper : Loaded default TestExecutionListener class names from location [META-INF/spring.factories]: [org.springframework.boot.test.mock.mockito.MockitoTestExecutionListener, org.springframework.boot.test.mock.mockito.ResetMocksTestExecutionListener, org.springframework.boot.test.autoconfigure.restdocs.RestDocsTestExecutionListener, org.springframework.boot.test.autoconfigure.web.client.MockRestServiceServerResetTestExecutionListener, org.springframework.boot.test.autoconfigure.web.servlet.MockMvcPrintOnlyOnFailureTestExecutionListener, org.springframework.boot.test.autoconfigure.web.servlet.WebDriverTestExecutionListener, org.springframework.test.context.web.ServletTestExecutionListener, org.springframework.test.context.support.DirtiesContextBeforeModesTestExecutionListener, org.springframework.test.context.support.DependencyInjectionTestExecutionListener, org.springframework.test.context.support.DirtiesContextTestExecutionListener, org.springframework.test.context.transaction.TransactionalTestExecutionListener, org.springframework.test.context.jdbc.SqlScriptsTestExecutionListener]
04-Mar-2019 13:53:50 2019-03-04 13:53:50.969  INFO   --- [           main] .b.t.c.SpringBootTestContextBootstrapper : Using TestExecutionListeners: [org.springframework.test.context.web.ServletTestExecutionListener@306e95ec, org.springframework.test.context.support.DirtiesContextBeforeModesTestExecutionListener@52af26ee, org.springframework.boot.test.autoconfigure.SpringBootDependencyInjectionTestExecutionListener@6fd83fc1, org.springframework.test.context.support.DirtiesContextTestExecutionListener@4f2b503c, org.springframework.test.context.transaction.TransactionalTestExecutionListener@bae7dc0, org.springframework.test.context.jdbc.SqlScriptsTestExecutionListener@209da20d, org.springframework.boot.test.autoconfigure.web.servlet.MockMvcPrintOnlyOnFailureTestExecutionListener@e15b7e8, org.springframework.boot.test.autoconfigure.web.client.MockRestServiceServerResetTestExecutionListener@1b2abca6, org.springframework.boot.test.mock.mockito.ResetMocksTestExecutionListener@6392827e, org.springframework.boot.test.autoconfigure.web.servlet.WebDriverTestExecutionListener@2ed2d9cb, org.springframework.boot.test.autoconfigure.restdocs.RestDocsTestExecutionListener@d5b810e, org.springframework.boot.test.mock.mockito.MockitoTestExecutionListener@43dac38f]
04-Mar-2019 13:53:50 2019-03-04 13:53:50.979  INFO   --- [           main] .b.t.c.SpringBootTestContextBootstrapper : Neither @ContextConfiguration nor @ContextHierarchy found for test class [org.springframework.cloud.dataflow.acceptance.test.NamedChannelTests], using SpringBootContextLoader
04-Mar-2019 13:53:50 2019-03-04 13:53:50.987  INFO   --- [           main] .b.t.c.SpringBootTestContextBootstrapper : Loaded default TestExecutionListener class names from location [META-INF/spring.factories]: [org.springframework.boot.test.mock.mockito.MockitoTestExecutionListener, org.springframework.boot.test.mock.mockito.ResetMocksTestExecutionListener, org.springframework.boot.test.autoconfigure.restdocs.RestDocsTestExecutionListener, org.springframework.boot.test.autoconfigure.web.client.MockRestServiceServerResetTestExecutionListener, org.springframework.boot.test.autoconfigure.web.servlet.MockMvcPrintOnlyOnFailureTestExecutionListener, org.springframework.boot.test.autoconfigure.web.servlet.WebDriverTestExecutionListener, org.springframework.test.context.web.ServletTestExecutionListener, org.springframework.test.context.support.DirtiesContextBeforeModesTestExecutionListener, org.springframework.test.context.support.DependencyInjectionTestExecutionListener, org.springframework.test.context.support.DirtiesContextTestExecutionListener, org.springframework.test.context.transaction.TransactionalTestExecutionListener, org.springframework.test.context.jdbc.SqlScriptsTestExecutionListener]
04-Mar-2019 13:53:50 2019-03-04 13:53:50.990  INFO   --- [           main] .b.t.c.SpringBootTestContextBootstrapper : Using TestExecutionListeners: [org.springframework.test.context.web.ServletTestExecutionListener@31ea9581, org.springframework.test.context.support.DirtiesContextBeforeModesTestExecutionListener@231f98ef, org.springframework.boot.test.autoconfigure.SpringBootDependencyInjectionTestExecutionListener@7c137fd5, org.springframework.test.context.support.DirtiesContextTestExecutionListener@183ec003, org.springframework.test.context.transaction.TransactionalTestExecutionListener@7d9d0818, org.springframework.test.context.jdbc.SqlScriptsTestExecutionListener@221a3fa4, org.springframework.boot.test.autoconfigure.web.servlet.MockMvcPrintOnlyOnFailureTestExecutionListener@451001e5, org.springframework.boot.test.autoconfigure.web.client.MockRestServiceServerResetTestExecutionListener@2b40ff9c, org.springframework.boot.test.mock.mockito.ResetMocksTestExecutionListener@3e08ff24, org.springframework.boot.test.autoconfigure.web.servlet.WebDriverTestExecutionListener@4d1c005e, org.springframework.boot.test.autoconfigure.restdocs.RestDocsTestExecutionListener@8462f31, org.springframework.boot.test.mock.mockito.MockitoTestExecutionListener@24569dba]
04-Mar-2019 13:53:51 Running org.springframework.cloud.dataflow.acceptance.test.AnalyticsTests
04-Mar-2019 13:53:51 2019-03-04 13:53:51.012  INFO   --- [           main] .b.t.c.SpringBootTestContextBootstrapper : Neither @ContextConfiguration nor @ContextHierarchy found for test class [org.springframework.cloud.dataflow.acceptance.test.AnalyticsTests], using SpringBootContextLoader
04-Mar-2019 13:53:51 2019-03-04 13:53:51.019  INFO   --- [           main] .b.t.c.SpringBootTestContextBootstrapper : Loaded default TestExecutionListener class names from location [META-INF/spring.factories]: [org.springframework.boot.test.mock.mockito.MockitoTestExecutionListener, org.springframework.boot.test.mock.mockito.ResetMocksTestExecutionListener, org.springframework.boot.test.autoconfigure.restdocs.RestDocsTestExecutionListener, org.springframework.boot.test.autoconfigure.web.client.MockRestServiceServerResetTestExecutionListener, org.springframework.boot.test.autoconfigure.web.servlet.MockMvcPrintOnlyOnFailureTestExecutionListener, org.springframework.boot.test.autoconfigure.web.servlet.WebDriverTestExecutionListener, org.springframework.test.context.web.ServletTestExecutionListener, org.springframework.test.context.support.DirtiesContextBeforeModesTestExecutionListener, org.springframework.test.context.support.DependencyInjectionTestExecutionListener, org.springframework.test.context.support.DirtiesContextTestExecutionListener, org.springframework.test.context.transaction.TransactionalTestExecutionListener, org.springframework.test.context.jdbc.SqlScriptsTestExecutionListener]
04-Mar-2019 13:53:51 2019-03-04 13:53:51.034  INFO   --- [           main] .b.t.c.SpringBootTestContextBootstrapper : Using TestExecutionListeners: [org.springframework.test.context.web.ServletTestExecutionListener@4b86805d, org.springframework.test.context.support.DirtiesContextBeforeModesTestExecutionListener@5852c06f, org.springframework.boot.test.autoconfigure.SpringBootDependencyInjectionTestExecutionListener@4149c063, org.springframework.test.context.support.DirtiesContextTestExecutionListener@9cb8225, org.springframework.test.context.transaction.TransactionalTestExecutionListener@76b07f29, org.springframework.test.context.jdbc.SqlScriptsTestExecutionListener@38af9828, org.springframework.boot.test.autoconfigure.web.servlet.MockMvcPrintOnlyOnFailureTestExecutionListener@376a0d86, org.springframework.boot.test.autoconfigure.web.client.MockRestServiceServerResetTestExecutionListener@62656be4, org.springframework.boot.test.mock.mockito.ResetMocksTestExecutionListener@17d919b6, org.springframework.boot.test.autoconfigure.web.servlet.WebDriverTestExecutionListener@53f3bdbd, org.springframework.boot.test.autoconfigure.restdocs.RestDocsTestExecutionListener@34129c78, org.springframework.boot.test.mock.mockito.MockitoTestExecutionListener@7d61eb55]
04-Mar-2019 13:53:51 2019-03-04 13:53:51.604  INFO 12337 --- [           main] s.c.a.AnnotationConfigApplicationContext : Refreshing org.springframework.context.annotation.AnnotationConfigApplicationContext@3228d990: startup date [Mon Mar 04 13:53:51 UTC 2019]; root of context hierarchy
04-Mar-2019 13:53:51 2019-03-04 13:53:51.839  INFO 12337 --- [           main] trationDelegate$BeanPostProcessorChecker : Bean 'configurationPropertiesRebinderAutoConfiguration' of type [class org.springframework.cloud.autoconfigure.ConfigurationPropertiesRebinderAutoConfiguration$$EnhancerBySpringCGLIB$$44458212] is not eligible for getting processed by all BeanPostProcessors (for example: not eligible for auto-proxying)
04-Mar-2019 13:53:52
04-Mar-2019 13:53:52   .   ____          _            __ _ _
04-Mar-2019 13:53:52 /\\ / ___'_ __ _ _(_)_ __  __ _ \ \ \ \
04-Mar-2019 13:53:52 ( ( )\___ | '_ | '_| | '_ \/ _` | \ \ \ \
04-Mar-2019 13:53:52 \\/  ___)| |_)| | | | | || (_| |  ) ) ) )
04-Mar-2019 13:53:52   '  |____| .__|_| |_|_| |_\__, | / / / /
04-Mar-2019 13:53:52 =========|_|==============|___/=/_/_/_/
04-Mar-2019 13:53:52 :: Spring Boot ::        (v1.4.1.RELEASE)
04-Mar-2019 13:53:52
04-Mar-2019 13:53:52 2019-03-04 13:53:52.160  INFO 12337 --- [           main] c.c.c.ConfigServicePropertySourceLocator : Fetching config from server at: http://localhost:8888
04-Mar-2019 13:53:52 2019-03-04 13:53:52.243  WARN 12337 --- [           main] c.c.c.ConfigServicePropertySourceLocator : Could not locate PropertySource: I/O error on GET request for "http://localhost:8888//blah": Connection refused (Connection refused); nested exception is java.net.ConnectException: Connection refused (Connection refused)
04-Mar-2019 13:53:52 2019-03-04 13:53:52.251  INFO 12337 --- [           main] o.s.c.d.acceptance.test.AnalyticsTests   : The following profiles are active: blah
04-Mar-2019 13:53:52 2019-03-04 13:53:52.459  INFO 12337 --- [           main] o.s.c.d.acceptance.test.AnalyticsTests   : Started AnalyticsTests in 1.361 seconds (JVM running for 2.03)
04-Mar-2019 13:53:52 2019-03-04 13:53:52.763  INFO 12337 --- [           main] junit.logTestName                        : Starting Test analyticsTest(org.springframework.cloud.dataflow.acceptance.test.AnalyticsTests)
04-Mar-2019 13:53:52 2019-03-04 13:53:52.769  INFO 12337 --- [           main] o.s.c.d.acceptance.test.AnalyticsTests   : Importing stream apps from uri resource: http://repo.spring.io/libs-release/org/springframework/cloud/stream/app/spring-cloud-stream-app-descriptor/Einstein.RELEASE/spring-cloud-stream-app-descriptor-Einstein.RELEASE.stream-apps-kafka-maven
04-Mar-2019 13:53:54 2019-03-04 13:53:54.116  INFO 12337 --- [           main] junit.logTestName                        : Finished Test analyticsTest(org.springframework.cloud.dataflow.acceptance.test.AnalyticsTests)
04-Mar-2019 13:53:54 2019-03-04 13:53:54.116  INFO 12337 --- [           main] o.s.c.d.acceptance.test.AnalyticsTests   : Destroy all streams
04-Mar-2019 13:53:54 Tests run: 1, Failures: 0, Errors: 0, Skipped: 1, Time elapsed: 3.123 sec - in org.springframework.cloud.dataflow.acceptance.test.AnalyticsTests
04-Mar-2019 13:53:54 Running org.springframework.cloud.dataflow.acceptance.test.WoodChuckTests
04-Mar-2019 13:53:54 2019-03-04 13:53:54.136  INFO 12337 --- [           main] .b.t.c.SpringBootTestContextBootstrapper : Neither @ContextConfiguration nor @ContextHierarchy found for test class [org.springframework.cloud.dataflow.acceptance.test.WoodChuckTests], using SpringBootContextLoader
04-Mar-2019 13:53:54 2019-03-04 13:53:54.173  INFO 12337 --- [           main] .b.t.c.SpringBootTestContextBootstrapper : Loaded default TestExecutionListener class names from location [META-INF/spring.factories]: [org.springframework.boot.test.mock.mockito.MockitoTestExecutionListener, org.springframework.boot.test.mock.mockito.ResetMocksTestExecutionListener, org.springframework.boot.test.autoconfigure.restdocs.RestDocsTestExecutionListener, org.springframework.boot.test.autoconfigure.web.client.MockRestServiceServerResetTestExecutionListener, org.springframework.boot.test.autoconfigure.web.servlet.MockMvcPrintOnlyOnFailureTestExecutionListener, org.springframework.boot.test.autoconfigure.web.servlet.WebDriverTestExecutionListener, org.springframework.test.context.web.ServletTestExecutionListener, org.springframework.test.context.support.DirtiesContextBeforeModesTestExecutionListener, org.springframework.test.context.support.DependencyInjectionTestExecutionListener, org.springframework.test.context.support.DirtiesContextTestExecutionListener, org.springframework.test.context.transaction.TransactionalTestExecutionListener, org.springframework.test.context.jdbc.SqlScriptsTestExecutionListener]
04-Mar-2019 13:53:54 2019-03-04 13:53:54.176  INFO 12337 --- [           main] .b.t.c.SpringBootTestContextBootstrapper : Using TestExecutionListeners: [org.springframework.test.context.web.ServletTestExecutionListener@517a2b0, org.springframework.test.context.support.DirtiesContextBeforeModesTestExecutionListener@53b7ce6, org.springframework.boot.test.autoconfigure.SpringBootDependencyInjectionTestExecutionListener@36480b2d, org.springframework.test.context.support.DirtiesContextTestExecutionListener@27d33393, org.springframework.test.context.transaction.TransactionalTestExecutionListener@1f6917fb, org.springframework.test.context.jdbc.SqlScriptsTestExecutionListener@41eb94bc, org.springframework.boot.test.autoconfigure.web.servlet.MockMvcPrintOnlyOnFailureTestExecutionListener@378cfecf, org.springframework.boot.test.autoconfigure.web.client.MockRestServiceServerResetTestExecutionListener@97d0c06, org.springframework.boot.test.mock.mockito.ResetMocksTestExecutionListener@5e7c141d, org.springframework.boot.test.autoconfigure.web.servlet.WebDriverTestExecutionListener@43af351a, org.springframework.boot.test.autoconfigure.restdocs.RestDocsTestExecutionListener@1305c126, org.springframework.boot.test.mock.mockito.MockitoTestExecutionListener@72f9f27c]
04-Mar-2019 13:53:54 2019-03-04 13:53:54.260  INFO 12337 --- [           main] junit.logTestName                        : Starting Test testPartitioning(org.springframework.cloud.dataflow.acceptance.test.WoodChuckTests)
04-Mar-2019 13:53:54 2019-03-04 13:53:54.275  INFO 12337 --- [           main] o.s.c.d.acceptance.test.WoodChuckTests   : Creating stream 'WOODCHUCK-TEST'
04-Mar-2019 13:53:54 2019-03-04 13:53:54.394  INFO 12337 --- [           main] o.s.c.d.acceptance.test.WoodChuckTests   : Deploying stream 'WOODCHUCK-TEST' with properties: {app.*.spring.cloud.streamapp.security.enabled=false, app.log.logging.pattern.level=WOODCHUCK-${INSTANCE_INDEX:${CF_INSTANCE_INDEX:${spring.cloud.stream.instanceIndex:0}}} %5p, app.*.logging.file=${PID}-test.log, app.splitter.producer.partitionKeyExpression=payload, app.*.endpoints.logfile.sensitive=false, app.log.spring.cloud.stream.kafka.bindings.input.consumer.autoRebalanceEnabled=false, app.*.management.endpoints.web.exposure.include=*, deployer.log.count=2}
04-Mar-2019 13:54:03 2019-03-04 13:54:03.554  INFO 12337 --- [           main] o.s.c.d.acceptance.test.WoodChuckTests   : Checking: Stream=WOODCHUCK-TEST, status = deploying, status description = The stream is being deployed.
04-Mar-2019 13:54:03 2019-03-04 13:54:03.554  INFO 12337 --- [           main] o.s.c.d.acceptance.test.WoodChuckTests   : Sleeping to check status of Stream=WOODCHUCK-TEST
04-Mar-2019 13:54:13 2019-03-04 13:54:13.657  INFO 12337 --- [           main] o.s.c.d.acceptance.test.WoodChuckTests   : Checking: Stream=WOODCHUCK-TEST, status = deploying, status description = The stream is being deployed.
04-Mar-2019 13:54:13 2019-03-04 13:54:13.657  INFO 12337 --- [           main] o.s.c.d.acceptance.test.WoodChuckTests   : Sleeping to check status of Stream=WOODCHUCK-TEST
04-Mar-2019 13:54:23 2019-03-04 13:54:23.776  INFO 12337 --- [           main] o.s.c.d.acceptance.test.WoodChuckTests   : Checking: Stream=WOODCHUCK-TEST, status = deploying, status description = The stream is being deployed.
04-Mar-2019 13:54:23 2019-03-04 13:54:23.776  INFO 12337 --- [           main] o.s.c.d.acceptance.test.WoodChuckTests   : Sleeping to check status of Stream=WOODCHUCK-TEST
04-Mar-2019 13:54:33 2019-03-04 13:54:33.841  INFO 12337 --- [           main] o.s.c.d.acceptance.test.WoodChuckTests   : Checking: Stream=WOODCHUCK-TEST, status = deployed, status description = The stream has been successfully deployed
04-Mar-2019 13:54:33 2019-03-04 13:54:33.915  INFO 12337 --- [           main] o.s.c.d.acceptance.test.WoodChuckTests   : Sleeping to check status of Stream=WOODCHUCK-TEST
04-Mar-2019 13:54:43 2019-03-04 13:54:43.915  INFO 12337 --- [           main] o.s.c.d.acceptance.test.WoodChuckTests   : Stream 'WOODCHUCK-TEST' started with status: deployed
04-Mar-2019 13:54:43 2019-03-04 13:54:43.915  INFO 12337 --- [           main] o.s.c.d.acceptance.test.WoodChuckTests   : App 'log' has instances: {WOODCHUCK-TEST.log-v1-0=http://10.194.6.10:45322, WOODCHUCK-TEST.log-v1-1=http://10.194.6.10:50133}
04-Mar-2019 13:54:43 2019-03-04 13:54:43.915  INFO 12337 --- [           main] o.s.c.d.acceptance.test.WoodChuckTests   : App 'http' has instances: {WOODCHUCK-TEST.http-v1-0=http://10.194.6.10:44779}
04-Mar-2019 13:54:43 2019-03-04 13:54:43.915  INFO 12337 --- [           main] o.s.c.d.acceptance.test.WoodChuckTests   : App 'splitter' has instances: {WOODCHUCK-TEST.splitter-v1-0=http://10.194.6.10:50281}
04-Mar-2019 13:54:43 2019-03-04 13:54:43.916  INFO 12337 --- [           main] o.s.c.d.acceptance.test.WoodChuckTests   : Looking for 'Started HttpSource' in logfile for http
04-Mar-2019 13:54:53 2019-03-04 13:54:53.916  INFO 12337 --- [           main] o.s.c.d.acceptance.test.WoodChuckTests   : Requesting log for app WOODCHUCK-TEST.http-v1-0
04-Mar-2019 13:54:54 2019-03-04 13:54:54.074  INFO 12337 --- [           main] o.s.c.d.acceptance.test.WoodChuckTests   : Retrieved logfile from 'http://10.194.6.10:44779/actuator/logfile
04-Mar-2019 13:54:54 2019-03-04 13:54:54.081  INFO 12337 --- [           main] o.s.c.d.acceptance.test.WoodChuckTests   : Matched all 'Started HttpSource' in logfile for app http (source WOODCHUCK-TEST.http-v1-0)
04-Mar-2019 13:54:54 2019-03-04 13:54:54.081  INFO 12337 --- [           main] o.s.c.d.acceptance.test.WoodChuckTests   : Looking for 'Started SplitterProcessor' in logfile for splitter
04-Mar-2019 13:55:04 2019-03-04 13:55:04.081  INFO 12337 --- [           main] o.s.c.d.acceptance.test.WoodChuckTests   : Requesting log for app WOODCHUCK-TEST.splitter-v1-0
04-Mar-2019 13:55:04 2019-03-04 13:55:04.421  INFO 12337 --- [           main] o.s.c.d.acceptance.test.WoodChuckTests   : Retrieved logfile from 'http://10.194.6.10:50281/actuator/logfile
04-Mar-2019 13:55:04 2019-03-04 13:55:04.421  INFO 12337 --- [           main] o.s.c.d.acceptance.test.WoodChuckTests   : Matched all 'Started SplitterProcessor' in logfile for app splitter (source WOODCHUCK-TEST.splitter-v1-0)
04-Mar-2019 13:55:04 2019-03-04 13:55:04.421  INFO 12337 --- [           main] o.s.c.d.acceptance.test.WoodChuckTests   : Looking for 'Started LogSink' in logfile for log
04-Mar-2019 13:55:14 2019-03-04 13:55:14.421  INFO 12337 --- [           main] o.s.c.d.acceptance.test.WoodChuckTests   : Requesting log for app WOODCHUCK-TEST.log-v1-0
04-Mar-2019 13:55:14 2019-03-04 13:55:14.586  INFO 12337 --- [           main] o.s.c.d.acceptance.test.WoodChuckTests   : Retrieved logfile from 'http://10.194.6.10:45322/actuator/logfile
04-Mar-2019 13:55:14 2019-03-04 13:55:14.586  INFO 12337 --- [           main] o.s.c.d.acceptance.test.WoodChuckTests   : Requesting log for app WOODCHUCK-TEST.log-v1-1
04-Mar-2019 13:55:14 2019-03-04 13:55:14.737  INFO 12337 --- [           main] o.s.c.d.acceptance.test.WoodChuckTests   : Retrieved logfile from 'http://10.194.6.10:50133/actuator/logfile
04-Mar-2019 13:55:14 2019-03-04 13:55:14.737  INFO 12337 --- [           main] o.s.c.d.acceptance.test.WoodChuckTests   : Matched all 'Started LogSink' in logfile for app log (source WOODCHUCK-TEST.log-v1-0)
04-Mar-2019 13:55:14 2019-03-04 13:55:14.895  INFO 12337 --- [           main] o.s.c.d.acceptance.test.WoodChuckTests   : Looking for 'WOODCHUCK-0,How,chuck' in logfile for log
04-Mar-2019 13:55:24 2019-03-04 13:55:24.895  INFO 12337 --- [           main] o.s.c.d.acceptance.test.WoodChuckTests   : Requesting log for app WOODCHUCK-TEST.log-v1-0
04-Mar-2019 13:55:24 2019-03-04 13:55:24.904  INFO 12337 --- [           main] o.s.c.d.acceptance.test.WoodChuckTests   : Retrieved logfile from 'http://10.194.6.10:45322/actuator/logfile
04-Mar-2019 13:55:24 2019-03-04 13:55:24.904  INFO 12337 --- [           main] o.s.c.d.acceptance.test.WoodChuckTests   : Requesting log for app WOODCHUCK-TEST.log-v1-1
04-Mar-2019 13:55:24 2019-03-04 13:55:24.918  INFO 12337 --- [           main] o.s.c.d.acceptance.test.WoodChuckTests   : Retrieved logfile from 'http://10.194.6.10:50133/actuator/logfile
04-Mar-2019 13:55:24 2019-03-04 13:55:24.918  INFO 12337 --- [           main] o.s.c.d.acceptance.test.WoodChuckTests   : Matched all 'WOODCHUCK-0,How,chuck' in logfile for app log (source WOODCHUCK-TEST.log-v1-0)
04-Mar-2019 13:55:24 2019-03-04 13:55:24.918  INFO 12337 --- [           main] o.s.c.d.acceptance.test.WoodChuckTests   : Looking for 'WOODCHUCK-1,much,wood,would,if,a,woodchuck,could' in logfile for log
04-Mar-2019 13:55:34 2019-03-04 13:55:34.918  INFO 12337 --- [           main] o.s.c.d.acceptance.test.WoodChuckTests   : Requesting log for app WOODCHUCK-TEST.log-v1-0
04-Mar-2019 13:55:34 2019-03-04 13:55:34.930  INFO 12337 --- [           main] o.s.c.d.acceptance.test.WoodChuckTests   : Retrieved logfile from 'http://10.194.6.10:45322/actuator/logfile
04-Mar-2019 13:55:34 2019-03-04 13:55:34.930  INFO 12337 --- [           main] o.s.c.d.acceptance.test.WoodChuckTests   : Requesting log for app WOODCHUCK-TEST.log-v1-1
04-Mar-2019 13:55:34 2019-03-04 13:55:34.938  INFO 12337 --- [           main] o.s.c.d.acceptance.test.WoodChuckTests   : Retrieved logfile from 'http://10.194.6.10:50133/actuator/logfile
04-Mar-2019 13:55:34 2019-03-04 13:55:34.938  INFO 12337 --- [           main] o.s.c.d.acceptance.test.WoodChuckTests   : Matched all 'WOODCHUCK-1,much,wood,would,if,a,woodchuck,could' in logfile for app log (source WOODCHUCK-TEST.log-v1-1)
04-Mar-2019 13:55:34 2019-03-04 13:55:34.941  INFO 12337 --- [           main] junit.logTestName                        : Test testPartitioning(org.springframework.cloud.dataflow.acceptance.test.WoodChuckTests) Succeeded
04-Mar-2019 13:55:34 2019-03-04 13:55:34.941  INFO 12337 --- [           main] junit.logTestName                        : Finished Test testPartitioning(org.springframework.cloud.dataflow.acceptance.test.WoodChuckTests)
04-Mar-2019 13:55:34 2019-03-04 13:55:34.941  INFO 12337 --- [           main] o.s.c.d.acceptance.test.WoodChuckTests   : Destroy all streams
04-Mar-2019 13:55:35 Tests run: 1, Failures: 0, Errors: 0, Skipped: 0, Time elapsed: 101.348 sec - in org.springframework.cloud.dataflow.acceptance.test.WoodChuckTests
04-Mar-2019 13:55:35 Running org.springframework.cloud.dataflow.acceptance.test.HttpSourceTests
04-Mar-2019 13:55:35 2019-03-04 13:55:35.518  INFO 12337 --- [           main] .b.t.c.SpringBootTestContextBootstrapper : Neither @ContextConfiguration nor @ContextHierarchy found for test class [org.springframework.cloud.dataflow.acceptance.test.HttpSourceTests], using SpringBootContextLoader
04-Mar-2019 13:55:35 2019-03-04 13:55:35.533  INFO 12337 --- [           main] .b.t.c.SpringBootTestContextBootstrapper : Loaded default TestExecutionListener class names from location [META-INF/spring.factories]: [org.springframework.boot.test.mock.mockito.MockitoTestExecutionListener, org.springframework.boot.test.mock.mockito.ResetMocksTestExecutionListener, org.springframework.boot.test.autoconfigure.restdocs.RestDocsTestExecutionListener, org.springframework.boot.test.autoconfigure.web.client.MockRestServiceServerResetTestExecutionListener, org.springframework.boot.test.autoconfigure.web.servlet.MockMvcPrintOnlyOnFailureTestExecutionListener, org.springframework.boot.test.autoconfigure.web.servlet.WebDriverTestExecutionListener, org.springframework.test.context.web.ServletTestExecutionListener, org.springframework.test.context.support.DirtiesContextBeforeModesTestExecutionListener, org.springframework.test.context.support.DependencyInjectionTestExecutionListener, org.springframework.test.context.support.DirtiesContextTestExecutionListener, org.springframework.test.context.transaction.TransactionalTestExecutionListener, org.springframework.test.context.jdbc.SqlScriptsTestExecutionListener]
04-Mar-2019 13:55:35 2019-03-04 13:55:35.537  INFO 12337 --- [           main] .b.t.c.SpringBootTestContextBootstrapper : Using TestExecutionListeners: [org.springframework.test.context.web.ServletTestExecutionListener@56cfe111, org.springframework.test.context.support.DirtiesContextBeforeModesTestExecutionListener@7e446d92, org.springframework.boot.test.autoconfigure.SpringBootDependencyInjectionTestExecutionListener@57f9b467, org.springframework.test.context.support.DirtiesContextTestExecutionListener@6d5c2745, org.springframework.test.context.transaction.TransactionalTestExecutionListener@44b29496, org.springframework.test.context.jdbc.SqlScriptsTestExecutionListener@1947596f, org.springframework.boot.test.autoconfigure.web.servlet.MockMvcPrintOnlyOnFailureTestExecutionListener@3078cac, org.springframework.boot.test.autoconfigure.web.client.MockRestServiceServerResetTestExecutionListener@f6de586, org.springframework.boot.test.mock.mockito.ResetMocksTestExecutionListener@5f2bd6d9, org.springframework.boot.test.autoconfigure.web.servlet.WebDriverTestExecutionListener@7c847072, org.springframework.boot.test.autoconfigure.restdocs.RestDocsTestExecutionListener@43d9f1a2, org.springframework.boot.test.mock.mockito.MockitoTestExecutionListener@23f86d8a]
04-Mar-2019 13:55:35 2019-03-04 13:55:35.635  INFO 12337 --- [           main] junit.logTestName                        : Starting Test httpSourceTests(org.springframework.cloud.dataflow.acceptance.test.HttpSourceTests)
04-Mar-2019 13:55:35 2019-03-04 13:55:35.640  INFO 12337 --- [           main] o.s.c.d.acceptance.test.HttpSourceTests  : Creating stream 'HTTP-TEST'
04-Mar-2019 13:55:35 2019-03-04 13:55:35.667  INFO 12337 --- [           main] o.s.c.d.acceptance.test.HttpSourceTests  : Deploying stream 'HTTP-TEST' with properties: {app.*.spring.cloud.streamapp.security.enabled=false, app.*.logging.file=${PID}-test.log, app.*.endpoints.logfile.sensitive=false, app.*.management.endpoints.web.exposure.include=*}
04-Mar-2019 13:55:36 2019-03-04 13:55:36.233  INFO 12337 --- [           main] o.s.c.d.acceptance.test.HttpSourceTests  : Checking: Stream=HTTP-TEST, status = deploying, status description = The stream is being deployed.
04-Mar-2019 13:55:36 2019-03-04 13:55:36.233  INFO 12337 --- [           main] o.s.c.d.acceptance.test.HttpSourceTests  : Sleeping to check status of Stream=HTTP-TEST
04-Mar-2019 13:55:46 2019-03-04 13:55:46.298  INFO 12337 --- [           main] o.s.c.d.acceptance.test.HttpSourceTests  : Checking: Stream=HTTP-TEST, status = deploying, status description = The stream is being deployed.
04-Mar-2019 13:55:46 2019-03-04 13:55:46.298  INFO 12337 --- [           main] o.s.c.d.acceptance.test.HttpSourceTests  : Sleeping to check status of Stream=HTTP-TEST
04-Mar-2019 13:55:56 2019-03-04 13:55:56.353  INFO 12337 --- [           main] o.s.c.d.acceptance.test.HttpSourceTests  : Checking: Stream=HTTP-TEST, status = deployed, status description = The stream has been successfully deployed
04-Mar-2019 13:55:56 2019-03-04 13:55:56.398  INFO 12337 --- [           main] o.s.c.d.acceptance.test.HttpSourceTests  : Sleeping to check status of Stream=HTTP-TEST
04-Mar-2019 13:56:06 2019-03-04 13:56:06.398  INFO 12337 --- [           main] o.s.c.d.acceptance.test.HttpSourceTests  : Stream 'HTTP-TEST' started with status: deployed
04-Mar-2019 13:56:06 2019-03-04 13:56:06.398  INFO 12337 --- [           main] o.s.c.d.acceptance.test.HttpSourceTests  : App 'log' has instances: {HTTP-TEST.log-v1-0=http://10.194.6.10:45110}
04-Mar-2019 13:56:06 2019-03-04 13:56:06.398  INFO 12337 --- [           main] o.s.c.d.acceptance.test.HttpSourceTests  : App 'http' has instances: {HTTP-TEST.http-v1-0=http://10.194.6.10:60737}
04-Mar-2019 13:56:06 2019-03-04 13:56:06.404  INFO 12337 --- [           main] o.s.c.d.acceptance.test.HttpSourceTests  : Looking for 'Started HttpSource' in logfile for http
04-Mar-2019 13:56:16 2019-03-04 13:56:16.404  INFO 12337 --- [           main] o.s.c.d.acceptance.test.HttpSourceTests  : Requesting log for app HTTP-TEST.http-v1-0
04-Mar-2019 13:56:16 2019-03-04 13:56:16.540  INFO 12337 --- [           main] o.s.c.d.acceptance.test.HttpSourceTests  : Retrieved logfile from 'http://10.194.6.10:60737/actuator/logfile
04-Mar-2019 13:56:16 2019-03-04 13:56:16.540  INFO 12337 --- [           main] o.s.c.d.acceptance.test.HttpSourceTests  : Matched all 'Started HttpSource' in logfile for app http (source HTTP-TEST.http-v1-0)
04-Mar-2019 13:56:16 2019-03-04 13:56:16.540  INFO 12337 --- [           main] o.s.c.d.acceptance.test.HttpSourceTests  : Looking for 'Started LogSink' in logfile for log
04-Mar-2019 13:56:26 2019-03-04 13:56:26.541  INFO 12337 --- [           main] o.s.c.d.acceptance.test.HttpSourceTests  : Requesting log for app HTTP-TEST.log-v1-0
04-Mar-2019 13:56:26 2019-03-04 13:56:26.707  INFO 12337 --- [           main] o.s.c.d.acceptance.test.HttpSourceTests  : Retrieved logfile from 'http://10.194.6.10:45110/actuator/logfile
04-Mar-2019 13:56:26 2019-03-04 13:56:26.707  INFO 12337 --- [           main] o.s.c.d.acceptance.test.HttpSourceTests  : Matched all 'Started LogSink' in logfile for app log (source HTTP-TEST.log-v1-0)
04-Mar-2019 13:56:26 2019-03-04 13:56:26.858  INFO 12337 --- [           main] o.s.c.d.acceptance.test.HttpSourceTests  : Looking for 'e37d163d-1079-473d-92a8-cda9ba373504' in logfile for log
04-Mar-2019 13:56:36 2019-03-04 13:56:36.858  INFO 12337 --- [           main] o.s.c.d.acceptance.test.HttpSourceTests  : Requesting log for app HTTP-TEST.log-v1-0
04-Mar-2019 13:56:36 2019-03-04 13:56:36.868  INFO 12337 --- [           main] o.s.c.d.acceptance.test.HttpSourceTests  : Retrieved logfile from 'http://10.194.6.10:45110/actuator/logfile
04-Mar-2019 13:56:36 2019-03-04 13:56:36.868  INFO 12337 --- [           main] o.s.c.d.acceptance.test.HttpSourceTests  : Matched all 'e37d163d-1079-473d-92a8-cda9ba373504' in logfile for app log (source HTTP-TEST.log-v1-0)
04-Mar-2019 13:56:36 2019-03-04 13:56:36.870  INFO 12337 --- [           main] junit.logTestName                        : Test httpSourceTests(org.springframework.cloud.dataflow.acceptance.test.HttpSourceTests) Succeeded
04-Mar-2019 13:56:36 2019-03-04 13:56:36.870  INFO 12337 --- [           main] junit.logTestName                        : Finished Test httpSourceTests(org.springframework.cloud.dataflow.acceptance.test.HttpSourceTests)
04-Mar-2019 13:56:36 2019-03-04 13:56:36.870  INFO 12337 --- [           main] o.s.c.d.acceptance.test.HttpSourceTests  : Destroy all streams
04-Mar-2019 13:56:37 Tests run: 1, Failures: 0, Errors: 0, Skipped: 0, Time elapsed: 61.765 sec - in org.springframework.cloud.dataflow.acceptance.test.HttpSourceTests
04-Mar-2019 13:56:37 Running org.springframework.cloud.dataflow.acceptance.test.TimestampTaskTests
04-Mar-2019 13:56:37 2019-03-04 13:56:37.293  INFO 12337 --- [           main] o.s.c.support.GenericApplicationContext  : Refreshing org.springframework.context.support.GenericApplicationContext@feb98ef: startup date [Mon Mar 04 13:56:37 UTC 2019]; root of context hierarchy
04-Mar-2019 13:56:37 2019-03-04 13:56:37.441  INFO 12337 --- [           main] junit.logTestName                        : Starting Test timeStampTests(org.springframework.cloud.dataflow.acceptance.test.TimestampTaskTests)
04-Mar-2019 13:56:37 2019-03-04 13:56:37.442  INFO 12337 --- [           main] o.s.c.d.a.test.AbstractTaskTests         : Importing task apps from uri resource: http://repo.spring.io/libs-release/org/springframework/cloud/task/app/spring-cloud-task-app-descriptor/Dearborn.SR1/spring-cloud-task-app-descriptor-Dearborn.SR1.task-apps-maven
04-Mar-2019 13:56:37 2019-03-04 13:56:37.658  INFO 12337 --- [           main] o.s.c.d.a.test.AbstractTaskTests         : Done importing task apps.
04-Mar-2019 13:56:49 2019-03-04 13:56:49.544  INFO 12337 --- [           main] junit.logTestName                        : Test timeStampTests(org.springframework.cloud.dataflow.acceptance.test.TimestampTaskTests) Succeeded
04-Mar-2019 13:56:49 2019-03-04 13:56:49.545  INFO 12337 --- [           main] junit.logTestName                        : Finished Test timeStampTests(org.springframework.cloud.dataflow.acceptance.test.TimestampTaskTests)
04-Mar-2019 13:56:49 2019-03-04 13:56:49.630  INFO 12337 --- [           main] junit.logTestName                        : Starting Test timeStampTestsMultipleLaunch(org.springframework.cloud.dataflow.acceptance.test.TimestampTaskTests)
04-Mar-2019 13:57:10 2019-03-04 13:57:10.047  INFO 12337 --- [           main] junit.logTestName                        : Test timeStampTestsMultipleLaunch(org.springframework.cloud.dataflow.acceptance.test.TimestampTaskTests) Succeeded
04-Mar-2019 13:57:10 2019-03-04 13:57:10.047  INFO 12337 --- [           main] junit.logTestName                        : Finished Test timeStampTestsMultipleLaunch(org.springframework.cloud.dataflow.acceptance.test.TimestampTaskTests)
04-Mar-2019 13:57:10 Tests run: 2, Failures: 0, Errors: 0, Skipped: 0, Time elapsed: 32.763 sec - in org.springframework.cloud.dataflow.acceptance.test.TimestampTaskTests
04-Mar-2019 13:57:10 Running org.springframework.cloud.dataflow.acceptance.test.TickTockTests
04-Mar-2019 13:57:10 2019-03-04 13:57:10.048  INFO 12337 --- [           main] .b.t.c.SpringBootTestContextBootstrapper : Neither @ContextConfiguration nor @ContextHierarchy found for test class [org.springframework.cloud.dataflow.acceptance.test.TickTockTests], using SpringBootContextLoader
04-Mar-2019 13:57:10 2019-03-04 13:57:10.057  INFO 12337 --- [           main] .b.t.c.SpringBootTestContextBootstrapper : Loaded default TestExecutionListener class names from location [META-INF/spring.factories]: [org.springframework.boot.test.mock.mockito.MockitoTestExecutionListener, org.springframework.boot.test.mock.mockito.ResetMocksTestExecutionListener, org.springframework.boot.test.autoconfigure.restdocs.RestDocsTestExecutionListener, org.springframework.boot.test.autoconfigure.web.client.MockRestServiceServerResetTestExecutionListener, org.springframework.boot.test.autoconfigure.web.servlet.MockMvcPrintOnlyOnFailureTestExecutionListener, org.springframework.boot.test.autoconfigure.web.servlet.WebDriverTestExecutionListener, org.springframework.test.context.web.ServletTestExecutionListener, org.springframework.test.context.support.DirtiesContextBeforeModesTestExecutionListener, org.springframework.test.context.support.DependencyInjectionTestExecutionListener, org.springframework.test.context.support.DirtiesContextTestExecutionListener, org.springframework.test.context.transaction.TransactionalTestExecutionListener, org.springframework.test.context.jdbc.SqlScriptsTestExecutionListener]
04-Mar-2019 13:57:10 2019-03-04 13:57:10.060  INFO 12337 --- [           main] .b.t.c.SpringBootTestContextBootstrapper : Using TestExecutionListeners: [org.springframework.test.context.web.ServletTestExecutionListener@7b6c6e70, org.springframework.test.context.support.DirtiesContextBeforeModesTestExecutionListener@f324455, org.springframework.boot.test.autoconfigure.SpringBootDependencyInjectionTestExecutionListener@3a894088, org.springframework.test.context.support.DirtiesContextTestExecutionListener@370c1968, org.springframework.test.context.transaction.TransactionalTestExecutionListener@2f0bfe17, org.springframework.test.context.jdbc.SqlScriptsTestExecutionListener@3206174f, org.springframework.boot.test.autoconfigure.web.servlet.MockMvcPrintOnlyOnFailureTestExecutionListener@42fb8c87, org.springframework.boot.test.autoconfigure.web.client.MockRestServiceServerResetTestExecutionListener@15eb0ae9, org.springframework.boot.test.mock.mockito.ResetMocksTestExecutionListener@65e0b505, org.springframework.boot.test.autoconfigure.web.servlet.WebDriverTestExecutionListener@67de7a99, org.springframework.boot.test.autoconfigure.restdocs.RestDocsTestExecutionListener@795f5d51, org.springframework.boot.test.mock.mockito.MockitoTestExecutionListener@34aeacd1]
04-Mar-2019 13:57:10 2019-03-04 13:57:10.152  INFO 12337 --- [           main] junit.logTestName                        : Starting Test tickTockUpdateRollbackTests(org.springframework.cloud.dataflow.acceptance.test.TickTockTests)
04-Mar-2019 13:57:10 2019-03-04 13:57:10.182  INFO 12337 --- [           main] o.s.c.d.acceptance.test.TickTockTests    : Creating stream 'TICKTOCK'
04-Mar-2019 13:57:10 2019-03-04 13:57:10.206  INFO 12337 --- [           main] o.s.c.d.acceptance.test.TickTockTests    : Deploying stream 'TICKTOCK' with properties: {app.*.spring.cloud.streamapp.security.enabled=false, app.*.logging.file=${PID}-test.log, app.*.endpoints.logfile.sensitive=false, app.log.log.expression='TICKTOCK - TIMESTAMP: '.concat(payload), app.*.management.endpoints.web.exposure.include=*}
04-Mar-2019 13:57:13 2019-03-04 13:57:13.166  INFO 12337 --- [           main] o.s.c.d.acceptance.test.TickTockTests    : Checking: Stream=TICKTOCK, status = deploying, status description = The stream is being deployed.
04-Mar-2019 13:57:13 2019-03-04 13:57:13.166  INFO 12337 --- [           main] o.s.c.d.acceptance.test.TickTockTests    : Sleeping to check status of Stream=TICKTOCK
04-Mar-2019 13:57:23 2019-03-04 13:57:23.223  INFO 12337 --- [           main] o.s.c.d.acceptance.test.TickTockTests    : Checking: Stream=TICKTOCK, status = deploying, status description = The stream is being deployed.
04-Mar-2019 13:57:23 2019-03-04 13:57:23.224  INFO 12337 --- [           main] o.s.c.d.acceptance.test.TickTockTests    : Sleeping to check status of Stream=TICKTOCK
04-Mar-2019 13:57:33 2019-03-04 13:57:33.268  INFO 12337 --- [           main] o.s.c.d.acceptance.test.TickTockTests    : Checking: Stream=TICKTOCK, status = deployed, status description = The stream has been successfully deployed
04-Mar-2019 13:57:33 2019-03-04 13:57:33.317  INFO 12337 --- [           main] o.s.c.d.acceptance.test.TickTockTests    : Sleeping to check status of Stream=TICKTOCK
04-Mar-2019 13:57:43 2019-03-04 13:57:43.317  INFO 12337 --- [           main] o.s.c.d.acceptance.test.TickTockTests    : Stream 'TICKTOCK' started with status: deployed
04-Mar-2019 13:57:43 2019-03-04 13:57:43.317  INFO 12337 --- [           main] o.s.c.d.acceptance.test.TickTockTests    : App 'log' has instances: {TICKTOCK.log-v1-0=http://10.194.6.10:53193}
04-Mar-2019 13:57:43 2019-03-04 13:57:43.317  INFO 12337 --- [           main] o.s.c.d.acceptance.test.TickTockTests    : App 'time' has instances: {TICKTOCK.time-v1-0=http://10.194.6.10:31289}
04-Mar-2019 13:57:43 2019-03-04 13:57:43.317  INFO 12337 --- [           main] o.s.c.d.acceptance.test.TickTockTests    : Looking for 'Started TimeSource' in logfile for time
04-Mar-2019 13:57:53 2019-03-04 13:57:53.317  INFO 12337 --- [           main] o.s.c.d.acceptance.test.TickTockTests    : Requesting log for app TICKTOCK.time-v1-0
04-Mar-2019 13:57:53 2019-03-04 13:57:53.454  INFO 12337 --- [           main] o.s.c.d.acceptance.test.TickTockTests    : Retrieved logfile from 'http://10.194.6.10:31289/actuator/logfile
04-Mar-2019 13:57:53 2019-03-04 13:57:53.454  INFO 12337 --- [           main] o.s.c.d.acceptance.test.TickTockTests    : Matched all 'Started TimeSource' in logfile for app time (source TICKTOCK.time-v1-0)
04-Mar-2019 13:57:53 2019-03-04 13:57:53.454  INFO 12337 --- [           main] o.s.c.d.acceptance.test.TickTockTests    : Looking for 'Started LogSink' in logfile for log
04-Mar-2019 13:58:03 2019-03-04 13:58:03.454  INFO 12337 --- [           main] o.s.c.d.acceptance.test.TickTockTests    : Requesting log for app TICKTOCK.log-v1-0
04-Mar-2019 13:58:03 2019-03-04 13:58:03.596  INFO 12337 --- [           main] o.s.c.d.acceptance.test.TickTockTests    : Retrieved logfile from 'http://10.194.6.10:53193/actuator/logfile
04-Mar-2019 13:58:03 2019-03-04 13:58:03.596  INFO 12337 --- [           main] o.s.c.d.acceptance.test.TickTockTests    : Matched all 'Started LogSink' in logfile for app log (source TICKTOCK.log-v1-0)
04-Mar-2019 13:58:03 2019-03-04 13:58:03.596  INFO 12337 --- [           main] o.s.c.d.acceptance.test.TickTockTests    : Looking for 'TICKTOCK - TIMESTAMP:' in logfile for log
04-Mar-2019 13:58:13 2019-03-04 13:58:13.596  INFO 12337 --- [           main] o.s.c.d.acceptance.test.TickTockTests    : Requesting log for app TICKTOCK.log-v1-0
04-Mar-2019 13:58:13 2019-03-04 13:58:13.604  INFO 12337 --- [           main] o.s.c.d.acceptance.test.TickTockTests    : Retrieved logfile from 'http://10.194.6.10:53193/actuator/logfile
04-Mar-2019 13:58:13 2019-03-04 13:58:13.604  INFO 12337 --- [           main] o.s.c.d.acceptance.test.TickTockTests    : Matched all 'TICKTOCK - TIMESTAMP:' in logfile for app log (source TICKTOCK.log-v1-0)
04-Mar-2019 13:58:13 2019-03-04 13:58:13.606  INFO 12337 --- [           main] o.s.c.d.acceptance.test.TickTockTests    : Updating stream 'TICKTOCK'
04-Mar-2019 13:58:14 2019-03-04 13:58:14.282  INFO 12337 --- [           main] o.s.c.d.acceptance.test.TickTockTests    : Checking: Stream=TICKTOCK, status = deploying, status description = The stream is being deployed.
04-Mar-2019 13:58:14 2019-03-04 13:58:14.282  INFO 12337 --- [           main] o.s.c.d.acceptance.test.TickTockTests    : Sleeping to check status of Stream=TICKTOCK
04-Mar-2019 13:58:24 2019-03-04 13:58:24.328  INFO 12337 --- [           main] o.s.c.d.acceptance.test.TickTockTests    : Checking: Stream=TICKTOCK, status = deployed, status description = The stream has been successfully deployed
04-Mar-2019 13:58:24 2019-03-04 13:58:24.362  INFO 12337 --- [           main] o.s.c.d.acceptance.test.TickTockTests    : Sleeping to check status of Stream=TICKTOCK
04-Mar-2019 13:58:34 2019-03-04 13:58:34.362  INFO 12337 --- [           main] o.s.c.d.acceptance.test.TickTockTests    : Stream 'TICKTOCK' started with status: deployed
04-Mar-2019 13:58:34 2019-03-04 13:58:34.363  INFO 12337 --- [           main] o.s.c.d.acceptance.test.TickTockTests    : App 'log' has instances: {TICKTOCK.log-v1-0=http://10.194.6.10:53193, TICKTOCK.log-v2-0=http://10.194.6.10:20257}
04-Mar-2019 13:58:34 2019-03-04 13:58:34.363  INFO 12337 --- [           main] o.s.c.d.acceptance.test.TickTockTests    : App 'time' has instances: {TICKTOCK.time-v1-0=http://10.194.6.10:31289}
04-Mar-2019 13:58:34 2019-03-04 13:58:34.363  INFO 12337 --- [           main] o.s.c.d.acceptance.test.TickTockTests    : Looking for 'Started LogSink' in logfile for log
04-Mar-2019 13:58:44 2019-03-04 13:58:44.363  INFO 12337 --- [           main] o.s.c.d.acceptance.test.TickTockTests    : Requesting log for app TICKTOCK.log-v1-0
04-Mar-2019 13:58:44 2019-03-04 13:58:44.364  WARN 12337 --- [           main] o.s.c.d.acceptance.test.TickTockTests    : Error while trying to access logfile from 'http://10.194.6.10:53193/logfile' due to : org.springframework.web.client.ResourceAccessException: I/O error on GET request for "http://10.194.6.10:53193/logfile": Connection refused (Connection refused); nested exception is java.net.ConnectException: Connection refused (Connection refused)
04-Mar-2019 13:58:44 2019-03-04 13:58:44.365  INFO 12337 --- [           main] o.s.c.d.acceptance.test.TickTockTests    : Requesting log for app TICKTOCK.log-v2-0
04-Mar-2019 13:58:44 2019-03-04 13:58:44.505  INFO 12337 --- [           main] o.s.c.d.acceptance.test.TickTockTests    : Retrieved logfile from 'http://10.194.6.10:20257/actuator/logfile
04-Mar-2019 13:58:44 2019-03-04 13:58:44.505  INFO 12337 --- [           main] o.s.c.d.acceptance.test.TickTockTests    : Matched all 'Started LogSink' in logfile for app log (source TICKTOCK.log-v2-0)
04-Mar-2019 13:58:44 2019-03-04 13:58:44.505  INFO 12337 --- [           main] o.s.c.d.acceptance.test.TickTockTests    : Looking for 'TICKTOCK Updated - TIMESTAMP:' in logfile for log
04-Mar-2019 13:58:54 2019-03-04 13:58:54.505  INFO 12337 --- [           main] o.s.c.d.acceptance.test.TickTockTests    : Requesting log for app TICKTOCK.log-v1-0
04-Mar-2019 13:58:54 2019-03-04 13:58:54.507  WARN 12337 --- [           main] o.s.c.d.acceptance.test.TickTockTests    : Error while trying to access logfile from 'http://10.194.6.10:53193/logfile' due to : org.springframework.web.client.ResourceAccessException: I/O error on GET request for "http://10.194.6.10:53193/logfile": Connection refused (Connection refused); nested exception is java.net.ConnectException: Connection refused (Connection refused)
04-Mar-2019 13:58:54 2019-03-04 13:58:54.507  INFO 12337 --- [           main] o.s.c.d.acceptance.test.TickTockTests    : Requesting log for app TICKTOCK.log-v2-0
04-Mar-2019 13:58:54 2019-03-04 13:58:54.516  INFO 12337 --- [           main] o.s.c.d.acceptance.test.TickTockTests    : Retrieved logfile from 'http://10.194.6.10:20257/actuator/logfile
04-Mar-2019 13:58:54 2019-03-04 13:58:54.516  INFO 12337 --- [           main] o.s.c.d.acceptance.test.TickTockTests    : Matched all 'TICKTOCK Updated - TIMESTAMP:' in logfile for app log (source TICKTOCK.log-v2-0)
04-Mar-2019 13:58:54 2019-03-04 13:58:54.516  INFO 12337 --- [           main] o.s.c.d.acceptance.test.TickTockTests    : Rolling back the stream 'TICKTOCK' to the version 0
04-Mar-2019 13:58:54 2019-03-04 13:58:54.855  INFO 12337 --- [           main] o.s.c.d.acceptance.test.TickTockTests    : Checking: Stream=TICKTOCK, status = deploying, status description = The stream is being deployed.
04-Mar-2019 13:58:54 2019-03-04 13:58:54.855  INFO 12337 --- [           main] o.s.c.d.acceptance.test.TickTockTests    : Sleeping to check status of Stream=TICKTOCK
04-Mar-2019 13:59:04 2019-03-04 13:59:04.898  INFO 12337 --- [           main] o.s.c.d.acceptance.test.TickTockTests    : Checking: Stream=TICKTOCK, status = deployed, status description = The stream has been successfully deployed
04-Mar-2019 13:59:04 2019-03-04 13:59:04.932  INFO 12337 --- [           main] o.s.c.d.acceptance.test.TickTockTests    : Sleeping to check status of Stream=TICKTOCK
04-Mar-2019 13:59:14 2019-03-04 13:59:14.932  INFO 12337 --- [           main] o.s.c.d.acceptance.test.TickTockTests    : Stream 'TICKTOCK' started with status: deployed
04-Mar-2019 13:59:14 2019-03-04 13:59:14.932  INFO 12337 --- [           main] o.s.c.d.acceptance.test.TickTockTests    : App 'log' has instances: {TICKTOCK.log-v1-0=http://10.194.6.10:53193, TICKTOCK.log-v3-0=http://10.194.6.10:51719, TICKTOCK.log-v2-0=http://10.194.6.10:20257}
04-Mar-2019 13:59:14 2019-03-04 13:59:14.932  INFO 12337 --- [           main] o.s.c.d.acceptance.test.TickTockTests    : App 'time' has instances: {TICKTOCK.time-v1-0=http://10.194.6.10:31289}
04-Mar-2019 13:59:14 2019-03-04 13:59:14.932  INFO 12337 --- [           main] o.s.c.d.acceptance.test.TickTockTests    : Looking for 'TICKTOCK - TIMESTAMP:' in logfile for log
04-Mar-2019 13:59:24 2019-03-04 13:59:24.933  INFO 12337 --- [           main] o.s.c.d.acceptance.test.TickTockTests    : Requesting log for app TICKTOCK.log-v1-0
04-Mar-2019 13:59:24 2019-03-04 13:59:24.934  WARN 12337 --- [           main] o.s.c.d.acceptance.test.TickTockTests    : Error while trying to access logfile from 'http://10.194.6.10:53193/logfile' due to : org.springframework.web.client.ResourceAccessException: I/O error on GET request for "http://10.194.6.10:53193/logfile": Connection refused (Connection refused); nested exception is java.net.ConnectException: Connection refused (Connection refused)
04-Mar-2019 13:59:24 2019-03-04 13:59:24.934  INFO 12337 --- [           main] o.s.c.d.acceptance.test.TickTockTests    : Requesting log for app TICKTOCK.log-v3-0
04-Mar-2019 13:59:25 2019-03-04 13:59:25.072  INFO 12337 --- [           main] o.s.c.d.acceptance.test.TickTockTests    : Retrieved logfile from 'http://10.194.6.10:51719/actuator/logfile
04-Mar-2019 13:59:25 2019-03-04 13:59:25.073  INFO 12337 --- [           main] o.s.c.d.acceptance.test.TickTockTests    : Requesting log for app TICKTOCK.log-v2-0
04-Mar-2019 13:59:25 2019-03-04 13:59:25.074  WARN 12337 --- [           main] o.s.c.d.acceptance.test.TickTockTests    : Error while trying to access logfile from 'http://10.194.6.10:20257/logfile' due to : org.springframework.web.client.ResourceAccessException: I/O error on GET request for "http://10.194.6.10:20257/logfile": Connection refused (Connection refused); nested exception is java.net.ConnectException: Connection refused (Connection refused)
04-Mar-2019 13:59:25 2019-03-04 13:59:25.074  INFO 12337 --- [           main] o.s.c.d.acceptance.test.TickTockTests    : Matched all 'TICKTOCK - TIMESTAMP:' in logfile for app log (source TICKTOCK.log-v3-0)
04-Mar-2019 13:59:25 2019-03-04 13:59:25.076  INFO 12337 --- [           main] junit.logTestName                        : Test tickTockUpdateRollbackTests(org.springframework.cloud.dataflow.acceptance.test.TickTockTests) Succeeded
04-Mar-2019 13:59:25 2019-03-04 13:59:25.076  INFO 12337 --- [           main] junit.logTestName                        : Finished Test tickTockUpdateRollbackTests(org.springframework.cloud.dataflow.acceptance.test.TickTockTests)
04-Mar-2019 13:59:25 2019-03-04 13:59:25.076  INFO 12337 --- [           main] o.s.c.d.acceptance.test.TickTockTests    : Destroy all streams
04-Mar-2019 13:59:25 2019-03-04 13:59:25.510  INFO 12337 --- [           main] junit.logTestName                        : Starting Test tickTockTests(org.springframework.cloud.dataflow.acceptance.test.TickTockTests)
04-Mar-2019 13:59:25 2019-03-04 13:59:25.513  INFO 12337 --- [           main] o.s.c.d.acceptance.test.TickTockTests    : Creating stream 'TICKTOCK'
04-Mar-2019 13:59:25 2019-03-04 13:59:25.557  INFO 12337 --- [           main] o.s.c.d.acceptance.test.TickTockTests    : Deploying stream 'TICKTOCK' with properties: {app.*.spring.cloud.streamapp.security.enabled=false, app.*.logging.file=${PID}-test.log, app.*.endpoints.logfile.sensitive=false, app.log.log.expression='TICKTOCK - TIMESTAMP: '.concat(payload), app.*.management.endpoints.web.exposure.include=*}
04-Mar-2019 13:59:26 2019-03-04 13:59:26.021  INFO 12337 --- [           main] o.s.c.d.acceptance.test.TickTockTests    : Checking: Stream=TICKTOCK, status = deploying, status description = The stream is being deployed.
04-Mar-2019 13:59:26 2019-03-04 13:59:26.021  INFO 12337 --- [           main] o.s.c.d.acceptance.test.TickTockTests    : Sleeping to check status of Stream=TICKTOCK
04-Mar-2019 13:59:36 2019-03-04 13:59:36.076  INFO 12337 --- [           main] o.s.c.d.acceptance.test.TickTockTests    : Checking: Stream=TICKTOCK, status = deploying, status description = The stream is being deployed.
04-Mar-2019 13:59:36 2019-03-04 13:59:36.076  INFO 12337 --- [           main] o.s.c.d.acceptance.test.TickTockTests    : Sleeping to check status of Stream=TICKTOCK
04-Mar-2019 13:59:46 2019-03-04 13:59:46.109  INFO 12337 --- [           main] o.s.c.d.acceptance.test.TickTockTests    : Checking: Stream=TICKTOCK, status = deployed, status description = The stream has been successfully deployed
04-Mar-2019 13:59:46 2019-03-04 13:59:46.148  INFO 12337 --- [           main] o.s.c.d.acceptance.test.TickTockTests    : Sleeping to check status of Stream=TICKTOCK
04-Mar-2019 13:59:56 2019-03-04 13:59:56.148  INFO 12337 --- [           main] o.s.c.d.acceptance.test.TickTockTests    : Stream 'TICKTOCK' started with status: deployed
04-Mar-2019 13:59:56 2019-03-04 13:59:56.148  INFO 12337 --- [           main] o.s.c.d.acceptance.test.TickTockTests    : App 'log' has instances: {TICKTOCK.log-v4-0=http://10.194.6.10:33012}
04-Mar-2019 13:59:56 2019-03-04 13:59:56.148  INFO 12337 --- [           main] o.s.c.d.acceptance.test.TickTockTests    : App 'time' has instances: {TICKTOCK.time-v4-0=http://10.194.6.10:53960}
04-Mar-2019 13:59:56 2019-03-04 13:59:56.148  INFO 12337 --- [           main] o.s.c.d.acceptance.test.TickTockTests    : Looking for 'Started TimeSource' in logfile for time
04-Mar-2019 14:00:06 2019-03-04 14:00:06.148  INFO 12337 --- [           main] o.s.c.d.acceptance.test.TickTockTests    : Requesting log for app TICKTOCK.time-v4-0
04-Mar-2019 14:00:06 2019-03-04 14:00:06.304  INFO 12337 --- [           main] o.s.c.d.acceptance.test.TickTockTests    : Retrieved logfile from 'http://10.194.6.10:53960/actuator/logfile
04-Mar-2019 14:00:06 2019-03-04 14:00:06.304  INFO 12337 --- [           main] o.s.c.d.acceptance.test.TickTockTests    : Matched all 'Started TimeSource' in logfile for app time (source TICKTOCK.time-v4-0)
04-Mar-2019 14:00:06 2019-03-04 14:00:06.304  INFO 12337 --- [           main] o.s.c.d.acceptance.test.TickTockTests    : Looking for 'Started LogSink' in logfile for log
04-Mar-2019 14:00:16 2019-03-04 14:00:16.304  INFO 12337 --- [           main] o.s.c.d.acceptance.test.TickTockTests    : Requesting log for app TICKTOCK.log-v4-0
04-Mar-2019 14:00:16 2019-03-04 14:00:16.473  INFO 12337 --- [           main] o.s.c.d.acceptance.test.TickTockTests    : Retrieved logfile from 'http://10.194.6.10:33012/actuator/logfile
04-Mar-2019 14:00:16 2019-03-04 14:00:16.474  INFO 12337 --- [           main] o.s.c.d.acceptance.test.TickTockTests    : Matched all 'Started LogSink' in logfile for app log (source TICKTOCK.log-v4-0)
04-Mar-2019 14:00:16 2019-03-04 14:00:16.474  INFO 12337 --- [           main] o.s.c.d.acceptance.test.TickTockTests    : Looking for 'TICKTOCK - TIMESTAMP:' in logfile for log
04-Mar-2019 14:00:26 2019-03-04 14:00:26.474  INFO 12337 --- [           main] o.s.c.d.acceptance.test.TickTockTests    : Requesting log for app TICKTOCK.log-v4-0
04-Mar-2019 14:00:26 2019-03-04 14:00:26.482  INFO 12337 --- [           main] o.s.c.d.acceptance.test.TickTockTests    : Retrieved logfile from 'http://10.194.6.10:33012/actuator/logfile
04-Mar-2019 14:00:26 2019-03-04 14:00:26.482  INFO 12337 --- [           main] o.s.c.d.acceptance.test.TickTockTests    : Matched all 'TICKTOCK - TIMESTAMP:' in logfile for app log (source TICKTOCK.log-v4-0)
04-Mar-2019 14:00:26 2019-03-04 14:00:26.483  INFO 12337 --- [           main] junit.logTestName                        : Test tickTockTests(org.springframework.cloud.dataflow.acceptance.test.TickTockTests) Succeeded
04-Mar-2019 14:00:26 2019-03-04 14:00:26.484  INFO 12337 --- [           main] junit.logTestName                        : Finished Test tickTockTests(org.springframework.cloud.dataflow.acceptance.test.TickTockTests)
04-Mar-2019 14:00:26 2019-03-04 14:00:26.484  INFO 12337 --- [           main] o.s.c.d.acceptance.test.TickTockTests    : Destroy all streams
04-Mar-2019 14:00:26 2019-03-04 14:00:26.922  INFO 12337 --- [           main] junit.logTestName                        : Starting Test tickTockTestsFromConfigServer(org.springframework.cloud.dataflow.acceptance.test.TickTockTests)
04-Mar-2019 14:00:26 2019-03-04 14:00:26.925  INFO 12337 --- [           main] junit.logTestName                        : Finished Test tickTockTestsFromConfigServer(org.springframework.cloud.dataflow.acceptance.test.TickTockTests)
04-Mar-2019 14:00:26 2019-03-04 14:00:26.925  INFO 12337 --- [           main] o.s.c.d.acceptance.test.TickTockTests    : Destroy all streams
04-Mar-2019 14:00:26 Tests run: 3, Failures: 0, Errors: 0, Skipped: 1, Time elapsed: 196.881 sec - in org.springframework.cloud.dataflow.acceptance.test.TickTockTests
04-Mar-2019 14:00:26 Running org.springframework.cloud.dataflow.acceptance.test.TransformTests
04-Mar-2019 14:00:26 2019-03-04 14:00:26.933  INFO 12337 --- [           main] .b.t.c.SpringBootTestContextBootstrapper : Neither @ContextConfiguration nor @ContextHierarchy found for test class [org.springframework.cloud.dataflow.acceptance.test.TransformTests], using SpringBootContextLoader
04-Mar-2019 14:00:26 2019-03-04 14:00:26.941  INFO 12337 --- [           main] .b.t.c.SpringBootTestContextBootstrapper : Loaded default TestExecutionListener class names from location [META-INF/spring.factories]: [org.springframework.boot.test.mock.mockito.MockitoTestExecutionListener, org.springframework.boot.test.mock.mockito.ResetMocksTestExecutionListener, org.springframework.boot.test.autoconfigure.restdocs.RestDocsTestExecutionListener, org.springframework.boot.test.autoconfigure.web.client.MockRestServiceServerResetTestExecutionListener, org.springframework.boot.test.autoconfigure.web.servlet.MockMvcPrintOnlyOnFailureTestExecutionListener, org.springframework.boot.test.autoconfigure.web.servlet.WebDriverTestExecutionListener, org.springframework.test.context.web.ServletTestExecutionListener, org.springframework.test.context.support.DirtiesContextBeforeModesTestExecutionListener, org.springframework.test.context.support.DependencyInjectionTestExecutionListener, org.springframework.test.context.support.DirtiesContextTestExecutionListener, org.springframework.test.context.transaction.TransactionalTestExecutionListener, org.springframework.test.context.jdbc.SqlScriptsTestExecutionListener]
04-Mar-2019 14:00:26 2019-03-04 14:00:26.949  INFO 12337 --- [           main] .b.t.c.SpringBootTestContextBootstrapper : Using TestExecutionListeners: [org.springframework.test.context.web.ServletTestExecutionListener@6419a0e1, org.springframework.test.context.support.DirtiesContextBeforeModesTestExecutionListener@280d4882, org.springframework.boot.test.autoconfigure.SpringBootDependencyInjectionTestExecutionListener@44af588b, org.springframework.test.context.support.DirtiesContextTestExecutionListener@3d19d85, org.springframework.test.context.transaction.TransactionalTestExecutionListener@2ae62bb6, org.springframework.test.context.jdbc.SqlScriptsTestExecutionListener@68ed3f30, org.springframework.boot.test.autoconfigure.web.servlet.MockMvcPrintOnlyOnFailureTestExecutionListener@56b859a6, org.springframework.boot.test.autoconfigure.web.client.MockRestServiceServerResetTestExecutionListener@590adb41, org.springframework.boot.test.mock.mockito.ResetMocksTestExecutionListener@42aae04d, org.springframework.boot.test.autoconfigure.web.servlet.WebDriverTestExecutionListener@43bf5397, org.springframework.boot.test.autoconfigure.restdocs.RestDocsTestExecutionListener@575e572f, org.springframework.boot.test.mock.mockito.MockitoTestExecutionListener@58015e56]
04-Mar-2019 14:00:27 2019-03-04 14:00:27.006  INFO 12337 --- [           main] junit.logTestName                        : Starting Test transformTests(org.springframework.cloud.dataflow.acceptance.test.TransformTests)
04-Mar-2019 14:00:27 2019-03-04 14:00:27.008  INFO 12337 --- [           main] o.s.c.d.acceptance.test.TransformTests   : Creating stream 'TRANSFORM-TEST'
04-Mar-2019 14:00:27 2019-03-04 14:00:27.029  INFO 12337 --- [           main] o.s.c.d.acceptance.test.TransformTests   : Deploying stream 'TRANSFORM-TEST' with properties: {app.*.spring.cloud.streamapp.security.enabled=false, app.*.logging.file=${PID}-test.log, app.*.endpoints.logfile.sensitive=false, app.*.management.endpoints.web.exposure.include=*}
04-Mar-2019 14:00:29 2019-03-04 14:00:29.762  INFO 12337 --- [           main] o.s.c.d.acceptance.test.TransformTests   : Checking: Stream=TRANSFORM-TEST, status = deploying, status description = The stream is being deployed.
04-Mar-2019 14:00:29 2019-03-04 14:00:29.762  INFO 12337 --- [           main] o.s.c.d.acceptance.test.TransformTests   : Sleeping to check status of Stream=TRANSFORM-TEST
04-Mar-2019 14:00:39 2019-03-04 14:00:39.813  INFO 12337 --- [           main] o.s.c.d.acceptance.test.TransformTests   : Checking: Stream=TRANSFORM-TEST, status = deploying, status description = The stream is being deployed.
04-Mar-2019 14:00:39 2019-03-04 14:00:39.813  INFO 12337 --- [           main] o.s.c.d.acceptance.test.TransformTests   : Sleeping to check status of Stream=TRANSFORM-TEST
04-Mar-2019 14:00:49 2019-03-04 14:00:49.882  INFO 12337 --- [           main] o.s.c.d.acceptance.test.TransformTests   : Checking: Stream=TRANSFORM-TEST, status = deployed, status description = The stream has been successfully deployed
04-Mar-2019 14:00:49 2019-03-04 14:00:49.914  INFO 12337 --- [           main] o.s.c.d.acceptance.test.TransformTests   : Sleeping to check status of Stream=TRANSFORM-TEST
04-Mar-2019 14:00:59 2019-03-04 14:00:59.915  INFO 12337 --- [           main] o.s.c.d.acceptance.test.TransformTests   : Stream 'TRANSFORM-TEST' started with status: deployed
04-Mar-2019 14:00:59 2019-03-04 14:00:59.916  INFO 12337 --- [           main] o.s.c.d.acceptance.test.TransformTests   : App 'transform' has instances: {TRANSFORM-TEST.transform-v1-0=http://10.194.6.10:22249}
04-Mar-2019 14:00:59 2019-03-04 14:00:59.916  INFO 12337 --- [           main] o.s.c.d.acceptance.test.TransformTests   : App 'log' has instances: {TRANSFORM-TEST.log-v1-0=http://10.194.6.10:37547}
04-Mar-2019 14:00:59 2019-03-04 14:00:59.916  INFO 12337 --- [           main] o.s.c.d.acceptance.test.TransformTests   : App 'http' has instances: {TRANSFORM-TEST.http-v1-0=http://10.194.6.10:43469}
04-Mar-2019 14:00:59 2019-03-04 14:00:59.916  INFO 12337 --- [           main] o.s.c.d.acceptance.test.TransformTests   : Looking for 'Started HttpSource' in logfile for http
04-Mar-2019 14:01:09 2019-03-04 14:01:09.916  INFO 12337 --- [           main] o.s.c.d.acceptance.test.TransformTests   : Requesting log for app TRANSFORM-TEST.http-v1-0
04-Mar-2019 14:01:10 2019-03-04 14:01:10.055  INFO 12337 --- [           main] o.s.c.d.acceptance.test.TransformTests   : Retrieved logfile from 'http://10.194.6.10:43469/actuator/logfile
04-Mar-2019 14:01:10 2019-03-04 14:01:10.055  INFO 12337 --- [           main] o.s.c.d.acceptance.test.TransformTests   : Matched all 'Started HttpSource' in logfile for app http (source TRANSFORM-TEST.http-v1-0)
04-Mar-2019 14:01:10 2019-03-04 14:01:10.160  INFO 12337 --- [           main] o.s.c.d.acceptance.test.TransformTests   : Looking for 'Started LogSink' in logfile for log
04-Mar-2019 14:01:20 2019-03-04 14:01:20.161  INFO 12337 --- [           main] o.s.c.d.acceptance.test.TransformTests   : Requesting log for app TRANSFORM-TEST.log-v1-0
04-Mar-2019 14:01:20 2019-03-04 14:01:20.335  INFO 12337 --- [           main] o.s.c.d.acceptance.test.TransformTests   : Retrieved logfile from 'http://10.194.6.10:37547/actuator/logfile
04-Mar-2019 14:01:20 2019-03-04 14:01:20.335  INFO 12337 --- [           main] o.s.c.d.acceptance.test.TransformTests   : Matched all 'Started LogSink' in logfile for app log (source TRANSFORM-TEST.log-v1-0)
04-Mar-2019 14:01:20 2019-03-04 14:01:20.335  INFO 12337 --- [           main] o.s.c.d.acceptance.test.TransformTests   : Looking for 'ABCDEFG' in logfile for log
04-Mar-2019 14:01:30 2019-03-04 14:01:30.336  INFO 12337 --- [           main] o.s.c.d.acceptance.test.TransformTests   : Requesting log for app TRANSFORM-TEST.log-v1-0
04-Mar-2019 14:01:30 2019-03-04 14:01:30.345  INFO 12337 --- [           main] o.s.c.d.acceptance.test.TransformTests   : Retrieved logfile from 'http://10.194.6.10:37547/actuator/logfile
04-Mar-2019 14:01:30 2019-03-04 14:01:30.345  INFO 12337 --- [           main] o.s.c.d.acceptance.test.TransformTests   : Matched all 'ABCDEFG' in logfile for app log (source TRANSFORM-TEST.log-v1-0)
04-Mar-2019 14:01:30 2019-03-04 14:01:30.346  INFO 12337 --- [           main] junit.logTestName                        : Test transformTests(org.springframework.cloud.dataflow.acceptance.test.TransformTests) Succeeded
04-Mar-2019 14:01:30 2019-03-04 14:01:30.346  INFO 12337 --- [           main] junit.logTestName                        : Finished Test transformTests(org.springframework.cloud.dataflow.acceptance.test.TransformTests)
04-Mar-2019 14:01:30 2019-03-04 14:01:30.346  INFO 12337 --- [           main] o.s.c.d.acceptance.test.TransformTests   : Destroy all streams
04-Mar-2019 14:01:31 Tests run: 1, Failures: 0, Errors: 0, Skipped: 0, Time elapsed: 64.267 sec - in org.springframework.cloud.dataflow.acceptance.test.TransformTests
04-Mar-2019 14:01:31 Running org.springframework.cloud.dataflow.acceptance.test.SchedulerTests
04-Mar-2019 14:01:31 2019-03-04 14:01:31.346  INFO 12337 --- [           main] s.c.a.AnnotationConfigApplicationContext : Refreshing org.springframework.context.annotation.AnnotationConfigApplicationContext@76fe6cdc: startup date [Mon Mar 04 14:01:31 UTC 2019]; root of context hierarchy
04-Mar-2019 14:01:31 2019-03-04 14:01:31.379  INFO 12337 --- [           main] trationDelegate$BeanPostProcessorChecker : Bean 'configurationPropertiesRebinderAutoConfiguration' of type [class org.springframework.cloud.autoconfigure.ConfigurationPropertiesRebinderAutoConfiguration$$EnhancerBySpringCGLIB$$44458212] is not eligible for getting processed by all BeanPostProcessors (for example: not eligible for auto-proxying)
04-Mar-2019 14:01:31
04-Mar-2019 14:01:31   .   ____          _            __ _ _
04-Mar-2019 14:01:31 /\\ / ___'_ __ _ _(_)_ __  __ _ \ \ \ \
04-Mar-2019 14:01:31 ( ( )\___ | '_ | '_| | '_ \/ _` | \ \ \ \
04-Mar-2019 14:01:31 \\/  ___)| |_)| | | | | || (_| |  ) ) ) )
04-Mar-2019 14:01:31   '  |____| .__|_| |_|_| |_\__, | / / / /
04-Mar-2019 14:01:31 =========|_|==============|___/=/_/_/_/
04-Mar-2019 14:01:31 :: Spring Boot ::        (v1.4.1.RELEASE)
04-Mar-2019 14:01:31
04-Mar-2019 14:01:31 2019-03-04 14:01:31.479  INFO 12337 --- [           main] c.c.c.ConfigServicePropertySourceLocator : Fetching config from server at: http://localhost:8888
04-Mar-2019 14:01:31 2019-03-04 14:01:31.481  WARN 12337 --- [           main] c.c.c.ConfigServicePropertySourceLocator : Could not locate PropertySource: I/O error on GET request for "http://localhost:8888//blah": Connection refused (Connection refused); nested exception is java.net.ConnectException: Connection refused (Connection refused)
04-Mar-2019 14:01:31 2019-03-04 14:01:31.482  INFO 12337 --- [           main] o.a.maven.surefire.booter.ForkedBooter   : The following profiles are active: blah
04-Mar-2019 14:01:31 2019-03-04 14:01:31.484  INFO 12337 --- [           main] s.c.a.AnnotationConfigApplicationContext : Refreshing org.springframework.context.annotation.AnnotationConfigApplicationContext@d919544: startup date [Mon Mar 04 14:01:31 UTC 2019]; parent: org.springframework.context.annotation.AnnotationConfigApplicationContext@76fe6cdc
04-Mar-2019 14:01:31 2019-03-04 14:01:31.765  INFO 12337 --- [           main] o.a.maven.surefire.booter.ForkedBooter   : Started ForkedBooter in 0.557 seconds (JVM running for 461.337)
04-Mar-2019 14:01:31 2019-03-04 14:01:31.773  INFO 12337 --- [           main] s.c.a.AnnotationConfigApplicationContext : Closing org.springframework.context.annotation.AnnotationConfigApplicationContext@d919544: startup date [Mon Mar 04 14:01:31 UTC 2019]; parent: org.springframework.context.annotation.AnnotationConfigApplicationContext@76fe6cdc
04-Mar-2019 14:01:31 2019-03-04 14:01:31.778 ERROR 12337 --- [           main] o.s.c.d.a.test.util.SchedulerRule        : SCHEDULER IS NOT AVAILABLE, SKIPPING TESTS
04-Mar-2019 14:01:31
04-Mar-2019 14:01:31 java.lang.IllegalArgumentException: no SchedulerOperations bean is available.  Skipping test.
04-Mar-2019 14:01:31         at org.springframework.util.Assert.notNull(Assert.java:115)
04-Mar-2019 14:01:31         at org.springframework.cloud.dataflow.acceptance.test.util.SchedulerRule.obtainResource(SchedulerRule.java:57)
04-Mar-2019 14:01:31         at org.springframework.cloud.scheduler.spi.junit.AbstractExternalResourceTestSupport.apply(AbstractExternalResourceTestSupport.java:58)
04-Mar-2019 14:01:31         at org.junit.rules.RunRules.applyAll(RunRules.java:26)
04-Mar-2019 14:01:31         at org.junit.rules.RunRules.<init>(RunRules.java:15)
04-Mar-2019 14:01:31         at org.junit.runners.ParentRunner.withClassRules(ParentRunner.java:245)
04-Mar-2019 14:01:31         at org.junit.runners.ParentRunner.classBlock(ParentRunner.java:194)
04-Mar-2019 14:01:31         at org.junit.runners.ParentRunner.run(ParentRunner.java:362)
04-Mar-2019 14:01:31         at org.springframework.test.context.junit4.SpringJUnit4ClassRunner.run(SpringJUnit4ClassRunner.java:191)
04-Mar-2019 14:01:31         at org.apache.maven.surefire.junit4.JUnit4Provider.execute(JUnit4Provider.java:283)
04-Mar-2019 14:01:31         at org.apache.maven.surefire.junit4.JUnit4Provider.executeWithRerun(JUnit4Provider.java:173)
04-Mar-2019 14:01:31         at org.apache.maven.surefire.junit4.JUnit4Provider.executeTestSet(JUnit4Provider.java:153)
04-Mar-2019 14:01:31         at org.apache.maven.surefire.junit4.JUnit4Provider.invoke(JUnit4Provider.java:128)
04-Mar-2019 14:01:31         at org.apache.maven.surefire.booter.ForkedBooter.invokeProviderInSameClassLoader(ForkedBooter.java:203)
04-Mar-2019 14:01:31         at org.apache.maven.surefire.booter.ForkedBooter.runSuitesInProcess(ForkedBooter.java:155)
04-Mar-2019 14:01:31         at org.apache.maven.surefire.booter.ForkedBooter.main(ForkedBooter.java:103)
04-Mar-2019 14:01:31
04-Mar-2019 14:01:31 Tests run: 1, Failures: 0, Errors: 0, Skipped: 1, Time elapsed: 0.578 sec - in org.springframework.cloud.dataflow.acceptance.test.SchedulerTests
04-Mar-2019 14:01:31 Running org.springframework.cloud.dataflow.acceptance.test.NamedChannelTests
04-Mar-2019 14:01:31 2019-03-04 14:01:31.781  INFO 12337 --- [           main] .b.t.c.SpringBootTestContextBootstrapper : Neither @ContextConfiguration nor @ContextHierarchy found for test class [org.springframework.cloud.dataflow.acceptance.test.NamedChannelTests], using SpringBootContextLoader
04-Mar-2019 14:01:31 2019-03-04 14:01:31.786  INFO 12337 --- [           main] .b.t.c.SpringBootTestContextBootstrapper : Loaded default TestExecutionListener class names from location [META-INF/spring.factories]: [org.springframework.boot.test.mock.mockito.MockitoTestExecutionListener, org.springframework.boot.test.mock.mockito.ResetMocksTestExecutionListener, org.springframework.boot.test.autoconfigure.restdocs.RestDocsTestExecutionListener, org.springframework.boot.test.autoconfigure.web.client.MockRestServiceServerResetTestExecutionListener, org.springframework.boot.test.autoconfigure.web.servlet.MockMvcPrintOnlyOnFailureTestExecutionListener, org.springframework.boot.test.autoconfigure.web.servlet.WebDriverTestExecutionListener, org.springframework.test.context.web.ServletTestExecutionListener, org.springframework.test.context.support.DirtiesContextBeforeModesTestExecutionListener, org.springframework.test.context.support.DependencyInjectionTestExecutionListener, org.springframework.test.context.support.DirtiesContextTestExecutionListener, org.springframework.test.context.transaction.TransactionalTestExecutionListener, org.springframework.test.context.jdbc.SqlScriptsTestExecutionListener]
04-Mar-2019 14:01:31 2019-03-04 14:01:31.789  INFO 12337 --- [           main] .b.t.c.SpringBootTestContextBootstrapper : Using TestExecutionListeners: [org.springframework.test.context.web.ServletTestExecutionListener@7c369270, org.springframework.test.context.support.DirtiesContextBeforeModesTestExecutionListener@9f86dc3, org.springframework.boot.test.autoconfigure.SpringBootDependencyInjectionTestExecutionListener@41d16cc3, org.springframework.test.context.support.DirtiesContextTestExecutionListener@662e682a, org.springframework.test.context.transaction.TransactionalTestExecutionListener@2e43c38d, org.springframework.test.context.jdbc.SqlScriptsTestExecutionListener@649f25f3, org.springframework.boot.test.autoconfigure.web.servlet.MockMvcPrintOnlyOnFailureTestExecutionListener@2e62ead7, org.springframework.boot.test.autoconfigure.web.client.MockRestServiceServerResetTestExecutionListener@3b98b809, org.springframework.boot.test.mock.mockito.ResetMocksTestExecutionListener@bf75b5c, org.springframework.boot.test.autoconfigure.web.servlet.WebDriverTestExecutionListener@16da476c, org.springframework.boot.test.autoconfigure.restdocs.RestDocsTestExecutionListener@2fd72332, org.springframework.boot.test.mock.mockito.MockitoTestExecutionListener@51f18e31]
04-Mar-2019 14:01:31 2019-03-04 14:01:31.851  INFO 12337 --- [           main] junit.logTestName                        : Starting Test testDestination(org.springframework.cloud.dataflow.acceptance.test.NamedChannelTests)
04-Mar-2019 14:01:31 2019-03-04 14:01:31.855  INFO 12337 --- [           main] o.s.c.d.a.test.NamedChannelTests         : Creating stream 'LOG-DESTINATION-SINK'
04-Mar-2019 14:01:31 2019-03-04 14:01:31.872  INFO 12337 --- [           main] o.s.c.d.a.test.NamedChannelTests         : Deploying stream 'LOG-DESTINATION-SINK' with properties: {app.*.spring.cloud.streamapp.security.enabled=false, app.*.logging.file=${PID}-test.log, app.*.endpoints.logfile.sensitive=false, app.*.management.endpoints.web.exposure.include=*}
04-Mar-2019 14:01:32 2019-03-04 14:01:32.130  INFO 12337 --- [           main] o.s.c.d.a.test.NamedChannelTests         : Checking: Stream=LOG-DESTINATION-SINK, status = deploying, status description = The stream is being deployed.
04-Mar-2019 14:01:32 2019-03-04 14:01:32.130  INFO 12337 --- [           main] o.s.c.d.a.test.NamedChannelTests         : Sleeping to check status of Stream=LOG-DESTINATION-SINK
04-Mar-2019 14:01:42 2019-03-04 14:01:42.172  INFO 12337 --- [           main] o.s.c.d.a.test.NamedChannelTests         : Checking: Stream=LOG-DESTINATION-SINK, status = deployed, status description = The stream has been successfully deployed
04-Mar-2019 14:01:42 2019-03-04 14:01:42.217  INFO 12337 --- [           main] o.s.c.d.a.test.NamedChannelTests         : Sleeping to check status of Stream=LOG-DESTINATION-SINK
04-Mar-2019 14:01:52 2019-03-04 14:01:52.217  INFO 12337 --- [           main] o.s.c.d.a.test.NamedChannelTests         : Stream 'LOG-DESTINATION-SINK' started with status: deployed
04-Mar-2019 14:01:52 2019-03-04 14:01:52.218  INFO 12337 --- [           main] o.s.c.d.a.test.NamedChannelTests         : App 'log' has instances: {LOG-DESTINATION-SINK.log-v1-0=http://10.194.6.10:46362}
04-Mar-2019 14:01:52 2019-03-04 14:01:52.218  INFO 12337 --- [           main] o.s.c.d.a.test.NamedChannelTests         : Looking for 'Started LogSink' in logfile for log
04-Mar-2019 14:02:02 2019-03-04 14:02:02.218  INFO 12337 --- [           main] o.s.c.d.a.test.NamedChannelTests         : Requesting log for app LOG-DESTINATION-SINK.log-v1-0
04-Mar-2019 14:02:02 2019-03-04 14:02:02.351  INFO 12337 --- [           main] o.s.c.d.a.test.NamedChannelTests         : Retrieved logfile from 'http://10.194.6.10:46362/actuator/logfile
04-Mar-2019 14:02:02 2019-03-04 14:02:02.351  INFO 12337 --- [           main] o.s.c.d.a.test.NamedChannelTests         : Matched all 'Started LogSink' in logfile for app log (source LOG-DESTINATION-SINK.log-v1-0)
04-Mar-2019 14:02:02 2019-03-04 14:02:02.352  INFO 12337 --- [           main] o.s.c.d.a.test.NamedChannelTests         : Creating stream 'HTTP-DESTINATION-SOURCE'
04-Mar-2019 14:02:02 2019-03-04 14:02:02.370  INFO 12337 --- [           main] o.s.c.d.a.test.NamedChannelTests         : Deploying stream 'HTTP-DESTINATION-SOURCE' with properties: {app.*.spring.cloud.streamapp.security.enabled=false, app.*.logging.file=${PID}-test.log, app.*.endpoints.logfile.sensitive=false, app.*.management.endpoints.web.exposure.include=*}
04-Mar-2019 14:02:02 2019-03-04 14:02:02.666  INFO 12337 --- [           main] o.s.c.d.a.test.NamedChannelTests         : Checking: Stream=HTTP-DESTINATION-SOURCE, status = deploying, status description = The stream is being deployed.
04-Mar-2019 14:02:02 2019-03-04 14:02:02.666  INFO 12337 --- [           main] o.s.c.d.a.test.NamedChannelTests         : Sleeping to check status of Stream=HTTP-DESTINATION-SOURCE
04-Mar-2019 14:02:12 2019-03-04 14:02:12.737  INFO 12337 --- [           main] o.s.c.d.a.test.NamedChannelTests         : Checking: Stream=HTTP-DESTINATION-SOURCE, status = deployed, status description = The stream has been successfully deployed
04-Mar-2019 14:02:12 2019-03-04 14:02:12.787  INFO 12337 --- [           main] o.s.c.d.a.test.NamedChannelTests         : Sleeping to check status of Stream=HTTP-DESTINATION-SOURCE
04-Mar-2019 14:02:22 2019-03-04 14:02:22.788  INFO 12337 --- [           main] o.s.c.d.a.test.NamedChannelTests         : Stream 'HTTP-DESTINATION-SOURCE' started with status: deployed
04-Mar-2019 14:02:22 2019-03-04 14:02:22.788  INFO 12337 --- [           main] o.s.c.d.a.test.NamedChannelTests         : App 'http' has instances: {HTTP-DESTINATION-SOURCE.http-v1-0=http://10.194.6.10:27594}
04-Mar-2019 14:02:22 2019-03-04 14:02:22.788  INFO 12337 --- [           main] o.s.c.d.a.test.NamedChannelTests         : Looking for 'Started HttpSource' in logfile for http
04-Mar-2019 14:02:32 2019-03-04 14:02:32.788  INFO 12337 --- [           main] o.s.c.d.a.test.NamedChannelTests         : Requesting log for app HTTP-DESTINATION-SOURCE.http-v1-0
04-Mar-2019 14:02:32 2019-03-04 14:02:32.925  INFO 12337 --- [           main] o.s.c.d.a.test.NamedChannelTests         : Retrieved logfile from 'http://10.194.6.10:27594/actuator/logfile
04-Mar-2019 14:02:32 2019-03-04 14:02:32.925  INFO 12337 --- [           main] o.s.c.d.a.test.NamedChannelTests         : Matched all 'Started HttpSource' in logfile for app http (source HTTP-DESTINATION-SOURCE.http-v1-0)
04-Mar-2019 14:02:33 2019-03-04 14:02:33.026  INFO 12337 --- [           main] o.s.c.d.a.test.NamedChannelTests         : Looking for 'abcdefg' in logfile for log
04-Mar-2019 14:02:43 2019-03-04 14:02:43.026  INFO 12337 --- [           main] o.s.c.d.a.test.NamedChannelTests         : Requesting log for app LOG-DESTINATION-SINK.log-v1-0
04-Mar-2019 14:02:43 2019-03-04 14:02:43.034  INFO 12337 --- [           main] o.s.c.d.a.test.NamedChannelTests         : Retrieved logfile from 'http://10.194.6.10:46362/actuator/logfile
04-Mar-2019 14:02:43 2019-03-04 14:02:43.034  INFO 12337 --- [           main] o.s.c.d.a.test.NamedChannelTests         : Matched all 'abcdefg' in logfile for app log (source LOG-DESTINATION-SINK.log-v1-0)
04-Mar-2019 14:02:43 2019-03-04 14:02:43.035  INFO 12337 --- [           main] junit.logTestName                        : Test testDestination(org.springframework.cloud.dataflow.acceptance.test.NamedChannelTests) Succeeded
04-Mar-2019 14:02:43 2019-03-04 14:02:43.035  INFO 12337 --- [           main] junit.logTestName                        : Finished Test testDestination(org.springframework.cloud.dataflow.acceptance.test.NamedChannelTests)
04-Mar-2019 14:02:43 2019-03-04 14:02:43.035  INFO 12337 --- [           main] o.s.c.d.a.test.NamedChannelTests         : Destroy all streams
04-Mar-2019 14:02:43 2019-03-04 14:02:43.482  INFO 12337 --- [           main] junit.logTestName                        : Starting Test testTap(org.springframework.cloud.dataflow.acceptance.test.NamedChannelTests)
04-Mar-2019 14:02:43 2019-03-04 14:02:43.483  INFO 12337 --- [           main] o.s.c.d.a.test.NamedChannelTests         : Creating stream 'TAPHTTP'
04-Mar-2019 14:02:43 2019-03-04 14:02:43.502  INFO 12337 --- [           main] o.s.c.d.a.test.NamedChannelTests         : Deploying stream 'TAPHTTP' with properties: {app.*.spring.cloud.streamapp.security.enabled=false, app.*.logging.file=${PID}-test.log, app.*.endpoints.logfile.sensitive=false, app.*.management.endpoints.web.exposure.include=*}
04-Mar-2019 14:02:43 2019-03-04 14:02:43.942  INFO 12337 --- [           main] o.s.c.d.a.test.NamedChannelTests         : Checking: Stream=TAPHTTP, status = deploying, status description = The stream is being deployed.
04-Mar-2019 14:02:43 2019-03-04 14:02:43.942  INFO 12337 --- [           main] o.s.c.d.a.test.NamedChannelTests         : Sleeping to check status of Stream=TAPHTTP
04-Mar-2019 14:02:54 2019-03-04 14:02:54.010  INFO 12337 --- [           main] o.s.c.d.a.test.NamedChannelTests         : Checking: Stream=TAPHTTP, status = deploying, status description = The stream is being deployed.
04-Mar-2019 14:02:54 2019-03-04 14:02:54.010  INFO 12337 --- [           main] o.s.c.d.a.test.NamedChannelTests         : Sleeping to check status of Stream=TAPHTTP
04-Mar-2019 14:03:04 2019-03-04 14:03:04.059  INFO 12337 --- [           main] o.s.c.d.a.test.NamedChannelTests         : Checking: Stream=TAPHTTP, status = deployed, status description = The stream has been successfully deployed
04-Mar-2019 14:03:04 2019-03-04 14:03:04.088  INFO 12337 --- [           main] o.s.c.d.a.test.NamedChannelTests         : Sleeping to check status of Stream=TAPHTTP
04-Mar-2019 14:03:14 2019-03-04 14:03:14.089  INFO 12337 --- [           main] o.s.c.d.a.test.NamedChannelTests         : Stream 'TAPHTTP' started with status: deployed
04-Mar-2019 14:03:14 2019-03-04 14:03:14.089  INFO 12337 --- [           main] o.s.c.d.a.test.NamedChannelTests         : App 'log' has instances: {TAPHTTP.log-v1-0=http://10.194.6.10:42212}
04-Mar-2019 14:03:14 2019-03-04 14:03:14.089  INFO 12337 --- [           main] o.s.c.d.a.test.NamedChannelTests         : App 'http' has instances: {TAPHTTP.http-v1-0=http://10.194.6.10:35379}
04-Mar-2019 14:03:14 2019-03-04 14:03:14.089  INFO 12337 --- [           main] o.s.c.d.a.test.NamedChannelTests         : Looking for 'Started HttpSource' in logfile for http
04-Mar-2019 14:03:24 2019-03-04 14:03:24.089  INFO 12337 --- [           main] o.s.c.d.a.test.NamedChannelTests         : Requesting log for app TAPHTTP.http-v1-0
04-Mar-2019 14:03:24 2019-03-04 14:03:24.238  INFO 12337 --- [           main] o.s.c.d.a.test.NamedChannelTests         : Retrieved logfile from 'http://10.194.6.10:35379/actuator/logfile
04-Mar-2019 14:03:24 2019-03-04 14:03:24.239  INFO 12337 --- [           main] o.s.c.d.a.test.NamedChannelTests         : Matched all 'Started HttpSource' in logfile for app http (source TAPHTTP.http-v1-0)
04-Mar-2019 14:03:24 2019-03-04 14:03:24.239  INFO 12337 --- [           main] o.s.c.d.a.test.NamedChannelTests         : Looking for 'Started LogSink' in logfile for log
04-Mar-2019 14:03:34 2019-03-04 14:03:34.239  INFO 12337 --- [           main] o.s.c.d.a.test.NamedChannelTests         : Requesting log for app TAPHTTP.log-v1-0
04-Mar-2019 14:03:34 2019-03-04 14:03:34.410  INFO 12337 --- [           main] o.s.c.d.a.test.NamedChannelTests         : Retrieved logfile from 'http://10.194.6.10:42212/actuator/logfile
04-Mar-2019 14:03:34 2019-03-04 14:03:34.410  INFO 12337 --- [           main] o.s.c.d.a.test.NamedChannelTests         : Matched all 'Started LogSink' in logfile for app log (source TAPHTTP.log-v1-0)
04-Mar-2019 14:03:34 2019-03-04 14:03:34.411  INFO 12337 --- [           main] o.s.c.d.a.test.NamedChannelTests         : Creating stream 'TAPSTREAM'
04-Mar-2019 14:03:34 2019-03-04 14:03:34.435  INFO 12337 --- [           main] o.s.c.d.a.test.NamedChannelTests         : Deploying stream 'TAPSTREAM' with properties: {app.*.spring.cloud.streamapp.security.enabled=false, app.*.logging.file=${PID}-test.log, app.*.endpoints.logfile.sensitive=false, app.*.management.endpoints.web.exposure.include=*}
04-Mar-2019 14:03:34 2019-03-04 14:03:34.736  INFO 12337 --- [           main] o.s.c.d.a.test.NamedChannelTests         : Checking: Stream=TAPSTREAM, status = deploying, status description = The stream is being deployed.
04-Mar-2019 14:03:34 2019-03-04 14:03:34.736  INFO 12337 --- [           main] o.s.c.d.a.test.NamedChannelTests         : Sleeping to check status of Stream=TAPSTREAM
04-Mar-2019 14:03:44 2019-03-04 14:03:44.779  INFO 12337 --- [           main] o.s.c.d.a.test.NamedChannelTests         : Checking: Stream=TAPSTREAM, status = deployed, status description = The stream has been successfully deployed
04-Mar-2019 14:03:44 2019-03-04 14:03:44.846  INFO 12337 --- [           main] o.s.c.d.a.test.NamedChannelTests         : Sleeping to check status of Stream=TAPSTREAM
04-Mar-2019 14:03:54 2019-03-04 14:03:54.846  INFO 12337 --- [           main] o.s.c.d.a.test.NamedChannelTests         : Stream 'TAPSTREAM' started with status: deployed
04-Mar-2019 14:03:54 2019-03-04 14:03:54.847  INFO 12337 --- [           main] o.s.c.d.a.test.NamedChannelTests         : App 'log' has instances: {TAPSTREAM.log-v1-0=http://10.194.6.10:35487}
04-Mar-2019 14:03:54 2019-03-04 14:03:54.847  INFO 12337 --- [           main] o.s.c.d.a.test.NamedChannelTests         : Looking for 'Started LogSink' in logfile for log
04-Mar-2019 14:04:04 2019-03-04 14:04:04.847  INFO 12337 --- [           main] o.s.c.d.a.test.NamedChannelTests         : Requesting log for app TAPSTREAM.log-v1-0
04-Mar-2019 14:04:04 2019-03-04 14:04:04.980  INFO 12337 --- [           main] o.s.c.d.a.test.NamedChannelTests         : Retrieved logfile from 'http://10.194.6.10:35487/actuator/logfile
04-Mar-2019 14:04:04 2019-03-04 14:04:04.980  INFO 12337 --- [           main] o.s.c.d.a.test.NamedChannelTests         : Matched all 'Started LogSink' in logfile for app log (source TAPSTREAM.log-v1-0)
04-Mar-2019 14:04:05 2019-03-04 14:04:05.091  INFO 12337 --- [           main] o.s.c.d.a.test.NamedChannelTests         : Looking for 'abcdefg' in logfile for log
04-Mar-2019 14:04:15 2019-03-04 14:04:15.091  INFO 12337 --- [           main] o.s.c.d.a.test.NamedChannelTests         : Requesting log for app TAPSTREAM.log-v1-0
04-Mar-2019 14:04:15 2019-03-04 14:04:15.099  INFO 12337 --- [           main] o.s.c.d.a.test.NamedChannelTests         : Retrieved logfile from 'http://10.194.6.10:35487/actuator/logfile
04-Mar-2019 14:04:15 2019-03-04 14:04:15.100  INFO 12337 --- [           main] o.s.c.d.a.test.NamedChannelTests         : Matched all 'abcdefg' in logfile for app log (source TAPSTREAM.log-v1-0)
04-Mar-2019 14:04:15 2019-03-04 14:04:15.101  INFO 12337 --- [           main] junit.logTestName                        : Test testTap(org.springframework.cloud.dataflow.acceptance.test.NamedChannelTests) Succeeded
04-Mar-2019 14:04:15 2019-03-04 14:04:15.101  INFO 12337 --- [           main] junit.logTestName                        : Finished Test testTap(org.springframework.cloud.dataflow.acceptance.test.NamedChannelTests)
04-Mar-2019 14:04:15 2019-03-04 14:04:15.101  INFO 12337 --- [           main] o.s.c.d.a.test.NamedChannelTests         : Destroy all streams
04-Mar-2019 14:04:15 2019-03-04 14:04:15.623  INFO 12337 --- [           main] junit.logTestName                        : Starting Test manyToOneTest(org.springframework.cloud.dataflow.acceptance.test.NamedChannelTests)
04-Mar-2019 14:04:15 2019-03-04 14:04:15.624  INFO 12337 --- [           main] o.s.c.d.a.test.NamedChannelTests         : Creating stream 'MANY-TO-ONE'
04-Mar-2019 14:04:15 2019-03-04 14:04:15.646  INFO 12337 --- [           main] o.s.c.d.a.test.NamedChannelTests         : Deploying stream 'MANY-TO-ONE' with properties: {app.*.spring.cloud.streamapp.security.enabled=false, app.*.logging.file=${PID}-test.log, app.*.endpoints.logfile.sensitive=false, app.*.management.endpoints.web.exposure.include=*}
04-Mar-2019 14:04:15 2019-03-04 14:04:15.929  INFO 12337 --- [           main] o.s.c.d.a.test.NamedChannelTests         : Checking: Stream=MANY-TO-ONE, status = deploying, status description = The stream is being deployed.
04-Mar-2019 14:04:15 2019-03-04 14:04:15.929  INFO 12337 --- [           main] o.s.c.d.a.test.NamedChannelTests         : Sleeping to check status of Stream=MANY-TO-ONE
04-Mar-2019 14:04:25 2019-03-04 14:04:25.971  INFO 12337 --- [           main] o.s.c.d.a.test.NamedChannelTests         : Checking: Stream=MANY-TO-ONE, status = deployed, status description = The stream has been successfully deployed
04-Mar-2019 14:04:25 2019-03-04 14:04:25.999  INFO 12337 --- [           main] o.s.c.d.a.test.NamedChannelTests         : Sleeping to check status of Stream=MANY-TO-ONE
04-Mar-2019 14:04:36 2019-03-04 14:04:35.999  INFO 12337 --- [           main] o.s.c.d.a.test.NamedChannelTests         : Stream 'MANY-TO-ONE' started with status: deployed
04-Mar-2019 14:04:36 2019-03-04 14:04:36.000  INFO 12337 --- [           main] o.s.c.d.a.test.NamedChannelTests         : App 'log' has instances: {MANY-TO-ONE.log-v1-0=http://10.194.6.10:26245}
04-Mar-2019 14:04:36 2019-03-04 14:04:36.000  INFO 12337 --- [           main] o.s.c.d.a.test.NamedChannelTests         : Looking for 'Started LogSink' in logfile for log
04-Mar-2019 14:04:46 2019-03-04 14:04:46.000  INFO 12337 --- [           main] o.s.c.d.a.test.NamedChannelTests         : Requesting log for app MANY-TO-ONE.log-v1-0
04-Mar-2019 14:04:46 2019-03-04 14:04:46.155  INFO 12337 --- [           main] o.s.c.d.a.test.NamedChannelTests         : Retrieved logfile from 'http://10.194.6.10:26245/actuator/logfile
04-Mar-2019 14:04:46 2019-03-04 14:04:46.156  INFO 12337 --- [           main] o.s.c.d.a.test.NamedChannelTests         : Matched all 'Started LogSink' in logfile for app log (source MANY-TO-ONE.log-v1-0)
04-Mar-2019 14:04:46 2019-03-04 14:04:46.156  INFO 12337 --- [           main] o.s.c.d.a.test.NamedChannelTests         : Creating stream 'HTTP-SOURCE-1'
04-Mar-2019 14:04:46 2019-03-04 14:04:46.175  INFO 12337 --- [           main] o.s.c.d.a.test.NamedChannelTests         : Deploying stream 'HTTP-SOURCE-1' with properties: {app.*.spring.cloud.streamapp.security.enabled=false, app.*.logging.file=${PID}-test.log, app.*.endpoints.logfile.sensitive=false, app.*.management.endpoints.web.exposure.include=*}
04-Mar-2019 14:04:46 2019-03-04 14:04:46.466  INFO 12337 --- [           main] o.s.c.d.a.test.NamedChannelTests         : Checking: Stream=HTTP-SOURCE-1, status = deploying, status description = The stream is being deployed.
04-Mar-2019 14:04:46 2019-03-04 14:04:46.466  INFO 12337 --- [           main] o.s.c.d.a.test.NamedChannelTests         : Sleeping to check status of Stream=HTTP-SOURCE-1
04-Mar-2019 14:04:56 2019-03-04 14:04:56.505  INFO 12337 --- [           main] o.s.c.d.a.test.NamedChannelTests         : Checking: Stream=HTTP-SOURCE-1, status = deployed, status description = The stream has been successfully deployed
04-Mar-2019 14:04:56 2019-03-04 14:04:56.541  INFO 12337 --- [           main] o.s.c.d.a.test.NamedChannelTests         : Sleeping to check status of Stream=HTTP-SOURCE-1
04-Mar-2019 14:05:06 2019-03-04 14:05:06.542  INFO 12337 --- [           main] o.s.c.d.a.test.NamedChannelTests         : Stream 'HTTP-SOURCE-1' started with status: deployed
04-Mar-2019 14:05:06 2019-03-04 14:05:06.542  INFO 12337 --- [           main] o.s.c.d.a.test.NamedChannelTests         : App 'http' has instances: {HTTP-SOURCE-1.http-v1-0=http://10.194.6.10:23237}
04-Mar-2019 14:05:06 2019-03-04 14:05:06.542  INFO 12337 --- [           main] o.s.c.d.a.test.NamedChannelTests         : Looking for 'Started HttpSource' in logfile for http
04-Mar-2019 14:05:16 2019-03-04 14:05:16.542  INFO 12337 --- [           main] o.s.c.d.a.test.NamedChannelTests         : Requesting log for app HTTP-SOURCE-1.http-v1-0
04-Mar-2019 14:05:16 2019-03-04 14:05:16.674  INFO 12337 --- [           main] o.s.c.d.a.test.NamedChannelTests         : Retrieved logfile from 'http://10.194.6.10:23237/actuator/logfile
04-Mar-2019 14:05:16 2019-03-04 14:05:16.675  INFO 12337 --- [           main] o.s.c.d.a.test.NamedChannelTests         : Matched all 'Started HttpSource' in logfile for app http (source HTTP-SOURCE-1.http-v1-0)
04-Mar-2019 14:05:16 2019-03-04 14:05:16.675  INFO 12337 --- [           main] o.s.c.d.a.test.NamedChannelTests         : Creating stream 'HTTP-SOURCE-2'
04-Mar-2019 14:05:16 2019-03-04 14:05:16.698  INFO 12337 --- [           main] o.s.c.d.a.test.NamedChannelTests         : Deploying stream 'HTTP-SOURCE-2' with properties: {app.*.spring.cloud.streamapp.security.enabled=false, app.*.logging.file=${PID}-test.log, app.*.endpoints.logfile.sensitive=false, app.*.management.endpoints.web.exposure.include=*}
04-Mar-2019 14:05:17 2019-03-04 14:05:17.017  INFO 12337 --- [           main] o.s.c.d.a.test.NamedChannelTests         : Checking: Stream=HTTP-SOURCE-2, status = deploying, status description = The stream is being deployed.
04-Mar-2019 14:05:17 2019-03-04 14:05:17.018  INFO 12337 --- [           main] o.s.c.d.a.test.NamedChannelTests         : Sleeping to check status of Stream=HTTP-SOURCE-2
04-Mar-2019 14:05:27 2019-03-04 14:05:27.072  INFO 12337 --- [           main] o.s.c.d.a.test.NamedChannelTests         : Checking: Stream=HTTP-SOURCE-2, status = deployed, status description = The stream has been successfully deployed
04-Mar-2019 14:05:27 2019-03-04 14:05:27.129  INFO 12337 --- [           main] o.s.c.d.a.test.NamedChannelTests         : Sleeping to check status of Stream=HTTP-SOURCE-2
04-Mar-2019 14:05:37 2019-03-04 14:05:37.130  INFO 12337 --- [           main] o.s.c.d.a.test.NamedChannelTests         : Stream 'HTTP-SOURCE-2' started with status: deployed
04-Mar-2019 14:05:37 2019-03-04 14:05:37.130  INFO 12337 --- [           main] o.s.c.d.a.test.NamedChannelTests         : App 'http' has instances: {HTTP-SOURCE-2.http-v1-0=http://10.194.6.10:33154}
04-Mar-2019 14:05:37 2019-03-04 14:05:37.130  INFO 12337 --- [           main] o.s.c.d.a.test.NamedChannelTests         : Looking for 'Started HttpSource' in logfile for http
04-Mar-2019 14:05:47 2019-03-04 14:05:47.130  INFO 12337 --- [           main] o.s.c.d.a.test.NamedChannelTests         : Requesting log for app HTTP-SOURCE-2.http-v1-0
04-Mar-2019 14:05:47 2019-03-04 14:05:47.302  INFO 12337 --- [           main] o.s.c.d.a.test.NamedChannelTests         : Retrieved logfile from 'http://10.194.6.10:33154/actuator/logfile
04-Mar-2019 14:05:47 2019-03-04 14:05:47.302  INFO 12337 --- [           main] o.s.c.d.a.test.NamedChannelTests         : Matched all 'Started HttpSource' in logfile for app http (source HTTP-SOURCE-2.http-v1-0)
04-Mar-2019 14:05:47 2019-03-04 14:05:47.403  INFO 12337 --- [           main] o.s.c.d.a.test.NamedChannelTests         : Looking for 'abcdefg' in logfile for log
04-Mar-2019 14:05:57 2019-03-04 14:05:57.403  INFO 12337 --- [           main] o.s.c.d.a.test.NamedChannelTests         : Requesting log for app MANY-TO-ONE.log-v1-0
04-Mar-2019 14:05:57 2019-03-04 14:05:57.415  INFO 12337 --- [           main] o.s.c.d.a.test.NamedChannelTests         : Retrieved logfile from 'http://10.194.6.10:26245/actuator/logfile
04-Mar-2019 14:05:57 2019-03-04 14:05:57.416  INFO 12337 --- [           main] o.s.c.d.a.test.NamedChannelTests         : Matched all 'abcdefg' in logfile for app log (source MANY-TO-ONE.log-v1-0)
04-Mar-2019 14:05:57 2019-03-04 14:05:57.551  INFO 12337 --- [           main] o.s.c.d.a.test.NamedChannelTests         : Looking for 'hijklmn' in logfile for log
04-Mar-2019 14:06:07 2019-03-04 14:06:07.551  INFO 12337 --- [           main] o.s.c.d.a.test.NamedChannelTests         : Requesting log for app MANY-TO-ONE.log-v1-0
04-Mar-2019 14:06:07 2019-03-04 14:06:07.559  INFO 12337 --- [           main] o.s.c.d.a.test.NamedChannelTests         : Retrieved logfile from 'http://10.194.6.10:26245/actuator/logfile
04-Mar-2019 14:06:07 2019-03-04 14:06:07.559  INFO 12337 --- [           main] o.s.c.d.a.test.NamedChannelTests         : Matched all 'hijklmn' in logfile for app log (source MANY-TO-ONE.log-v1-0)
04-Mar-2019 14:06:07 2019-03-04 14:06:07.561  INFO 12337 --- [           main] junit.logTestName                        : Test manyToOneTest(org.springframework.cloud.dataflow.acceptance.test.NamedChannelTests) Succeeded
04-Mar-2019 14:06:07 2019-03-04 14:06:07.561  INFO 12337 --- [           main] junit.logTestName                        : Finished Test manyToOneTest(org.springframework.cloud.dataflow.acceptance.test.NamedChannelTests)
04-Mar-2019 14:06:07 2019-03-04 14:06:07.561  INFO 12337 --- [           main] o.s.c.d.a.test.NamedChannelTests         : Destroy all streams
04-Mar-2019 14:06:07 2019-03-04 14:06:07.908  INFO 12337 --- [           main] junit.logTestName                        : Starting Test directedGraphTest(org.springframework.cloud.dataflow.acceptance.test.NamedChannelTests)
04-Mar-2019 14:06:07 2019-03-04 14:06:07.909  INFO 12337 --- [           main] o.s.c.d.a.test.NamedChannelTests         : Creating stream 'DIRECTED-GRAPH-DESTINATION1'
04-Mar-2019 14:06:07 2019-03-04 14:06:07.936  INFO 12337 --- [           main] o.s.c.d.a.test.NamedChannelTests         : Deploying stream 'DIRECTED-GRAPH-DESTINATION1' with properties: {app.*.spring.cloud.streamapp.security.enabled=false, app.*.logging.file=${PID}-test.log, app.*.endpoints.logfile.sensitive=false, app.*.management.endpoints.web.exposure.include=*}
04-Mar-2019 14:06:08 2019-03-04 14:06:08.333  INFO 12337 --- [           main] o.s.c.d.a.test.NamedChannelTests         : Checking: Stream=DIRECTED-GRAPH-DESTINATION1, status = deploying, status description = The stream is being deployed.
04-Mar-2019 14:06:08 2019-03-04 14:06:08.334  INFO 12337 --- [           main] o.s.c.d.a.test.NamedChannelTests         : Sleeping to check status of Stream=DIRECTED-GRAPH-DESTINATION1
04-Mar-2019 14:06:18 2019-03-04 14:06:18.377  INFO 12337 --- [           main] o.s.c.d.a.test.NamedChannelTests         : Checking: Stream=DIRECTED-GRAPH-DESTINATION1, status = deploying, status description = The stream is being deployed.
04-Mar-2019 14:06:18 2019-03-04 14:06:18.377  INFO 12337 --- [           main] o.s.c.d.a.test.NamedChannelTests         : Sleeping to check status of Stream=DIRECTED-GRAPH-DESTINATION1
04-Mar-2019 14:06:28 2019-03-04 14:06:28.416  INFO 12337 --- [           main] o.s.c.d.a.test.NamedChannelTests         : Checking: Stream=DIRECTED-GRAPH-DESTINATION1, status = deployed, status description = The stream has been successfully deployed
04-Mar-2019 14:06:28 2019-03-04 14:06:28.449  INFO 12337 --- [           main] o.s.c.d.a.test.NamedChannelTests         : Sleeping to check status of Stream=DIRECTED-GRAPH-DESTINATION1
04-Mar-2019 14:06:38 2019-03-04 14:06:38.449  INFO 12337 --- [           main] o.s.c.d.a.test.NamedChannelTests         : Stream 'DIRECTED-GRAPH-DESTINATION1' started with status: deployed
04-Mar-2019 14:06:38 2019-03-04 14:06:38.449  INFO 12337 --- [           main] o.s.c.d.a.test.NamedChannelTests         : App 'transform' has instances: {DIRECTED-GRAPH-DESTINATION1.transform-v1-0=http://10.194.6.10:23123}
04-Mar-2019 14:06:38 2019-03-04 14:06:38.449  INFO 12337 --- [           main] o.s.c.d.a.test.NamedChannelTests         : App 'log' has instances: {DIRECTED-GRAPH-DESTINATION1.log-v1-0=http://10.194.6.10:25783}
04-Mar-2019 14:06:38 2019-03-04 14:06:38.449  INFO 12337 --- [           main] o.s.c.d.a.test.NamedChannelTests         : Looking for 'Started LogSink' in logfile for log
04-Mar-2019 14:06:48 2019-03-04 14:06:48.449  INFO 12337 --- [           main] o.s.c.d.a.test.NamedChannelTests         : Requesting log for app DIRECTED-GRAPH-DESTINATION1.log-v1-0
04-Mar-2019 14:06:48 2019-03-04 14:06:48.603  INFO 12337 --- [           main] o.s.c.d.a.test.NamedChannelTests         : Retrieved logfile from 'http://10.194.6.10:25783/actuator/logfile
04-Mar-2019 14:06:48 2019-03-04 14:06:48.603  INFO 12337 --- [           main] o.s.c.d.a.test.NamedChannelTests         : Matched all 'Started LogSink' in logfile for app log (source DIRECTED-GRAPH-DESTINATION1.log-v1-0)
04-Mar-2019 14:06:48 2019-03-04 14:06:48.604  INFO 12337 --- [           main] o.s.c.d.a.test.NamedChannelTests         : Creating stream 'DIRECTED-GRAPH-DESTINATION2'
04-Mar-2019 14:06:48 2019-03-04 14:06:48.629  INFO 12337 --- [           main] o.s.c.d.a.test.NamedChannelTests         : Deploying stream 'DIRECTED-GRAPH-DESTINATION2' with properties: {app.*.spring.cloud.streamapp.security.enabled=false, app.*.logging.file=${PID}-test.log, app.*.endpoints.logfile.sensitive=false, app.*.management.endpoints.web.exposure.include=*}
04-Mar-2019 14:06:49 2019-03-04 14:06:49.099  INFO 12337 --- [           main] o.s.c.d.a.test.NamedChannelTests         : Checking: Stream=DIRECTED-GRAPH-DESTINATION2, status = deploying, status description = The stream is being deployed.
04-Mar-2019 14:06:49 2019-03-04 14:06:49.099  INFO 12337 --- [           main] o.s.c.d.a.test.NamedChannelTests         : Sleeping to check status of Stream=DIRECTED-GRAPH-DESTINATION2
04-Mar-2019 14:06:59 2019-03-04 14:06:59.171  INFO 12337 --- [           main] o.s.c.d.a.test.NamedChannelTests         : Checking: Stream=DIRECTED-GRAPH-DESTINATION2, status = deploying, status description = The stream is being deployed.
04-Mar-2019 14:06:59 2019-03-04 14:06:59.171  INFO 12337 --- [           main] o.s.c.d.a.test.NamedChannelTests         : Sleeping to check status of Stream=DIRECTED-GRAPH-DESTINATION2
04-Mar-2019 14:07:09 2019-03-04 14:07:09.224  INFO 12337 --- [           main] o.s.c.d.a.test.NamedChannelTests         : Checking: Stream=DIRECTED-GRAPH-DESTINATION2, status = deployed, status description = The stream has been successfully deployed
04-Mar-2019 14:07:09 2019-03-04 14:07:09.286  INFO 12337 --- [           main] o.s.c.d.a.test.NamedChannelTests         : Sleeping to check status of Stream=DIRECTED-GRAPH-DESTINATION2
04-Mar-2019 14:07:19 2019-03-04 14:07:19.286  INFO 12337 --- [           main] o.s.c.d.a.test.NamedChannelTests         : Stream 'DIRECTED-GRAPH-DESTINATION2' started with status: deployed
04-Mar-2019 14:07:19 2019-03-04 14:07:19.286  INFO 12337 --- [           main] o.s.c.d.a.test.NamedChannelTests         : App 'transform' has instances: {DIRECTED-GRAPH-DESTINATION2.transform-v1-0=http://10.194.6.10:52329}
04-Mar-2019 14:07:19 2019-03-04 14:07:19.286  INFO 12337 --- [           main] o.s.c.d.a.test.NamedChannelTests         : App 'log' has instances: {DIRECTED-GRAPH-DESTINATION2.log-v1-0=http://10.194.6.10:52604}
04-Mar-2019 14:07:19 2019-03-04 14:07:19.286  INFO 12337 --- [           main] o.s.c.d.a.test.NamedChannelTests         : Looking for 'Started LogSink' in logfile for log
04-Mar-2019 14:07:29 2019-03-04 14:07:29.287  INFO 12337 --- [           main] o.s.c.d.a.test.NamedChannelTests         : Requesting log for app DIRECTED-GRAPH-DESTINATION2.log-v1-0
04-Mar-2019 14:07:29 2019-03-04 14:07:29.418  INFO 12337 --- [           main] o.s.c.d.a.test.NamedChannelTests         : Retrieved logfile from 'http://10.194.6.10:52604/actuator/logfile
04-Mar-2019 14:07:29 2019-03-04 14:07:29.418  INFO 12337 --- [           main] o.s.c.d.a.test.NamedChannelTests         : Matched all 'Started LogSink' in logfile for app log (source DIRECTED-GRAPH-DESTINATION2.log-v1-0)
04-Mar-2019 14:07:29 2019-03-04 14:07:29.418  INFO 12337 --- [           main] o.s.c.d.a.test.NamedChannelTests         : Creating stream 'DIRECTED-GRAPH-HTTP-SOURCE'
04-Mar-2019 14:07:29 2019-03-04 14:07:29.440  INFO 12337 --- [           main] o.s.c.d.a.test.NamedChannelTests         : Deploying stream 'DIRECTED-GRAPH-HTTP-SOURCE' with properties: {app.*.spring.cloud.streamapp.security.enabled=false, app.*.logging.file=${PID}-test.log, app.*.endpoints.logfile.sensitive=false, app.*.management.endpoints.web.exposure.include=*}
04-Mar-2019 14:07:32 2019-03-04 14:07:32.337  INFO 12337 --- [           main] o.s.c.d.a.test.NamedChannelTests         : Checking: Stream=DIRECTED-GRAPH-HTTP-SOURCE, status = deploying, status description = The stream is being deployed.
04-Mar-2019 14:07:32 2019-03-04 14:07:32.337  INFO 12337 --- [           main] o.s.c.d.a.test.NamedChannelTests         : Sleeping to check status of Stream=DIRECTED-GRAPH-HTTP-SOURCE
04-Mar-2019 14:07:42 2019-03-04 14:07:42.419  INFO 12337 --- [           main] o.s.c.d.a.test.NamedChannelTests         : Checking: Stream=DIRECTED-GRAPH-HTTP-SOURCE, status = deploying, status description = The stream is being deployed.
04-Mar-2019 14:07:42 2019-03-04 14:07:42.419  INFO 12337 --- [           main] o.s.c.d.a.test.NamedChannelTests         : Sleeping to check status of Stream=DIRECTED-GRAPH-HTTP-SOURCE
04-Mar-2019 14:07:52 2019-03-04 14:07:52.494  INFO 12337 --- [           main] o.s.c.d.a.test.NamedChannelTests         : Checking: Stream=DIRECTED-GRAPH-HTTP-SOURCE, status = deployed, status description = The stream has been successfully deployed
04-Mar-2019 14:07:52 2019-03-04 14:07:52.571  INFO 12337 --- [           main] o.s.c.d.a.test.NamedChannelTests         : Sleeping to check status of Stream=DIRECTED-GRAPH-HTTP-SOURCE
04-Mar-2019 14:08:02 2019-03-04 14:08:02.571  INFO 12337 --- [           main] o.s.c.d.a.test.NamedChannelTests         : Stream 'DIRECTED-GRAPH-HTTP-SOURCE' started with status: deployed
04-Mar-2019 14:08:02 2019-03-04 14:08:02.571  INFO 12337 --- [           main] o.s.c.d.a.test.NamedChannelTests         : App 'router' has instances: {DIRECTED-GRAPH-HTTP-SOURCE.router-v1-0=http://10.194.6.10:27386}
04-Mar-2019 14:08:02 2019-03-04 14:08:02.571  INFO 12337 --- [           main] o.s.c.d.a.test.NamedChannelTests         : App 'http' has instances: {DIRECTED-GRAPH-HTTP-SOURCE.http-v1-0=http://10.194.6.10:35105}
04-Mar-2019 14:08:02 2019-03-04 14:08:02.571  INFO 12337 --- [           main] o.s.c.d.a.test.NamedChannelTests         : Looking for 'Started HttpSource' in logfile for http
04-Mar-2019 14:08:12 2019-03-04 14:08:12.571  INFO 12337 --- [           main] o.s.c.d.a.test.NamedChannelTests         : Requesting log for app DIRECTED-GRAPH-HTTP-SOURCE.http-v1-0
04-Mar-2019 14:08:12 2019-03-04 14:08:12.706  INFO 12337 --- [           main] o.s.c.d.a.test.NamedChannelTests         : Retrieved logfile from 'http://10.194.6.10:35105/actuator/logfile
04-Mar-2019 14:08:12 2019-03-04 14:08:12.707  INFO 12337 --- [           main] o.s.c.d.a.test.NamedChannelTests         : Matched all 'Started HttpSource' in logfile for app http (source DIRECTED-GRAPH-HTTP-SOURCE.http-v1-0)
04-Mar-2019 14:08:12 2019-03-04 14:08:12.823  INFO 12337 --- [           main] o.s.c.d.a.test.NamedChannelTests         : Looking for 'abcd-foo' in logfile for log
04-Mar-2019 14:08:22 2019-03-04 14:08:22.823  INFO 12337 --- [           main] o.s.c.d.a.test.NamedChannelTests         : Requesting log for app DIRECTED-GRAPH-DESTINATION1.log-v1-0
04-Mar-2019 14:08:22 2019-03-04 14:08:22.831  INFO 12337 --- [           main] o.s.c.d.a.test.NamedChannelTests         : Retrieved logfile from 'http://10.194.6.10:25783/actuator/logfile
04-Mar-2019 14:08:22 2019-03-04 14:08:22.832  INFO 12337 --- [           main] o.s.c.d.a.test.NamedChannelTests         : Polling to get log file. Remaining poll time = 169 seconds.
04-Mar-2019 14:08:32 2019-03-04 14:08:32.832  INFO 12337 --- [           main] o.s.c.d.a.test.NamedChannelTests         : Requesting log for app DIRECTED-GRAPH-DESTINATION1.log-v1-0
04-Mar-2019 14:08:32 2019-03-04 14:08:32.844  INFO 12337 --- [           main] o.s.c.d.a.test.NamedChannelTests         : Retrieved logfile from 'http://10.194.6.10:25783/actuator/logfile
04-Mar-2019 14:08:32 2019-03-04 14:08:32.844  INFO 12337 --- [           main] o.s.c.d.a.test.NamedChannelTests         : Polling to get log file. Remaining poll time = 159 seconds.
04-Mar-2019 14:08:42 2019-03-04 14:08:42.844  INFO 12337 --- [           main] o.s.c.d.a.test.NamedChannelTests         : Requesting log for app DIRECTED-GRAPH-DESTINATION1.log-v1-0
04-Mar-2019 14:08:42 2019-03-04 14:08:42.857  INFO 12337 --- [           main] o.s.c.d.a.test.NamedChannelTests         : Retrieved logfile from 'http://10.194.6.10:25783/actuator/logfile
04-Mar-2019 14:08:42 2019-03-04 14:08:42.857  INFO 12337 --- [           main] o.s.c.d.a.test.NamedChannelTests         : Polling to get log file. Remaining poll time = 149 seconds.
04-Mar-2019 14:08:52 2019-03-04 14:08:52.857  INFO 12337 --- [           main] o.s.c.d.a.test.NamedChannelTests         : Requesting log for app DIRECTED-GRAPH-DESTINATION1.log-v1-0
04-Mar-2019 14:08:52 2019-03-04 14:08:52.866  INFO 12337 --- [           main] o.s.c.d.a.test.NamedChannelTests         : Retrieved logfile from 'http://10.194.6.10:25783/actuator/logfile
04-Mar-2019 14:08:52 2019-03-04 14:08:52.866  INFO 12337 --- [           main] o.s.c.d.a.test.NamedChannelTests         : Polling to get log file. Remaining poll time = 139 seconds.
04-Mar-2019 14:09:02 2019-03-04 14:09:02.866  INFO 12337 --- [           main] o.s.c.d.a.test.NamedChannelTests         : Requesting log for app DIRECTED-GRAPH-DESTINATION1.log-v1-0
04-Mar-2019 14:09:02 2019-03-04 14:09:02.877  INFO 12337 --- [           main] o.s.c.d.a.test.NamedChannelTests         : Retrieved logfile from 'http://10.194.6.10:25783/actuator/logfile
04-Mar-2019 14:09:02 2019-03-04 14:09:02.877  INFO 12337 --- [           main] o.s.c.d.a.test.NamedChannelTests         : Polling to get log file. Remaining poll time = 129 seconds.
04-Mar-2019 14:09:12 2019-03-04 14:09:12.877  INFO 12337 --- [           main] o.s.c.d.a.test.NamedChannelTests         : Requesting log for app DIRECTED-GRAPH-DESTINATION1.log-v1-0
04-Mar-2019 14:09:12 2019-03-04 14:09:12.885  INFO 12337 --- [           main] o.s.c.d.a.test.NamedChannelTests         : Retrieved logfile from 'http://10.194.6.10:25783/actuator/logfile
04-Mar-2019 14:09:12 2019-03-04 14:09:12.886  INFO 12337 --- [           main] o.s.c.d.a.test.NamedChannelTests         : Polling to get log file. Remaining poll time = 119 seconds.
04-Mar-2019 14:09:22 2019-03-04 14:09:22.886  INFO 12337 --- [           main] o.s.c.d.a.test.NamedChannelTests         : Requesting log for app DIRECTED-GRAPH-DESTINATION1.log-v1-0
04-Mar-2019 14:09:22 2019-03-04 14:09:22.893  INFO 12337 --- [           main] o.s.c.d.a.test.NamedChannelTests         : Retrieved logfile from 'http://10.194.6.10:25783/actuator/logfile
04-Mar-2019 14:09:22 2019-03-04 14:09:22.893  INFO 12337 --- [           main] o.s.c.d.a.test.NamedChannelTests         : Polling to get log file. Remaining poll time = 109 seconds.
04-Mar-2019 14:09:32 2019-03-04 14:09:32.893  INFO 12337 --- [           main] o.s.c.d.a.test.NamedChannelTests         : Requesting log for app DIRECTED-GRAPH-DESTINATION1.log-v1-0
04-Mar-2019 14:09:32 2019-03-04 14:09:32.901  INFO 12337 --- [           main] o.s.c.d.a.test.NamedChannelTests         : Retrieved logfile from 'http://10.194.6.10:25783/actuator/logfile
04-Mar-2019 14:09:32 2019-03-04 14:09:32.901  INFO 12337 --- [           main] o.s.c.d.a.test.NamedChannelTests         : Polling to get log file. Remaining poll time = 99 seconds.
04-Mar-2019 14:09:42 2019-03-04 14:09:42.901  INFO 12337 --- [           main] o.s.c.d.a.test.NamedChannelTests         : Requesting log for app DIRECTED-GRAPH-DESTINATION1.log-v1-0
04-Mar-2019 14:09:42 2019-03-04 14:09:42.907  INFO 12337 --- [           main] o.s.c.d.a.test.NamedChannelTests         : Retrieved logfile from 'http://10.194.6.10:25783/actuator/logfile
04-Mar-2019 14:09:42 2019-03-04 14:09:42.907  INFO 12337 --- [           main] o.s.c.d.a.test.NamedChannelTests         : Polling to get log file. Remaining poll time = 89 seconds.
04-Mar-2019 14:09:52 2019-03-04 14:09:52.907  INFO 12337 --- [           main] o.s.c.d.a.test.NamedChannelTests         : Requesting log for app DIRECTED-GRAPH-DESTINATION1.log-v1-0
04-Mar-2019 14:09:52 2019-03-04 14:09:52.918  INFO 12337 --- [           main] o.s.c.d.a.test.NamedChannelTests         : Retrieved logfile from 'http://10.194.6.10:25783/actuator/logfile
04-Mar-2019 14:09:52 2019-03-04 14:09:52.918  INFO 12337 --- [           main] o.s.c.d.a.test.NamedChannelTests         : Polling to get log file. Remaining poll time = 79 seconds.
04-Mar-2019 14:10:02 2019-03-04 14:10:02.918  INFO 12337 --- [           main] o.s.c.d.a.test.NamedChannelTests         : Requesting log for app DIRECTED-GRAPH-DESTINATION1.log-v1-0
04-Mar-2019 14:10:02 2019-03-04 14:10:02.928  INFO 12337 --- [           main] o.s.c.d.a.test.NamedChannelTests         : Retrieved logfile from 'http://10.194.6.10:25783/actuator/logfile
04-Mar-2019 14:10:02 2019-03-04 14:10:02.928  INFO 12337 --- [           main] o.s.c.d.a.test.NamedChannelTests         : Polling to get log file. Remaining poll time = 69 seconds.
04-Mar-2019 14:10:12 2019-03-04 14:10:12.928  INFO 12337 --- [           main] o.s.c.d.a.test.NamedChannelTests         : Requesting log for app DIRECTED-GRAPH-DESTINATION1.log-v1-0
04-Mar-2019 14:10:12 2019-03-04 14:10:12.935  INFO 12337 --- [           main] o.s.c.d.a.test.NamedChannelTests         : Retrieved logfile from 'http://10.194.6.10:25783/actuator/logfile
04-Mar-2019 14:10:12 2019-03-04 14:10:12.936  INFO 12337 --- [           main] o.s.c.d.a.test.NamedChannelTests         : Polling to get log file. Remaining poll time = 59 seconds.
04-Mar-2019 14:10:22 2019-03-04 14:10:22.936  INFO 12337 --- [           main] o.s.c.d.a.test.NamedChannelTests         : Requesting log for app DIRECTED-GRAPH-DESTINATION1.log-v1-0
04-Mar-2019 14:10:22 2019-03-04 14:10:22.941  INFO 12337 --- [           main] o.s.c.d.a.test.NamedChannelTests         : Retrieved logfile from 'http://10.194.6.10:25783/actuator/logfile
04-Mar-2019 14:10:22 2019-03-04 14:10:22.942  INFO 12337 --- [           main] o.s.c.d.a.test.NamedChannelTests         : Polling to get log file. Remaining poll time = 49 seconds.
04-Mar-2019 14:10:32 2019-03-04 14:10:32.942  INFO 12337 --- [           main] o.s.c.d.a.test.NamedChannelTests         : Requesting log for app DIRECTED-GRAPH-DESTINATION1.log-v1-0
04-Mar-2019 14:10:32 2019-03-04 14:10:32.948  INFO 12337 --- [           main] o.s.c.d.a.test.NamedChannelTests         : Retrieved logfile from 'http://10.194.6.10:25783/actuator/logfile
04-Mar-2019 14:10:32 2019-03-04 14:10:32.948  INFO 12337 --- [           main] o.s.c.d.a.test.NamedChannelTests         : Polling to get log file. Remaining poll time = 39 seconds.
04-Mar-2019 14:10:42 2019-03-04 14:10:42.948  INFO 12337 --- [           main] o.s.c.d.a.test.NamedChannelTests         : Requesting log for app DIRECTED-GRAPH-DESTINATION1.log-v1-0
04-Mar-2019 14:10:42 2019-03-04 14:10:42.955  INFO 12337 --- [           main] o.s.c.d.a.test.NamedChannelTests         : Retrieved logfile from 'http://10.194.6.10:25783/actuator/logfile
04-Mar-2019 14:10:42 2019-03-04 14:10:42.955  INFO 12337 --- [           main] o.s.c.d.a.test.NamedChannelTests         : Polling to get log file. Remaining poll time = 29 seconds.
04-Mar-2019 14:10:52 2019-03-04 14:10:52.955  INFO 12337 --- [           main] o.s.c.d.a.test.NamedChannelTests         : Requesting log for app DIRECTED-GRAPH-DESTINATION1.log-v1-0
04-Mar-2019 14:10:52 2019-03-04 14:10:52.965  INFO 12337 --- [           main] o.s.c.d.a.test.NamedChannelTests         : Retrieved logfile from 'http://10.194.6.10:25783/actuator/logfile
04-Mar-2019 14:10:52 2019-03-04 14:10:52.965  INFO 12337 --- [           main] o.s.c.d.a.test.NamedChannelTests         : Polling to get log file. Remaining poll time = 19 seconds.
04-Mar-2019 14:11:02 2019-03-04 14:11:02.965  INFO 12337 --- [           main] o.s.c.d.a.test.NamedChannelTests         : Requesting log for app DIRECTED-GRAPH-DESTINATION1.log-v1-0
04-Mar-2019 14:11:02 2019-03-04 14:11:02.971  INFO 12337 --- [           main] o.s.c.d.a.test.NamedChannelTests         : Retrieved logfile from 'http://10.194.6.10:25783/actuator/logfile
04-Mar-2019 14:11:02 2019-03-04 14:11:02.972  INFO 12337 --- [           main] o.s.c.d.a.test.NamedChannelTests         : Polling to get log file. Remaining poll time = 9 seconds.
04-Mar-2019 14:11:12 2019-03-04 14:11:12.972  INFO 12337 --- [           main] o.s.c.d.a.test.NamedChannelTests         : Requesting log for app DIRECTED-GRAPH-DESTINATION1.log-v1-0
04-Mar-2019 14:11:12 2019-03-04 14:11:12.978  INFO 12337 --- [           main] o.s.c.d.a.test.NamedChannelTests         : Retrieved logfile from 'http://10.194.6.10:25783/actuator/logfile
04-Mar-2019 14:11:12 2019-03-04 14:11:12.979  INFO 12337 --- [           main] o.s.c.d.a.test.NamedChannelTests         : Polling to get log file. Remaining poll time = 0 seconds.
04-Mar-2019 14:11:12 2019-03-04 14:11:12.979 ERROR 12337 --- [           main] o.s.c.d.a.test.NamedChannelTests         : ERROR: Couldn't find 'abcd-foo; details below
04-Mar-2019 14:11:12 2019-03-04 14:11:12.979 ERROR 12337 --- [           main] o.s.c.d.a.test.NamedChannelTests         : ERROR: Dumping most recent log files.
04-Mar-2019 14:11:12
04-Mar-2019 14:11:12
04-Mar-2019 14:11:12 2019-03-04 14:11:12.979 ERROR 12337 --- [           main] o.s.c.d.a.test.NamedChannelTests         : <logFile> =================
04-Mar-2019 14:11:12 2019-03-04 14:11:12.979 ERROR 12337 --- [           main] o.s.c.d.a.test.NamedChannelTests         : Log File for DIRECTED-GRAPH-DESTINATION1.log-v1-0
04-Mar-2019 14:11:12 2019-03-04 14:06:11.136  INFO 14814 --- [main] trationDelegate$BeanPostProcessorChecker : Bean 'org.springframework.cloud.autoconfigure.ConfigurationPropertiesRebinderAutoConfiguration' of type [org.springframework.cloud.autoconfigure.ConfigurationPropertiesRebinderAutoConfiguration$$EnhancerBySpringCGLIB$$77f5049f] is not eligible for getting processed by all BeanPostProcessors (for example: not eligible for auto-proxying)
04-Mar-2019 14:11:12 2019-03-04 14:06:11.670  INFO 14814 --- [main] c.c.c.ConfigServicePropertySourceLocator : Fetching config from server at : http://localhost:8888
04-Mar-2019 14:11:12 2019-03-04 14:06:11.848  INFO 14814 --- [main] c.c.c.ConfigServicePropertySourceLocator : Connect Timeout Exception on Url - http://localhost:8888. Will be trying the next url if available
04-Mar-2019 14:11:12 2019-03-04 14:06:11.849  WARN 14814 --- [main] c.c.c.ConfigServicePropertySourceLocator : Could not locate PropertySource: I/O error on GET request for "http://localhost:8888/log-sink/default": Connection refused (Connection refused); nested exception is java.net.ConnectException: Connection refused (Connection refused)
04-Mar-2019 14:11:12 2019-03-04 14:06:11.864  INFO 14814 --- [main] o.s.c.s.a.l.s.k.LogSinkKafkaApplication  : No active profile set, falling back to default profiles: default
04-Mar-2019 14:11:12 2019-03-04 14:06:13.896  INFO 14814 --- [main] o.s.cloud.context.scope.GenericScope     : BeanFactory id=4b741f62-eca8-3cdc-8ef1-cb542fa27d89
04-Mar-2019 14:11:12 2019-03-04 14:06:13.903  INFO 14814 --- [main] faultConfiguringBeanFactoryPostProcessor : No bean named 'errorChannel' has been explicitly defined. Therefore, a default PublishSubscribeChannel will be created.
04-Mar-2019 14:11:12 2019-03-04 14:06:13.906  INFO 14814 --- [main] faultConfiguringBeanFactoryPostProcessor : No bean named 'taskScheduler' has been explicitly defined. Therefore, a default ThreadPoolTaskScheduler will be created.
04-Mar-2019 14:11:12 2019-03-04 14:06:13.913  INFO 14814 --- [main] faultConfiguringBeanFactoryPostProcessor : No bean named 'integrationHeaderChannelRegistry' has been explicitly defined. Therefore, a default DefaultHeaderChannelRegistry will be created.
04-Mar-2019 14:11:12 2019-03-04 14:06:13.951  INFO 14814 --- [main] trationDelegate$BeanPostProcessorChecker : Bean 'org.springframework.kafka.annotation.KafkaBootstrapConfiguration' of type [org.springframework.kafka.annotation.KafkaBootstrapConfiguration$$EnhancerBySpringCGLIB$$2f8d1325] is not eligible for getting processed by all BeanPostProcessors (for example: not eligible for auto-proxying)
04-Mar-2019 14:11:12 2019-03-04 14:06:13.987  INFO 14814 --- [main] trationDelegate$BeanPostProcessorChecker : Bean 'org.springframework.ws.config.annotation.DelegatingWsConfiguration' of type [org.springframework.ws.config.annotation.DelegatingWsConfiguration$$EnhancerBySpringCGLIB$$72c6a1] is not eligible for getting processed by all BeanPostProcessors (for example: not eligible for auto-proxying)
04-Mar-2019 14:11:12 2019-03-04 14:06:14.054  INFO 14814 --- [main] .w.s.a.s.AnnotationActionEndpointMapping : Supporting [WS-Addressing August 2004, WS-Addressing 1.0]
04-Mar-2019 14:11:12 2019-03-04 14:06:14.074  INFO 14814 --- [main] trationDelegate$BeanPostProcessorChecker : Bean 'integrationDisposableAutoCreatedBeans' of type [org.springframework.integration.config.annotation.Disposables] is not eligible for getting processed by all BeanPostProcessors (for example: not eligible for auto-proxying)
04-Mar-2019 14:11:12 2019-03-04 14:06:14.135  INFO 14814 --- [main] trationDelegate$BeanPostProcessorChecker : Bean 'org.springframework.integration.config.IntegrationManagementConfiguration' of type [org.springframework.integration.config.IntegrationManagementConfiguration$$EnhancerBySpringCGLIB$$c6ccbcd1] is not eligible for getting processed by all BeanPostProcessors (for example: not eligible for auto-proxying)
04-Mar-2019 14:11:12 2019-03-04 14:06:14.142  INFO 14814 --- [main] trationDelegate$BeanPostProcessorChecker : Bean 'org.springframework.boot.autoconfigure.integration.IntegrationAutoConfiguration$IntegrationJmxConfiguration' of type [org.springframework.boot.autoconfigure.integration.IntegrationAutoConfiguration$IntegrationJmxConfiguration$$EnhancerBySpringCGLIB$$a25ec7f1] is not eligible for getting processed by all BeanPostProcessors (for example: not eligible for auto-proxying)
04-Mar-2019 14:11:12 2019-03-04 14:06:14.173  INFO 14814 --- [main] trationDelegate$BeanPostProcessorChecker : Bean 'org.springframework.boot.autoconfigure.jmx.JmxAutoConfiguration' of type [org.springframework.boot.autoconfigure.jmx.JmxAutoConfiguration$$EnhancerBySpringCGLIB$$db4670be] is not eligible for getting processed by all BeanPostProcessors (for example: not eligible for auto-proxying)
04-Mar-2019 14:11:12 2019-03-04 14:06:14.285  INFO 14814 --- [main] trationDelegate$BeanPostProcessorChecker : Bean 'mbeanServer' of type [com.sun.jmx.mbeanserver.JmxMBeanServer] is not eligible for getting processed by all BeanPostProcessors (for example: not eligible for auto-proxying)
04-Mar-2019 14:11:12 2019-03-04 14:06:14.312  INFO 14814 --- [main] trationDelegate$BeanPostProcessorChecker : Bean 'org.springframework.cloud.autoconfigure.ConfigurationPropertiesRebinderAutoConfiguration' of type [org.springframework.cloud.autoconfigure.ConfigurationPropertiesRebinderAutoConfiguration$$EnhancerBySpringCGLIB$$77f5049f] is not eligible for getting processed by all BeanPostProcessors (for example: not eligible for auto-proxying)
04-Mar-2019 14:11:12 2019-03-04 14:06:14.955  INFO 14814 --- [main] o.s.b.w.embedded.tomcat.TomcatWebServer  : Tomcat initialized with port(s): 25783 (http)
04-Mar-2019 14:11:12 2019-03-04 14:06:15.038  INFO 14814 --- [main] o.apache.catalina.core.StandardService   : Starting service [Tomcat]
04-Mar-2019 14:11:12 2019-03-04 14:06:15.039  INFO 14814 --- [main] org.apache.catalina.core.StandardEngine  : Starting Servlet engine: [Apache Tomcat/9.0.16]
04-Mar-2019 14:11:12 2019-03-04 14:06:15.063  INFO 14814 --- [main] o.a.catalina.core.AprLifecycleListener   : The APR based Apache Tomcat Native library which allows optimal performance in production environments was not found on the java.library.path: [/usr/java/packages/lib/amd64:/usr/lib64:/lib64:/lib:/usr/lib]
04-Mar-2019 14:11:12 2019-03-04 14:06:15.158  INFO 14814 --- [main] o.a.c.c.C.[Tomcat].[localhost].[/]       : Initializing Spring embedded WebApplicationContext
04-Mar-2019 14:11:12 2019-03-04 14:06:15.158  INFO 14814 --- [main] o.s.web.context.ContextLoader            : Root WebApplicationContext: initialization completed in 3275 ms
04-Mar-2019 14:11:12 2019-03-04 14:06:16.311  INFO 14814 --- [main] o.s.s.c.ThreadPoolTaskScheduler          : Initializing ExecutorService 'taskScheduler'
04-Mar-2019 14:11:12 2019-03-04 14:06:17.469  INFO 14814 --- [main] o.s.s.concurrent.ThreadPoolTaskExecutor  : Initializing ExecutorService 'applicationTaskExecutor'
04-Mar-2019 14:11:12 2019-03-04 14:06:18.310  INFO 14814 --- [main] .s.s.UserDetailsServiceAutoConfiguration :
04-Mar-2019 14:11:12
04-Mar-2019 14:11:12 Using generated security password: fefdd750-972e-454f-98ee-8c174399af52
04-Mar-2019 14:11:12
04-Mar-2019 14:11:12 2019-03-04 14:06:18.438  INFO 14814 --- [main] o.s.s.web.DefaultSecurityFilterChain     : Creating filter chain: Ant [pattern='/**'], []
04-Mar-2019 14:11:12 2019-03-04 14:06:18.534  INFO 14814 --- [main] o.s.s.web.DefaultSecurityFilterChain     : Creating filter chain: any request, [org.springframework.security.web.context.request.async.WebAsyncManagerIntegrationFilter@56f6d40b, org.springframework.security.web.context.SecurityContextPersistenceFilter@7bc10d84, org.springframework.security.web.header.HeaderWriterFilter@38be305c, org.springframework.security.web.csrf.CsrfFilter@6cbcf243, org.springframework.security.web.authentication.logout.LogoutFilter@31e75d13, org.springframework.security.web.authentication.UsernamePasswordAuthenticationFilter@15c25153, org.springframework.security.web.authentication.ui.DefaultLoginPageGeneratingFilter@33e01298, org.springframework.security.web.authentication.ui.DefaultLogoutPageGeneratingFilter@36676c1a, org.springframework.security.web.authentication.www.BasicAuthenticationFilter@56276db8, org.springframework.security.web.savedrequest.RequestCacheAwareFilter@40e10ff8, org.springframework.security.web.servletapi.SecurityContextHolderAwareRequestFilter@7e38a7fe, org.springframework.security.web.authentication.AnonymousAuthenticationFilter@5b408dc3, org.springframework.security.web.session.SessionManagementFilter@5ed731d0, org.springframework.security.web.access.ExceptionTranslationFilter@62435e70, org.springframework.security.web.access.intercept.FilterSecurityInterceptor@72445aba]
04-Mar-2019 14:11:12 2019-03-04 14:06:18.766  INFO 14814 --- [main] o.s.b.a.e.web.EndpointLinksResolver      : Exposing 21 endpoint(s) beneath base path '/actuator'
04-Mar-2019 14:11:12 2019-03-04 14:06:19.390  INFO 14814 --- [main] o.s.i.monitor.IntegrationMBeanExporter   : Registering MessageChannel input
04-Mar-2019 14:11:12 2019-03-04 14:06:19.510  INFO 14814 --- [main] o.s.i.monitor.IntegrationMBeanExporter   : Registering MessageChannel errorChannel
04-Mar-2019 14:11:12 2019-03-04 14:06:19.546  INFO 14814 --- [main] o.s.i.monitor.IntegrationMBeanExporter   : Registering MessageChannel nullChannel
04-Mar-2019 14:11:12 2019-03-04 14:06:19.563  INFO 14814 --- [main] o.s.i.monitor.IntegrationMBeanExporter   : Registering MessageHandler logSinkHandler
04-Mar-2019 14:11:12 2019-03-04 14:06:19.678  INFO 14814 --- [main] o.s.i.monitor.IntegrationMBeanExporter   : Registering MessageHandler org.springframework.cloud.stream.app.log.sink.LogSinkConfiguration.logSinkHandler.serviceActivator
04-Mar-2019 14:11:12 2019-03-04 14:06:19.733  INFO 14814 --- [main] o.s.i.monitor.IntegrationMBeanExporter   : Registering MessageHandler errorLogger
04-Mar-2019 14:11:12 2019-03-04 14:06:19.754  INFO 14814 --- [main] o.s.i.endpoint.EventDrivenConsumer       : Adding {logging-channel-adapter:_org.springframework.integration.errorLogger} as a subscriber to the 'errorChannel' channel
04-Mar-2019 14:11:12 2019-03-04 14:06:19.754  INFO 14814 --- [main] o.s.i.channel.PublishSubscribeChannel    : Channel 'application-1.errorChannel' has 1 subscriber(s).
04-Mar-2019 14:11:12 2019-03-04 14:06:19.754  INFO 14814 --- [main] o.s.i.endpoint.EventDrivenConsumer       : started _org.springframework.integration.errorLogger
04-Mar-2019 14:11:12 2019-03-04 14:06:19.754  INFO 14814 --- [main] o.s.i.endpoint.EventDrivenConsumer       : Adding {message-handler:org.springframework.cloud.stream.app.log.sink.LogSinkConfiguration.logSinkHandler.serviceActivator} as a subscriber to the 'input' channel
04-Mar-2019 14:11:12 2019-03-04 14:06:19.754  INFO 14814 --- [main] o.s.c.s.m.DirectWithAttributesChannel    : Channel 'application-1.input' has 1 subscriber(s).
04-Mar-2019 14:11:12 2019-03-04 14:06:19.754  INFO 14814 --- [main] o.s.i.endpoint.EventDrivenConsumer       : started org.springframework.cloud.stream.app.log.sink.LogSinkConfiguration.logSinkHandler.serviceActivator
04-Mar-2019 14:11:12 2019-03-04 14:06:19.846  INFO 14814 --- [main] c.c.c.ConfigServicePropertySourceLocator : Fetching config from server at : http://localhost:8888
04-Mar-2019 14:11:12 2019-03-04 14:06:19.851  INFO 14814 --- [main] c.c.c.ConfigServicePropertySourceLocator : Connect Timeout Exception on Url - http://localhost:8888. Will be trying the next url if available
04-Mar-2019 14:11:12 2019-03-04 14:06:19.851  WARN 14814 --- [main] c.c.c.ConfigServicePropertySourceLocator : Could not locate PropertySource: I/O error on GET request for "http://localhost:8888/log-sink/default": Connection refused (Connection refused); nested exception is java.net.ConnectException: Connection refused (Connection refused)
04-Mar-2019 14:11:12 2019-03-04 14:06:20.225  INFO 14814 --- [main] o.a.k.clients.admin.AdminClientConfig    : AdminClientConfig values:
04-Mar-2019 14:11:12         bootstrap.servers = [localhost:9092]
04-Mar-2019 14:11:12         client.id =
04-Mar-2019 14:11:12         connections.max.idle.ms = 300000
04-Mar-2019 14:11:12         metadata.max.age.ms = 300000
04-Mar-2019 14:11:12         metric.reporters = []
04-Mar-2019 14:11:12         metrics.num.samples = 2
04-Mar-2019 14:11:12         metrics.recording.level = INFO
04-Mar-2019 14:11:12         metrics.sample.window.ms = 30000
04-Mar-2019 14:11:12         receive.buffer.bytes = 65536
04-Mar-2019 14:11:12         reconnect.backoff.max.ms = 1000
04-Mar-2019 14:11:12         reconnect.backoff.ms = 50
04-Mar-2019 14:11:12         request.timeout.ms = 120000
04-Mar-2019 14:11:12         retries = 5
04-Mar-2019 14:11:12         retry.backoff.ms = 100
04-Mar-2019 14:11:12         sasl.client.callback.handler.class = null
04-Mar-2019 14:11:12         sasl.jaas.config = null
04-Mar-2019 14:11:12         sasl.kerberos.kinit.cmd = /usr/bin/kinit
04-Mar-2019 14:11:12         sasl.kerberos.min.time.before.relogin = 60000
04-Mar-2019 14:11:12         sasl.kerberos.service.name = null
04-Mar-2019 14:11:12         sasl.kerberos.ticket.renew.jitter = 0.05
04-Mar-2019 14:11:12         sasl.kerberos.ticket.renew.window.factor = 0.8
04-Mar-2019 14:11:12         sasl.login.callback.handler.class = null
04-Mar-2019 14:11:12         sasl.login.class = null
04-Mar-2019 14:11:12         sasl.login.refresh.buffer.seconds = 300
04-Mar-2019 14:11:12         sasl.login.refresh.min.period.seconds = 60
04-Mar-2019 14:11:12         sasl.login.refresh.window.factor = 0.8
04-Mar-2019 14:11:12         sasl.login.refresh.window.jitter = 0.05
04-Mar-2019 14:11:12         sasl.mechanism = GSSAPI
04-Mar-2019 14:11:12         security.protocol = PLAINTEXT
04-Mar-2019 14:11:12         send.buffer.bytes = 131072
04-Mar-2019 14:11:12         ssl.cipher.suites = null
04-Mar-2019 14:11:12         ssl.enabled.protocols = [TLSv1.2, TLSv1.1, TLSv1]
04-Mar-2019 14:11:12         ssl.endpoint.identification.algorithm = https
04-Mar-2019 14:11:12         ssl.key.password = null
04-Mar-2019 14:11:12         ssl.keymanager.algorithm = SunX509
04-Mar-2019 14:11:12         ssl.keystore.location = null
04-Mar-2019 14:11:12         ssl.keystore.password = null
04-Mar-2019 14:11:12         ssl.keystore.type = JKS
04-Mar-2019 14:11:12         ssl.protocol = TLS
04-Mar-2019 14:11:12         ssl.provider = null
04-Mar-2019 14:11:12         ssl.secure.random.implementation = null
04-Mar-2019 14:11:12         ssl.trustmanager.algorithm = PKIX
04-Mar-2019 14:11:12         ssl.truststore.location = null
04-Mar-2019 14:11:12         ssl.truststore.password = null
04-Mar-2019 14:11:12         ssl.truststore.type = JKS
04-Mar-2019 14:11:12
04-Mar-2019 14:11:12 2019-03-04 14:06:20.305  INFO 14814 --- [main] o.a.kafka.common.utils.AppInfoParser     : Kafka version : 2.0.1
04-Mar-2019 14:11:12 2019-03-04 14:06:20.306  INFO 14814 --- [main] o.a.kafka.common.utils.AppInfoParser     : Kafka commitId : fa14705e51bd2ce5
04-Mar-2019 14:11:12 2019-03-04 14:06:20.590  INFO 14814 --- [main] o.a.k.clients.consumer.ConsumerConfig    : ConsumerConfig values:
04-Mar-2019 14:11:12         auto.commit.interval.ms = 100
04-Mar-2019 14:11:12         auto.offset.reset = earliest
04-Mar-2019 14:11:12         bootstrap.servers = [localhost:9092]
04-Mar-2019 14:11:12         check.crcs = true
04-Mar-2019 14:11:12         client.id =
04-Mar-2019 14:11:12         connections.max.idle.ms = 540000
04-Mar-2019 14:11:12         default.api.timeout.ms = 60000
04-Mar-2019 14:11:12         enable.auto.commit = false
04-Mar-2019 14:11:12         exclude.internal.topics = true
04-Mar-2019 14:11:12         fetch.max.bytes = 52428800
04-Mar-2019 14:11:12         fetch.max.wait.ms = 500
04-Mar-2019 14:11:12         fetch.min.bytes = 1
04-Mar-2019 14:11:12         group.id = DIRECTED-GRAPH-DESTINATION1
04-Mar-2019 14:11:12         heartbeat.interval.ms = 3000
04-Mar-2019 14:11:12         interceptor.classes = []
04-Mar-2019 14:11:12         internal.leave.group.on.close = true
04-Mar-2019 14:11:12         isolation.level = read_uncommitted
04-Mar-2019 14:11:12         key.deserializer = class org.apache.kafka.common.serialization.ByteArrayDeserializer
04-Mar-2019 14:11:12         max.partition.fetch.bytes = 1048576
04-Mar-2019 14:11:12         max.poll.interval.ms = 300000
04-Mar-2019 14:11:12         max.poll.records = 500
04-Mar-2019 14:11:12         metadata.max.age.ms = 300000
04-Mar-2019 14:11:12         metric.reporters = []
04-Mar-2019 14:11:12         metrics.num.samples = 2
04-Mar-2019 14:11:12         metrics.recording.level = INFO
04-Mar-2019 14:11:12         metrics.sample.window.ms = 30000
04-Mar-2019 14:11:12         partition.assignment.strategy = [class org.apache.kafka.clients.consumer.RangeAssignor]
04-Mar-2019 14:11:12         receive.buffer.bytes = 65536
04-Mar-2019 14:11:12         reconnect.backoff.max.ms = 1000
04-Mar-2019 14:11:12         reconnect.backoff.ms = 50
04-Mar-2019 14:11:12         request.timeout.ms = 30000
04-Mar-2019 14:11:12         retry.backoff.ms = 100
04-Mar-2019 14:11:12         sasl.client.callback.handler.class = null
04-Mar-2019 14:11:12         sasl.jaas.config = null
04-Mar-2019 14:11:12         sasl.kerberos.kinit.cmd = /usr/bin/kinit
04-Mar-2019 14:11:12         sasl.kerberos.min.time.before.relogin = 60000
04-Mar-2019 14:11:12         sasl.kerberos.service.name = null
04-Mar-2019 14:11:12         sasl.kerberos.ticket.renew.jitter = 0.05
04-Mar-2019 14:11:12         sasl.kerberos.ticket.renew.window.factor = 0.8
04-Mar-2019 14:11:12         sasl.login.callback.handler.class = null
04-Mar-2019 14:11:12         sasl.login.class = null
04-Mar-2019 14:11:12         sasl.login.refresh.buffer.seconds = 300
04-Mar-2019 14:11:12         sasl.login.refresh.min.period.seconds = 60
04-Mar-2019 14:11:12         sasl.login.refresh.window.factor = 0.8
04-Mar-2019 14:11:12         sasl.login.refresh.window.jitter = 0.05
04-Mar-2019 14:11:12         sasl.mechanism = GSSAPI
04-Mar-2019 14:11:12         security.protocol = PLAINTEXT
04-Mar-2019 14:11:12         send.buffer.bytes = 131072
04-Mar-2019 14:11:12         session.timeout.ms = 10000
04-Mar-2019 14:11:12         ssl.cipher.suites = null
04-Mar-2019 14:11:12         ssl.enabled.protocols = [TLSv1.2, TLSv1.1, TLSv1]
04-Mar-2019 14:11:12         ssl.endpoint.identification.algorithm = https
04-Mar-2019 14:11:12         ssl.key.password = null
04-Mar-2019 14:11:12         ssl.keymanager.algorithm = SunX509
04-Mar-2019 14:11:12         ssl.keystore.location = null
04-Mar-2019 14:11:12         ssl.keystore.password = null
04-Mar-2019 14:11:12         ssl.keystore.type = JKS
04-Mar-2019 14:11:12         ssl.protocol = TLS
04-Mar-2019 14:11:12         ssl.provider = null
04-Mar-2019 14:11:12         ssl.secure.random.implementation = null
04-Mar-2019 14:11:12         ssl.trustmanager.algorithm = PKIX
04-Mar-2019 14:11:12         ssl.truststore.location = null
04-Mar-2019 14:11:12         ssl.truststore.password = null
04-Mar-2019 14:11:12         ssl.truststore.type = JKS
04-Mar-2019 14:11:12         value.deserializer = class org.apache.kafka.common.serialization.ByteArrayDeserializer
04-Mar-2019 14:11:12
04-Mar-2019 14:11:12 2019-03-04 14:06:20.655  INFO 14814 --- [main] o.a.kafka.common.utils.AppInfoParser     : Kafka version : 2.0.1
04-Mar-2019 14:11:12 2019-03-04 14:06:20.655  INFO 14814 --- [main] o.a.kafka.common.utils.AppInfoParser     : Kafka commitId : fa14705e51bd2ce5
04-Mar-2019 14:11:12 2019-03-04 14:06:20.661  INFO 14814 --- [main] org.apache.kafka.clients.Metadata        : Cluster ID: WuPEq2LhTj-_J_X5QkcfSA
04-Mar-2019 14:11:12 2019-03-04 14:06:20.694  INFO 14814 --- [main] o.s.i.monitor.IntegrationMBeanExporter   : Registering MessageChannel DIRECTED-GRAPH-DESTINATION1.transform.DIRECTED-GRAPH-DESTINATION1.errors
04-Mar-2019 14:11:12 2019-03-04 14:06:20.780  INFO 14814 --- [main] o.s.c.stream.binder.BinderErrorChannel   : Channel 'application-1.DIRECTED-GRAPH-DESTINATION1.transform.DIRECTED-GRAPH-DESTINATION1.errors' has 1 subscriber(s).
04-Mar-2019 14:11:12 2019-03-04 14:06:20.781  INFO 14814 --- [main] o.s.c.stream.binder.BinderErrorChannel   : Channel 'application-1.DIRECTED-GRAPH-DESTINATION1.transform.DIRECTED-GRAPH-DESTINATION1.errors' has 0 subscriber(s).
04-Mar-2019 14:11:12 2019-03-04 14:06:20.781  INFO 14814 --- [main] o.s.c.stream.binder.BinderErrorChannel   : Channel 'application-1.DIRECTED-GRAPH-DESTINATION1.transform.DIRECTED-GRAPH-DESTINATION1.errors' has 1 subscriber(s).
04-Mar-2019 14:11:12 2019-03-04 14:06:20.781  INFO 14814 --- [main] o.s.c.stream.binder.BinderErrorChannel   : Channel 'application-1.DIRECTED-GRAPH-DESTINATION1.transform.DIRECTED-GRAPH-DESTINATION1.errors' has 2 subscriber(s).
04-Mar-2019 14:11:12 2019-03-04 14:06:20.787  INFO 14814 --- [main] o.a.k.clients.consumer.ConsumerConfig    : ConsumerConfig values:
04-Mar-2019 14:11:12         auto.commit.interval.ms = 100
04-Mar-2019 14:11:12         auto.offset.reset = earliest
04-Mar-2019 14:11:12         bootstrap.servers = [localhost:9092]
04-Mar-2019 14:11:12         check.crcs = true
04-Mar-2019 14:11:12         client.id =
04-Mar-2019 14:11:12         connections.max.idle.ms = 540000
04-Mar-2019 14:11:12         default.api.timeout.ms = 60000
04-Mar-2019 14:11:12         enable.auto.commit = false
04-Mar-2019 14:11:12         exclude.internal.topics = true
04-Mar-2019 14:11:12         fetch.max.bytes = 52428800
04-Mar-2019 14:11:12         fetch.max.wait.ms = 500
04-Mar-2019 14:11:12         fetch.min.bytes = 1
04-Mar-2019 14:11:12         group.id = DIRECTED-GRAPH-DESTINATION1
04-Mar-2019 14:11:12         heartbeat.interval.ms = 3000
04-Mar-2019 14:11:12         interceptor.classes = []
04-Mar-2019 14:11:12         internal.leave.group.on.close = true
04-Mar-2019 14:11:12         isolation.level = read_uncommitted
04-Mar-2019 14:11:12         key.deserializer = class org.apache.kafka.common.serialization.ByteArrayDeserializer
04-Mar-2019 14:11:12         max.partition.fetch.bytes = 1048576
04-Mar-2019 14:11:12         max.poll.interval.ms = 300000
04-Mar-2019 14:11:12         max.poll.records = 500
04-Mar-2019 14:11:12         metadata.max.age.ms = 300000
04-Mar-2019 14:11:12         metric.reporters = []
04-Mar-2019 14:11:12         metrics.num.samples = 2
04-Mar-2019 14:11:12         metrics.recording.level = INFO
04-Mar-2019 14:11:12         metrics.sample.window.ms = 30000
04-Mar-2019 14:11:12         partition.assignment.strategy = [class org.apache.kafka.clients.consumer.RangeAssignor]
04-Mar-2019 14:11:12         receive.buffer.bytes = 65536
04-Mar-2019 14:11:12         reconnect.backoff.max.ms = 1000
04-Mar-2019 14:11:12         reconnect.backoff.ms = 50
04-Mar-2019 14:11:12         request.timeout.ms = 30000
04-Mar-2019 14:11:12         retry.backoff.ms = 100
04-Mar-2019 14:11:12         sasl.client.callback.handler.class = null
04-Mar-2019 14:11:12         sasl.jaas.config = null
04-Mar-2019 14:11:12         sasl.kerberos.kinit.cmd = /usr/bin/kinit
04-Mar-2019 14:11:12         sasl.kerberos.min.time.before.relogin = 60000
04-Mar-2019 14:11:12         sasl.kerberos.service.name = null
04-Mar-2019 14:11:12         sasl.kerberos.ticket.renew.jitter = 0.05
04-Mar-2019 14:11:12         sasl.kerberos.ticket.renew.window.factor = 0.8
04-Mar-2019 14:11:12         sasl.login.callback.handler.class = null
04-Mar-2019 14:11:12         sasl.login.class = null
04-Mar-2019 14:11:12         sasl.login.refresh.buffer.seconds = 300
04-Mar-2019 14:11:12         sasl.login.refresh.min.period.seconds = 60
04-Mar-2019 14:11:12         sasl.login.refresh.window.factor = 0.8
04-Mar-2019 14:11:12         sasl.login.refresh.window.jitter = 0.05
04-Mar-2019 14:11:12         sasl.mechanism = GSSAPI
04-Mar-2019 14:11:12         security.protocol = PLAINTEXT
04-Mar-2019 14:11:12         send.buffer.bytes = 131072
04-Mar-2019 14:11:12         session.timeout.ms = 10000
04-Mar-2019 14:11:12         ssl.cipher.suites = null
04-Mar-2019 14:11:12         ssl.enabled.protocols = [TLSv1.2, TLSv1.1, TLSv1]
04-Mar-2019 14:11:12         ssl.endpoint.identification.algorithm = https
04-Mar-2019 14:11:12         ssl.key.password = null
04-Mar-2019 14:11:12         ssl.keymanager.algorithm = SunX509
04-Mar-2019 14:11:12         ssl.keystore.location = null
04-Mar-2019 14:11:12         ssl.keystore.password = null
04-Mar-2019 14:11:12         ssl.keystore.type = JKS
04-Mar-2019 14:11:12         ssl.protocol = TLS
04-Mar-2019 14:11:12         ssl.provider = null
04-Mar-2019 14:11:12         ssl.secure.random.implementation = null
04-Mar-2019 14:11:12         ssl.trustmanager.algorithm = PKIX
04-Mar-2019 14:11:12         ssl.truststore.location = null
04-Mar-2019 14:11:12         ssl.truststore.password = null
04-Mar-2019 14:11:12         ssl.truststore.type = JKS
04-Mar-2019 14:11:12         value.deserializer = class org.apache.kafka.common.serialization.ByteArrayDeserializer
04-Mar-2019 14:11:12
04-Mar-2019 14:11:12 2019-03-04 14:06:20.800  INFO 14814 --- [main] o.a.kafka.common.utils.AppInfoParser     : Kafka version : 2.0.1
04-Mar-2019 14:11:12 2019-03-04 14:06:20.800  INFO 14814 --- [main] o.a.kafka.common.utils.AppInfoParser     : Kafka commitId : fa14705e51bd2ce5
04-Mar-2019 14:11:12 2019-03-04 14:06:20.803  INFO 14814 --- [main] org.apache.kafka.clients.Metadata        : Cluster ID: WuPEq2LhTj-_J_X5QkcfSA
04-Mar-2019 14:11:12 2019-03-04 14:06:20.818  INFO 14814 --- [main] o.a.k.clients.consumer.ConsumerConfig    : ConsumerConfig values:
04-Mar-2019 14:11:12         auto.commit.interval.ms = 100
04-Mar-2019 14:11:12         auto.offset.reset = earliest
04-Mar-2019 14:11:12         bootstrap.servers = [localhost:9092]
04-Mar-2019 14:11:12         check.crcs = true
04-Mar-2019 14:11:12         client.id =
04-Mar-2019 14:11:12         connections.max.idle.ms = 540000
04-Mar-2019 14:11:12         default.api.timeout.ms = 60000
04-Mar-2019 14:11:12         enable.auto.commit = false
04-Mar-2019 14:11:12         exclude.internal.topics = true
04-Mar-2019 14:11:12         fetch.max.bytes = 52428800
04-Mar-2019 14:11:12         fetch.max.wait.ms = 500
04-Mar-2019 14:11:12         fetch.min.bytes = 1
04-Mar-2019 14:11:12         group.id = DIRECTED-GRAPH-DESTINATION1
04-Mar-2019 14:11:12         heartbeat.interval.ms = 3000
04-Mar-2019 14:11:12         interceptor.classes = []
04-Mar-2019 14:11:12         internal.leave.group.on.close = true
04-Mar-2019 14:11:12         isolation.level = read_uncommitted
04-Mar-2019 14:11:12         key.deserializer = class org.apache.kafka.common.serialization.ByteArrayDeserializer
04-Mar-2019 14:11:12         max.partition.fetch.bytes = 1048576
04-Mar-2019 14:11:12         max.poll.interval.ms = 300000
04-Mar-2019 14:11:12         max.poll.records = 500
04-Mar-2019 14:11:12         metadata.max.age.ms = 300000
04-Mar-2019 14:11:12         metric.reporters = []
04-Mar-2019 14:11:12         metrics.num.samples = 2
04-Mar-2019 14:11:12         metrics.recording.level = INFO
04-Mar-2019 14:11:12         metrics.sample.window.ms = 30000
04-Mar-2019 14:11:12         partition.assignment.strategy = [class org.apache.kafka.clients.consumer.RangeAssignor]
04-Mar-2019 14:11:12         receive.buffer.bytes = 65536
04-Mar-2019 14:11:12         reconnect.backoff.max.ms = 1000
04-Mar-2019 14:11:12         reconnect.backoff.ms = 50
04-Mar-2019 14:11:12         request.timeout.ms = 30000
04-Mar-2019 14:11:12         retry.backoff.ms = 100
04-Mar-2019 14:11:12         sasl.client.callback.handler.class = null
04-Mar-2019 14:11:12         sasl.jaas.config = null
04-Mar-2019 14:11:12         sasl.kerberos.kinit.cmd = /usr/bin/kinit
04-Mar-2019 14:11:12         sasl.kerberos.min.time.before.relogin = 60000
04-Mar-2019 14:11:12         sasl.kerberos.service.name = null
04-Mar-2019 14:11:12         sasl.kerberos.ticket.renew.jitter = 0.05
04-Mar-2019 14:11:12         sasl.kerberos.ticket.renew.window.factor = 0.8
04-Mar-2019 14:11:12         sasl.login.callback.handler.class = null
04-Mar-2019 14:11:12         sasl.login.class = null
04-Mar-2019 14:11:12         sasl.login.refresh.buffer.seconds = 300
04-Mar-2019 14:11:12         sasl.login.refresh.min.period.seconds = 60
04-Mar-2019 14:11:12         sasl.login.refresh.window.factor = 0.8
04-Mar-2019 14:11:12         sasl.login.refresh.window.jitter = 0.05
04-Mar-2019 14:11:12         sasl.mechanism = GSSAPI
04-Mar-2019 14:11:12         security.protocol = PLAINTEXT
04-Mar-2019 14:11:12         send.buffer.bytes = 131072
04-Mar-2019 14:11:12         session.timeout.ms = 10000
04-Mar-2019 14:11:12         ssl.cipher.suites = null
04-Mar-2019 14:11:12         ssl.enabled.protocols = [TLSv1.2, TLSv1.1, TLSv1]
04-Mar-2019 14:11:12         ssl.endpoint.identification.algorithm = https
04-Mar-2019 14:11:12         ssl.key.password = null
04-Mar-2019 14:11:12         ssl.keymanager.algorithm = SunX509
04-Mar-2019 14:11:12         ssl.keystore.location = null
04-Mar-2019 14:11:12         ssl.keystore.password = null
04-Mar-2019 14:11:12         ssl.keystore.type = JKS
04-Mar-2019 14:11:12         ssl.protocol = TLS
04-Mar-2019 14:11:12         ssl.provider = null
04-Mar-2019 14:11:12         ssl.secure.random.implementation = null
04-Mar-2019 14:11:12         ssl.trustmanager.algorithm = PKIX
04-Mar-2019 14:11:12         ssl.truststore.location = null
04-Mar-2019 14:11:12         ssl.truststore.password = null
04-Mar-2019 14:11:12         ssl.truststore.type = JKS
04-Mar-2019 14:11:12         value.deserializer = class org.apache.kafka.common.serialization.ByteArrayDeserializer
04-Mar-2019 14:11:12
04-Mar-2019 14:11:12 2019-03-04 14:06:20.852  INFO 14814 --- [main] o.a.kafka.common.utils.AppInfoParser     : Kafka version : 2.0.1
04-Mar-2019 14:11:12 2019-03-04 14:06:20.852  INFO 14814 --- [main] o.a.kafka.common.utils.AppInfoParser     : Kafka commitId : fa14705e51bd2ce5
04-Mar-2019 14:11:12 2019-03-04 14:06:20.855  INFO 14814 --- [main] o.s.s.c.ThreadPoolTaskScheduler          : Initializing ExecutorService
04-Mar-2019 14:11:12 2019-03-04 14:06:20.866  INFO 14814 --- [main] s.i.k.i.KafkaMessageDrivenChannelAdapter : started org.springframework.integration.kafka.inbound.KafkaMessageDrivenChannelAdapter@7646731d
04-Mar-2019 14:11:12 2019-03-04 14:06:20.891  INFO 14814 --- [[Ljava.lang.String;@13006998.container-0-C-1] org.apache.kafka.clients.Metadata        : Cluster ID: WuPEq2LhTj-_J_X5QkcfSA
04-Mar-2019 14:11:12 2019-03-04 14:06:20.911  INFO 14814 --- [[Ljava.lang.String;@13006998.container-0-C-1] o.a.k.c.c.internals.AbstractCoordinator  : [Consumer clientId=consumer-3, groupId=DIRECTED-GRAPH-DESTINATION1] Discovered group coordinator localhost:9092 (id: 2147482646 rack: null)
04-Mar-2019 14:11:12 2019-03-04 14:06:20.920  INFO 14814 --- [[Ljava.lang.String;@13006998.container-0-C-1] o.a.k.c.c.internals.ConsumerCoordinator  : [Consumer clientId=consumer-3, groupId=DIRECTED-GRAPH-DESTINATION1] Revoking previously assigned partitions []
04-Mar-2019 14:11:12 2019-03-04 14:06:20.920  INFO 14814 --- [[Ljava.lang.String;@13006998.container-0-C-1] o.s.c.s.b.k.KafkaMessageChannelBinder$1  : partitions revoked: []
04-Mar-2019 14:11:12 2019-03-04 14:06:20.920  INFO 14814 --- [[Ljava.lang.String;@13006998.container-0-C-1] o.a.k.c.c.internals.AbstractCoordinator  : [Consumer clientId=consumer-3, groupId=DIRECTED-GRAPH-DESTINATION1] (Re-)joining group
04-Mar-2019 14:11:12 2019-03-04 14:06:20.939  INFO 14814 --- [main] o.s.b.w.embedded.tomcat.TomcatWebServer  : Tomcat started on port(s): 25783 (http) with context path ''
04-Mar-2019 14:11:12 2019-03-04 14:06:20.941  INFO 14814 --- [main] o.s.c.s.a.l.s.k.LogSinkKafkaApplication  : Started LogSinkKafkaApplication in 11.934 seconds (JVM running for 12.649)
04-Mar-2019 14:11:12 2019-03-04 14:06:23.520  INFO 14814 --- [[Ljava.lang.String;@13006998.container-0-C-1] o.a.k.c.c.internals.AbstractCoordinator  : [Consumer clientId=consumer-3, groupId=DIRECTED-GRAPH-DESTINATION1] Successfully joined group with generation 2
04-Mar-2019 14:11:12 2019-03-04 14:06:23.523  INFO 14814 --- [[Ljava.lang.String;@13006998.container-0-C-1] o.a.k.c.c.internals.ConsumerCoordinator  : [Consumer clientId=consumer-3, groupId=DIRECTED-GRAPH-DESTINATION1] Setting newly assigned partitions [DIRECTED-GRAPH-DESTINATION1.transform-0]
04-Mar-2019 14:11:12 2019-03-04 14:06:23.532  INFO 14814 --- [[Ljava.lang.String;@13006998.container-0-C-1] o.a.k.c.consumer.internals.Fetcher       : [Consumer clientId=consumer-3, groupId=DIRECTED-GRAPH-DESTINATION1] Resetting offset for partition DIRECTED-GRAPH-DESTINATION1.transform-0 to offset 0.
04-Mar-2019 14:11:12 2019-03-04 14:06:23.535  INFO 14814 --- [[Ljava.lang.String;@13006998.container-0-C-1] o.s.c.s.b.k.KafkaMessageChannelBinder$1  : partitions assigned: [DIRECTED-GRAPH-DESTINATION1.transform-0]
04-Mar-2019 14:11:12 2019-03-04 14:06:48.471  INFO 14814 --- [http-nio-25783-exec-3] o.a.c.c.C.[Tomcat].[localhost].[/]       : Initializing Spring DispatcherServlet 'dispatcherServlet'
04-Mar-2019 14:11:12 2019-03-04 14:06:48.471  INFO 14814 --- [http-nio-25783-exec-3] o.s.web.servlet.DispatcherServlet        : Initializing Servlet 'dispatcherServlet'
04-Mar-2019 14:11:12 2019-03-04 14:06:48.494  INFO 14814 --- [http-nio-25783-exec-3] o.s.web.servlet.DispatcherServlet        : Completed initialization in 23 ms
04-Mar-2019 14:11:12
04-Mar-2019 14:11:12 2019-03-04 14:11:12.979 ERROR 12337 --- [           main] o.s.c.d.a.test.NamedChannelTests         : </logFile> ================
04-Mar-2019 14:11:12
04-Mar-2019 14:11:12 2019-03-04 14:11:12.982 ERROR 12337 --- [           main] junit.logTestName                        : !!! Test directedGraphTest(org.springframework.cloud.dataflow.acceptance.test.NamedChannelTests) Failed !!!
04-Mar-2019 14:11:12
04-Mar-2019 14:11:12 java.lang.AssertionError: No output found
04-Mar-2019 14:11:12         at org.junit.Assert.fail(Assert.java:88)
04-Mar-2019 14:11:12         at org.junit.Assert.assertTrue(Assert.java:41)
04-Mar-2019 14:11:12         at org.springframework.cloud.dataflow.acceptance.test.NamedChannelTests.directedGraphTest(NamedChannelTests.java:80)
04-Mar-2019 14:11:12         at sun.reflect.NativeMethodAccessorImpl.invoke0(Native Method)
04-Mar-2019 14:11:12         at sun.reflect.NativeMethodAccessorImpl.invoke(NativeMethodAccessorImpl.java:62)
04-Mar-2019 14:11:12         at sun.reflect.DelegatingMethodAccessorImpl.invoke(DelegatingMethodAccessorImpl.java:43)
04-Mar-2019 14:11:12         at java.lang.reflect.Method.invoke(Method.java:498)
04-Mar-2019 14:11:12         at org.junit.runners.model.FrameworkMethod$1.runReflectiveCall(FrameworkMethod.java:50)
04-Mar-2019 14:11:12         at org.junit.internal.runners.model.ReflectiveCallable.run(ReflectiveCallable.java:12)
04-Mar-2019 14:11:12         at org.junit.runners.model.FrameworkMethod.invokeExplosively(FrameworkMethod.java:47)
04-Mar-2019 14:11:12         at org.junit.internal.runners.statements.InvokeMethod.evaluate(InvokeMethod.java:17)
04-Mar-2019 14:11:12         at org.junit.internal.runners.statements.RunBefores.evaluate(RunBefores.java:26)
04-Mar-2019 14:11:12         at org.springframework.test.context.junit4.statements.RunBeforeTestMethodCallbacks.evaluate(RunBeforeTestMethodCallbacks.java:75)
04-Mar-2019 14:11:12         at org.springframework.test.context.junit4.statements.RunAfterTestMethodCallbacks.evaluate(RunAfterTestMethodCallbacks.java:86)
04-Mar-2019 14:11:12         at org.junit.rules.TestWatcher$1.evaluate(TestWatcher.java:55)
04-Mar-2019 14:11:12         at org.junit.rules.ExternalResource$1.evaluate(ExternalResource.java:48)
04-Mar-2019 14:11:12         at org.junit.rules.RunRules.evaluate(RunRules.java:20)
04-Mar-2019 14:11:12         at org.springframework.test.context.junit4.statements.SpringRepeat.evaluate(SpringRepeat.java:84)
04-Mar-2019 14:11:12         at org.junit.runners.ParentRunner.runLeaf(ParentRunner.java:325)
04-Mar-2019 14:11:12         at org.springframework.test.context.junit4.SpringJUnit4ClassRunner.runChild(SpringJUnit4ClassRunner.java:252)
04-Mar-2019 14:11:12         at org.springframework.test.context.junit4.SpringJUnit4ClassRunner.runChild(SpringJUnit4ClassRunner.java:94)
04-Mar-2019 14:11:12         at org.junit.runners.ParentRunner$3.run(ParentRunner.java:290)
04-Mar-2019 14:11:12         at org.junit.runners.ParentRunner$1.schedule(ParentRunner.java:71)
04-Mar-2019 14:11:12         at org.junit.runners.ParentRunner.runChildren(ParentRunner.java:288)
04-Mar-2019 14:11:12         at org.junit.runners.ParentRunner.access$000(ParentRunner.java:58)
04-Mar-2019 14:11:12         at org.junit.runners.ParentRunner$2.evaluate(ParentRunner.java:268)
04-Mar-2019 14:11:12         at org.springframework.test.context.junit4.statements.RunBeforeTestClassCallbacks.evaluate(RunBeforeTestClassCallbacks.java:61)
04-Mar-2019 14:11:12         at org.springframework.test.context.junit4.statements.RunAfterTestClassCallbacks.evaluate(RunAfterTestClassCallbacks.java:70)
04-Mar-2019 14:11:12         at org.junit.runners.ParentRunner.run(ParentRunner.java:363)
04-Mar-2019 14:11:12         at org.springframework.test.context.junit4.SpringJUnit4ClassRunner.run(SpringJUnit4ClassRunner.java:191)
04-Mar-2019 14:11:12         at org.apache.maven.surefire.junit4.JUnit4Provider.execute(JUnit4Provider.java:283)
04-Mar-2019 14:11:12         at org.apache.maven.surefire.junit4.JUnit4Provider.executeWithRerun(JUnit4Provider.java:173)
04-Mar-2019 14:11:12         at org.apache.maven.surefire.junit4.JUnit4Provider.executeTestSet(JUnit4Provider.java:153)
04-Mar-2019 14:11:12         at org.apache.maven.surefire.junit4.JUnit4Provider.invoke(JUnit4Provider.java:128)
04-Mar-2019 14:11:12         at org.apache.maven.surefire.booter.ForkedBooter.invokeProviderInSameClassLoader(ForkedBooter.java:203)
04-Mar-2019 14:11:12         at org.apache.maven.surefire.booter.ForkedBooter.runSuitesInProcess(ForkedBooter.java:155)
04-Mar-2019 14:11:12         at org.apache.maven.surefire.booter.ForkedBooter.main(ForkedBooter.java:103)
04-Mar-2019 14:11:12
04-Mar-2019 14:11:12 2019-03-04 14:11:12.982  INFO 12337 --- [           main] junit.logTestName                        : Finished Test directedGraphTest(org.springframework.cloud.dataflow.acceptance.test.NamedChannelTests)
04-Mar-2019 14:11:12 2019-03-04 14:11:12.982  INFO 12337 --- [           main] o.s.c.d.a.test.NamedChannelTests         : Destroy all streams
04-Mar-2019 14:11:14 Tests run: 4, Failures: 1, Errors: 0, Skipped: 0, Time elapsed: 582.638 sec <<< FAILURE! - in org.springframework.cloud.dataflow.acceptance.test.NamedChannelTests
04-Mar-2019 14:11:14 directedGraphTest(org.springframework.cloud.dataflow.acceptance.test.NamedChannelTests)  Time elapsed: 306.514 sec  <<< FAILURE!
04-Mar-2019 14:11:14 java.lang.AssertionError: No output found
04-Mar-2019 14:11:14         at org.junit.Assert.fail(Assert.java:88)
04-Mar-2019 14:11:14         at org.junit.Assert.assertTrue(Assert.java:41)
04-Mar-2019 14:11:14         at org.springframework.cloud.dataflow.acceptance.test.NamedChannelTests.directedGraphTest(NamedChannelTests.java:80)
04-Mar-2019 14:11:14
04-Mar-2019 14:11:14 Running org.springframework.cloud.dataflow.acceptance.test.util.PlatformHelperTests
04-Mar-2019 14:11:14 Tests run: 3, Failures: 0, Errors: 0, Skipped: 0, Time elapsed: 0.04 sec - in org.springframework.cloud.dataflow.acceptance.test.util.PlatformHelperTests
04-Mar-2019 14:11:14 Running org.springframework.cloud.dataflow.acceptance.test.util.ApplicationTests
04-Mar-2019 14:11:14 Tests run: 2, Failures: 0, Errors: 0, Skipped: 0, Time elapsed: 0 sec - in org.springframework.cloud.dataflow.acceptance.test.util.ApplicationTests
04-Mar-2019 14:11:14 2019-03-04 14:11:14.530  INFO 12337 --- [       Thread-6] o.s.c.support.GenericApplicationContext  : Closing org.springframework.context.support.GenericApplicationContext@feb98ef: startup date [Mon Mar 04 13:56:37 UTC 2019]; root of context hierarchy
04-Mar-2019 14:11:14
04-Mar-2019 14:11:14 Results :
04-Mar-2019 14:11:14
04-Mar-2019 14:11:14 Failed tests:
04-Mar-2019 14:11:14   NamedChannelTests.directedGraphTest:80 No output found
04-Mar-2019 14:11:14
04-Mar-2019 14:11:14 Tests run: 19, Failures: 1, Errors: 0, Skipped: 3
04-Mar-2019 14:11:14
04-Mar-2019 14:11:14 [INFO] ------------------------------------------------------------------------
04-Mar-2019 14:11:14 [INFO] BUILD FAILURE
04-Mar-2019 14:11:14 [INFO] ------------------------------------------------------------------------
04-Mar-2019 14:11:14 [INFO] Total time: 17:27 min
04-Mar-2019 14:11:14 [INFO] Finished at: 2019-03-04T14:11:14+00:00
04-Mar-2019 14:11:14 [INFO] Final Memory: 52M/464M
04-Mar-2019 14:11:14 [INFO] ------------------------------------------------------------------------
04-Mar-2019 14:11:14 [ERROR] Failed to execute goal org.apache.maven.plugins:maven-surefire-plugin:2.18.1:test (default-test) on project spring-cloud-dataflow-acceptance-tests: There are test failures.
04-Mar-2019 14:11:14 [ERROR]
04-Mar-2019 14:11:14 [ERROR] Please refer to /opt/bamboo-home/xml-data/build-dir/SCDT-LOCAL20XSKIPPER20X-KAFKA/target/surefire-reports for the individual test results.
04-Mar-2019 14:11:14 [ERROR] -> [Help 1]
04-Mar-2019 14:11:14 [ERROR]
04-Mar-2019 14:11:14 [ERROR] To see the full stack trace of the errors, re-run Maven with the -e switch.
04-Mar-2019 14:11:14 [ERROR] Re-run Maven using the -X switch to enable full debug logging.
04-Mar-2019 14:11:14 [ERROR]
04-Mar-2019 14:11:14 [ERROR] For more information about the errors and possible solutions, please read the following articles:
04-Mar-2019 14:11:14 [ERROR] [Help 1] http://cwiki.apache.org/confluence/display/MAVEN/MojoFailureException
04-Mar-2019 14:11:14 Clean up, clean up, everybody everywhere; clean up clean up, everybody do your share!
04-Mar-2019 14:11:14 Killing process PID [12229]
04-Mar-2019 14:11:14 Killing process PID [12089]
04-Mar-2019 14:11:15 No stopped containers
04-Mar-2019 14:11:15 Stopping mysql_mysql_1 ...
04-Mar-2019 14:11:17
04-Mar-2019 14:11:17 Stopping mysql_mysql_1 ... done
04-Mar-2019 14:11:17 Removing mysql_mysql_1 ...
04-Mar-2019 14:11:17
04-Mar-2019 14:11:17 Removing mysql_mysql_1 ... done
04-Mar-2019 14:11:17 Going to remove mysql_mysql_1
04-Mar-2019 14:11:17 Stopping kafka_kafka_1 ...
04-Mar-2019 14:11:17 Stopping kafka_zookeeper_1 ...
04-Mar-2019 14:11:20
04-Mar-2019 14:11:20 Stopping kafka_kafka_1 ... done
04-Mar-2019 14:11:28
04-Mar-2019 14:11:28 Stopping kafka_zookeeper_1 ... done
04-Mar-2019 14:11:28 Removing kafka_kafka_1 ...
04-Mar-2019 14:11:28 Removing kafka_zookeeper_1 ...
04-Mar-2019 14:11:28
04-Mar-2019 14:11:28 Removing kafka_kafka_1 ... done
04-Mar-2019 14:11:28
04-Mar-2019 14:11:28 Removing kafka_zookeeper_1 ... done
04-Mar-2019 14:11:28 Going to remove kafka_kafka_1, kafka_zookeeper_1
04-Mar-2019 14:11:28
04-Mar-2019 14:11:28 Finished task 'Execute Acceptance Tests' with result: Success
04-Mar-2019 14:11:28 Starting task 'JUnit Parser' of type 'com.atlassian.bamboo.plugins.testresultparser:task.testresultparser.junit'
04-Mar-2019 14:11:28 Parsing test results under /opt/bamboo-home/xml-data/build-dir/SCDT-LOCAL20XSKIPPER20X-KAFKA...
04-Mar-2019 14:11:28 Failing task since 1 failing test cases were found.
04-Mar-2019 14:11:28 Finished task 'JUnit Parser' with result: Failed
04-Mar-2019 14:11:28 Starting task 'clean up' of type 'com.atlassian.bamboo.plugins.scripttask:task.builder.script'
04-Mar-2019 14:11:28
Beginning to execute external process for build 'Spring Cloud Data Flow Acceptance Tests - Local + SCDF-2.0.0.BS + Skipper 2.0.0.BS - Run Data Flow Acceptance Tests for Kafka #39 (SCDT-LOCAL20XSKIPPER20X-KAFKA-39)'
... running command line:
/opt/bamboo-home/temp/SCDT-LOCAL20XSKIPPER20X-KAFKA-39-ScriptBuildTask-2572642403634774051.sh
... in: /opt/bamboo-home/xml-data/build-dir/SCDT-LOCAL20XSKIPPER20X-KAFKA
... using extra environment variables:
bamboo_planRepository_1_branch=master
bamboo_********_username_password=********
bamboo_signing_store_password=********
bamboo_capability_system_builder_ant_Ant_1_9=/opt/ant-1.9
bamboo_capability_system_builder_ant_Ant_1_8=/opt/ant-1.8
bamboo_planRepository_1_branchDisplayName=master
bamboo_repository_274694331_git_username=spring-buildmaster
bamboo_capability_system_jdk_OpenJDK_7u181=/opt/openjdk-7
bamboo_repository_revision_number=d1c85ae8b710cbf5786c8b24e7126d5203515b75
bamboo_capability_system_builder_node_Node_js_6=/usr/bin/node
bamboo_RIAK_BIN=/usr/sbin/riak
bamboo_buildKey=SCDT-LOCAL20XSKIPPER20X-KAFKA
bamboo_repository_274694331_branch_name=master
bamboo_bintray_password=********
bamboo_sonar_token_password=********
bamboo_shortJobName=Run Data Flow Acceptance Tests for Kafka
bamboo_capability_system_builder_gradle___gradlew=./gradlew
bamboo_buildResultsUrl=https://build.spring.io/browse/SCDT-LOCAL20XSKIPPER20X-KAFKA-39
bamboo_capability_system_builder_mvn3_Maven_3_3=/opt/maven-3.3
bamboo_capability_system_builder_mvn3_Maven_3_2=/opt/maven-3.2
bamboo_capability_system_builder_mvn3_Maven_3_1=/opt/maven-3.1
bamboo_planRepository_repositoryUrl=https://github.com/spring-cloud/spring-cloud-dataflow-acceptance-tests.git
bamboo_agentId=208568321
bamboo_capability_system_builder_mvn3_Maven_3_5=/opt/maven-3.5
bamboo_capability_system_builder_mvn3_Maven_3_0=/opt/maven-3.0
bamboo_planRepository_revision=d1c85ae8b710cbf5786c8b24e7126d5203515b75
bamboo_planRepository_previousRevision=a69530d7072ae090156e0ba6a41cf3c3fb648de9
bamboo_capability_remote_build=true
bamboo_repository_branch_name=master
bamboo_sonatype_token_password=********
bamboo_repository_274694331_name=Git
bamboo_scdf_acceptance_tests_password=********
bamboo_dependenciesDisabled=false
bamboo_repository_274694331_git_branch=master
bamboo_capability_Agent=bamboo-00.af.pivotal.io
bamboo_planRepository_branch=master
bamboo_planRepository_1_type=gitv2
bamboo_planRepository_branchName=master
bamboo_sonar_password=********
bamboo_hg_cache_directory=/opt/bamboo-home/xml-data/build-dir/_hg-repositories-cache
bamboo_planRepository_1_username=spring-buildmaster
bamboo_repository_274694331_git_repositoryUrl=https://github.com/spring-cloud/spring-cloud-dataflow-acceptance-tests.git
bamboo_planRepository_type=gitv2
bamboo_ManualBuildTriggerReason_userName=igopinathan
bamboo_git_cache_directory=/opt/bamboo-home/xml-data/build-dir/_git-repositories-cache
bamboo_artifactory_username=buildmaster
bamboo_tmp_directory=/opt/bamboo-home/temp
bamboo_planKey=SCDT-LOCAL20XSKIPPER20X
bamboo_planRepository_username=spring-buildmaster
bamboo_JDK8_HOME=/opt/jdk-8
bamboo_repository_274694331_previous_revision_number=a69530d7072ae090156e0ba6a41cf3c3fb648de9
bamboo_planRepository_1_branchName=master
bamboo_sonar_version=5.6.3
bamboo_capability_system_jdk_JDK_1_11=/opt/jdk-11
bamboo_resultsUrl=https://build.spring.io/browse/SCDT-LOCAL20XSKIPPER20X-KAFKA-39
bamboo_capability_system_jdk_JDK_1_10=/opt/jdk-10
bamboo_build_working_directory=/opt/bamboo-home/xml-data/build-dir/SCDT-LOCAL20XSKIPPER20X-KAFKA
bamboo_planRepository_1_name=Git
bamboo_capability_system_os=ubuntu1604
bamboo_nexusPush_stagingProfile=buildmaster
bamboo_shortPlanName=Local + SCDF-2.0.0.BS + Skipper 2.0.0.BS
bamboo_planRepository_name=Git
bamboo_buildNumber=39
bamboo_planName=Spring Cloud Data Flow Acceptance Tests - Local + SCDF-2.0.0.BS + Skipper 2.0.0.BS
bamboo_JDK7_HOME=/opt/jdk-7
bamboo_build_commandline_com_atlassian_bamboo_plugins_scripttask_task_builder_script_7=/opt/bamboo-home/temp/SCDT-LOCAL20XSKIPPER20X-KAFKA-39-ScriptBuildTask-8896584315455177546.sh
bamboo_shortPlanKey=LOCAL20XSKIPPER20X
bamboo_shortJobKey=KAFKA
bamboo_artifactory_password=********
bamboo_buildTimeStamp=2019-03-04T13:51:18.976Z
bamboo_repository_previous_revision_number=a69530d7072ae090156e0ba6a41cf3c3fb648de9
bamboo_sonar_username=buildmaster
bamboo_********_password=********
bamboo_repository_git_branch=master
bamboo_buildResultKey=SCDT-LOCAL20XSKIPPER20X-KAFKA-39
bamboo_nexusPush_close=true
bamboo_buildPlanName=Spring Cloud Data Flow Acceptance Tests - Local + SCDF-2.0.0.BS + Skipper 2.0.0.BS - Run Data Flow Acceptance Tests for Kafka
bamboo_repository_274694331_revision_number=d1c85ae8b710cbf5786c8b24e7126d5203515b75
bamboo_planRepository_1_revision=d1c85ae8b710cbf5786c8b24e7126d5203515b75
bamboo_repository_name=Git
bamboo_signing_key_password=********
bamboo_buildFailed=true
bamboo_capability_system_docker_executable=/usr/bin/docker
bamboo_capability_system_builder_groovy_Groovy_2_4=/opt/groovy-2.4
bamboo_capability_system_builder_command_Bash=/bin/bash
bamboo_jobFailed=true
bamboo_agentWorkingDirectory=/opt/bamboo-home/xml-data/build-dir
bamboo_capability_system_git_executable=/usr/bin/git
bamboo_repository_git_username=spring-buildmaster
bamboo_planRepository_1_previousRevision=a69530d7072ae090156e0ba6a41cf3c3fb648de9
bamboo_capability_os_family=unix
bamboo_planRepository_branchDisplayName=master
bamboo_capability_system_builder_maven_Artifactory_Maven_3_5=/opt/maven-3.5
bamboo_capability_system_builder_maven_Artifactory_Maven_3_3=/opt/maven-3.3
bamboo_capability_system_builder_maven_Artifactory_Maven_3_2=/opt/maven-3.2
bamboo_s3_properties=/home/bamboo/tools/s3.properties
bamboo_capability_system_builder_maven_Artifactory_Maven_3_1=/opt/maven-3.1
bamboo_capability_system_builder_maven_Artifactory_Maven_3_0=/opt/maven-3.0
bamboo_plan_storageTag=plan-274497908
bamboo_bintray_username_password=********
bamboo_repository_git_repositoryUrl=https://github.com/spring-cloud/spring-cloud-dataflow-acceptance-tests.git
bamboo_working_directory=/opt/bamboo-home/xml-data/build-dir/SCDT-LOCAL20XSKIPPER20X-KAFKA
bamboo_planRepository_1_repositoryUrl=https://github.com/spring-cloud/spring-cloud-dataflow-acceptance-tests.git
bamboo_capability_system_jdk_JDK_1_8=/opt/jdk-8
bamboo_capability_system_jdk_JDK_1_9=/opt/jdk-9
bamboo_capability_system_jdk_JDK_1_6=/opt/jdk-6
bamboo_sonatype_password=********
bamboo_capability_system_jdk_JDK_1_7=/opt/jdk-7
bamboo_sonar_ip=10.194.6.9
04-Mar-2019 14:11:28 CLEANING UP RESOURCES AFTER RUNNING TESTS
04-Mar-2019 14:11:28 Environment variable JAVA_HOME must be set
04-Mar-2019 14:11:28 FINISHED CLEANING UP RESOURCES
04-Mar-2019 14:11:28 Finished task 'clean up' with result: Success
04-Mar-2019 14:11:28 Running post build plugin 'Docker Container Cleanup'
04-Mar-2019 14:11:28 Running post build plugin 'NCover Results Collector'
04-Mar-2019 14:11:28 Running post build plugin 'Artifactory Release Management Staging'
04-Mar-2019 14:11:28 Running post build plugin 'Artifactory Build Info Copier'
04-Mar-2019 14:11:28 Running post build plugin 'Artifactory Gradle Properties Info Copier'
04-Mar-2019 14:11:28 Running post build plugin 'Clover Results Collector'
04-Mar-2019 14:11:28 Running post build plugin 'npm Cache Cleanup'
04-Mar-2019 14:11:28 Running post build plugin 'Artifact Copier'
04-Mar-2019 14:11:28 Publishing an artifact: Test Results
04-Mar-2019 14:11:28 Finished publishing of artifact Job artifact: [Test Results], pattern: [**/target/surefire-reports/**/*.*] in 40.44 ms
04-Mar-2019 14:11:28 Publishing an artifact: App and Server Logs
04-Mar-2019 14:11:28 Finished publishing of artifact Job artifact: [App and Server Logs], pattern: [**/*.log] anchored at: [local] in 44.26 ms
04-Mar-2019 14:11:28 Successfully removed working directory at '/opt/bamboo-home/xml-data/build-dir/SCDT-LOCAL20XSKIPPER20X-KAFKA'
04-Mar-2019 14:11:28 Finalising the build...
04-Mar-2019 14:11:28 Stopping timer.
04-Mar-2019 14:11:28 Build SCDT-LOCAL20XSKIPPER20X-KAFKA-39 completed.
04-Mar-2019 14:11:28 Running on server: post build plugin 'NCover Results Collector'
04-Mar-2019 14:11:28 Running on server: post build plugin 'Build Hanging Detection Configuration'
04-Mar-2019 14:11:28 Running on server: post build plugin 'Clover Delta Calculator'
04-Mar-2019 14:11:28 Running on server: post build plugin 'Maven Dependencies Postprocessor'
04-Mar-2019 14:11:28 All post build plugins have finished
04-Mar-2019 14:11:28 Generating build results summary...
04-Mar-2019 14:11:28 Saving build results to disk...
04-Mar-2019 14:11:28 Logging substituted variables...
04-Mar-2019 14:11:28 Indexing build results...
04-Mar-2019 14:11:28 Finished building SCDT-LOCAL20XSKIPPER20X-KAFKA-39.