Build: #43 failed

Job: Run Data Flow Acceptance Tests for Kafka failed

Stages & jobs

  1. Test Stage - Kafka

  2. Test Stage - Rabbit

Job result summary

Completed
Duration
2 minutes
Revision
4d6bba78ca2b8629684e8fda0b50bfa8dd69649c 4d6bba78ca2b8629684e8fda0b50bfa8dd69649c
Total tests
19
Failing since
#34 (Manual run by Ilayaperumal Gopinathan)
Fixed in
#44 (Manual run by Sabby Anandan)

Tests

  • 19 tests in total
  • 9 tests failed
  • 9 failures are new
  • 3 tests were quarantined / skipped
  • 34 seconds taken in total.
New test failures 9
Status Test Duration
Collapse Failed AnalyticsTests analyticsTest History
1 sec
org.springframework.cloud.dataflow.rest.client.DataFlowClientException: Error reading from URL [http://repo.spring.io/libs-release/org/springframework/cloud/stream/app/spring-cloud-stream-app-descriptor/Einstein.GA/spring-cloud-stream-app-descriptor-Einstein.GA.stream-apps-kafka-maven]

	at org.springframework.cloud.dataflow.rest.client.VndErrorResponseErrorHandler.handleError(VndErrorResponseErrorHandler.java:63)
	at org.springframework.web.client.RestTemplate.handleResponse(RestTemplate.java:667)
	at org.springframework.web.client.RestTemplate.doExecute(RestTemplate.java:620)
	at org.springframework.web.client.RestTemplate.execute(RestTemplate.java:580)
	at org.springframework.web.client.RestTemplate.postForObject(RestTemplate.java:380)
	at org.springframework.cloud.dataflow.rest.client.AppRegistryTemplate.importFromResource(AppRegistryTemplate.java:133)
(36 more lines...)
Collapse Failed HttpSourceTests httpSourceTests History
< 1 sec
org.springframework.cloud.dataflow.rest.client.DataFlowClientException: Error reading from URL [http://repo.spring.io/libs-release/org/springframework/cloud/stream/app/spring-cloud-stream-app-descriptor/Einstein.GA/spring-cloud-stream-app-descriptor-Einstein.GA.stream-apps-kafka-maven]

	at org.springframework.cloud.dataflow.rest.client.VndErrorResponseErrorHandler.handleError(VndErrorResponseErrorHandler.java:63)
	at org.springframework.web.client.RestTemplate.handleResponse(RestTemplate.java:667)
	at org.springframework.web.client.RestTemplate.doExecute(RestTemplate.java:620)
	at org.springframework.web.client.RestTemplate.execute(RestTemplate.java:580)
	at org.springframework.web.client.RestTemplate.postForObject(RestTemplate.java:380)
	at org.springframework.cloud.dataflow.rest.client.AppRegistryTemplate.importFromResource(AppRegistryTemplate.java:133)
(35 more lines...)
Collapse Failed NamedChannelTests manyToOneTest History
< 1 sec
org.springframework.cloud.dataflow.rest.client.DataFlowClientException: Error reading from URL [http://repo.spring.io/libs-release/org/springframework/cloud/stream/app/spring-cloud-stream-app-descriptor/Einstein.GA/spring-cloud-stream-app-descriptor-Einstein.GA.stream-apps-kafka-maven]

	at org.springframework.cloud.dataflow.rest.client.VndErrorResponseErrorHandler.handleError(VndErrorResponseErrorHandler.java:63)
	at org.springframework.web.client.RestTemplate.handleResponse(RestTemplate.java:667)
	at org.springframework.web.client.RestTemplate.doExecute(RestTemplate.java:620)
	at org.springframework.web.client.RestTemplate.execute(RestTemplate.java:580)
	at org.springframework.web.client.RestTemplate.postForObject(RestTemplate.java:380)
	at org.springframework.cloud.dataflow.rest.client.AppRegistryTemplate.importFromResource(AppRegistryTemplate.java:133)
(35 more lines...)
Collapse Failed NamedChannelTests testDestination History
< 1 sec
org.springframework.cloud.dataflow.rest.client.DataFlowClientException: Error reading from URL [http://repo.spring.io/libs-release/org/springframework/cloud/stream/app/spring-cloud-stream-app-descriptor/Einstein.GA/spring-cloud-stream-app-descriptor-Einstein.GA.stream-apps-kafka-maven]

	at org.springframework.cloud.dataflow.rest.client.VndErrorResponseErrorHandler.handleError(VndErrorResponseErrorHandler.java:63)
	at org.springframework.web.client.RestTemplate.handleResponse(RestTemplate.java:667)
	at org.springframework.web.client.RestTemplate.doExecute(RestTemplate.java:620)
	at org.springframework.web.client.RestTemplate.execute(RestTemplate.java:580)
	at org.springframework.web.client.RestTemplate.postForObject(RestTemplate.java:380)
	at org.springframework.cloud.dataflow.rest.client.AppRegistryTemplate.importFromResource(AppRegistryTemplate.java:133)
(35 more lines...)
Collapse Failed NamedChannelTests testTap History
< 1 sec
org.springframework.cloud.dataflow.rest.client.DataFlowClientException: Error reading from URL [http://repo.spring.io/libs-release/org/springframework/cloud/stream/app/spring-cloud-stream-app-descriptor/Einstein.GA/spring-cloud-stream-app-descriptor-Einstein.GA.stream-apps-kafka-maven]

	at org.springframework.cloud.dataflow.rest.client.VndErrorResponseErrorHandler.handleError(VndErrorResponseErrorHandler.java:63)
	at org.springframework.web.client.RestTemplate.handleResponse(RestTemplate.java:667)
	at org.springframework.web.client.RestTemplate.doExecute(RestTemplate.java:620)
	at org.springframework.web.client.RestTemplate.execute(RestTemplate.java:580)
	at org.springframework.web.client.RestTemplate.postForObject(RestTemplate.java:380)
	at org.springframework.cloud.dataflow.rest.client.AppRegistryTemplate.importFromResource(AppRegistryTemplate.java:133)
(35 more lines...)
Collapse Failed TickTockTests tickTockTests History
< 1 sec
org.springframework.cloud.dataflow.rest.client.DataFlowClientException: Error reading from URL [http://repo.spring.io/libs-release/org/springframework/cloud/stream/app/spring-cloud-stream-app-descriptor/Einstein.GA/spring-cloud-stream-app-descriptor-Einstein.GA.stream-apps-kafka-maven]

	at org.springframework.cloud.dataflow.rest.client.VndErrorResponseErrorHandler.handleError(VndErrorResponseErrorHandler.java:63)
	at org.springframework.web.client.RestTemplate.handleResponse(RestTemplate.java:667)
	at org.springframework.web.client.RestTemplate.doExecute(RestTemplate.java:620)
	at org.springframework.web.client.RestTemplate.execute(RestTemplate.java:580)
	at org.springframework.web.client.RestTemplate.postForObject(RestTemplate.java:380)
	at org.springframework.cloud.dataflow.rest.client.AppRegistryTemplate.importFromResource(AppRegistryTemplate.java:133)
(35 more lines...)
Collapse Failed TickTockTests tickTockUpdateRollbackTests History
< 1 sec
org.springframework.cloud.dataflow.rest.client.DataFlowClientException: Error reading from URL [http://repo.spring.io/libs-release/org/springframework/cloud/stream/app/spring-cloud-stream-app-descriptor/Einstein.GA/spring-cloud-stream-app-descriptor-Einstein.GA.stream-apps-kafka-maven]

	at org.springframework.cloud.dataflow.rest.client.VndErrorResponseErrorHandler.handleError(VndErrorResponseErrorHandler.java:63)
	at org.springframework.web.client.RestTemplate.handleResponse(RestTemplate.java:667)
	at org.springframework.web.client.RestTemplate.doExecute(RestTemplate.java:620)
	at org.springframework.web.client.RestTemplate.execute(RestTemplate.java:580)
	at org.springframework.web.client.RestTemplate.postForObject(RestTemplate.java:380)
	at org.springframework.cloud.dataflow.rest.client.AppRegistryTemplate.importFromResource(AppRegistryTemplate.java:133)
(35 more lines...)
Collapse Failed TransformTests transformTests History
< 1 sec
org.springframework.cloud.dataflow.rest.client.DataFlowClientException: Error reading from URL [http://repo.spring.io/libs-release/org/springframework/cloud/stream/app/spring-cloud-stream-app-descriptor/Einstein.GA/spring-cloud-stream-app-descriptor-Einstein.GA.stream-apps-kafka-maven]

	at org.springframework.cloud.dataflow.rest.client.VndErrorResponseErrorHandler.handleError(VndErrorResponseErrorHandler.java:63)
	at org.springframework.web.client.RestTemplate.handleResponse(RestTemplate.java:667)
	at org.springframework.web.client.RestTemplate.doExecute(RestTemplate.java:620)
	at org.springframework.web.client.RestTemplate.execute(RestTemplate.java:580)
	at org.springframework.web.client.RestTemplate.postForObject(RestTemplate.java:380)
	at org.springframework.cloud.dataflow.rest.client.AppRegistryTemplate.importFromResource(AppRegistryTemplate.java:133)
(35 more lines...)
Collapse Failed WoodChuckTests testPartitioning History
< 1 sec
org.springframework.cloud.dataflow.rest.client.DataFlowClientException: Error reading from URL [http://repo.spring.io/libs-release/org/springframework/cloud/stream/app/spring-cloud-stream-app-descriptor/Einstein.GA/spring-cloud-stream-app-descriptor-Einstein.GA.stream-apps-kafka-maven]

	at org.springframework.cloud.dataflow.rest.client.VndErrorResponseErrorHandler.handleError(VndErrorResponseErrorHandler.java:63)
	at org.springframework.web.client.RestTemplate.handleResponse(RestTemplate.java:667)
	at org.springframework.web.client.RestTemplate.doExecute(RestTemplate.java:620)
	at org.springframework.web.client.RestTemplate.execute(RestTemplate.java:580)
	at org.springframework.web.client.RestTemplate.postForObject(RestTemplate.java:380)
	at org.springframework.cloud.dataflow.rest.client.AppRegistryTemplate.importFromResource(AppRegistryTemplate.java:133)
(35 more lines...)

Error summary

The build generated some errors. See the full build log for more details.

Creating mysql_mysql_1
Creating kafka_zookeeper_1
Creating kafka_kafka_1
2019-03-05 18:51:56 URL:http://repo.spring.io/libs-snapshot/org/springframework/cloud/spring-cloud-skipper-server/2.0.0.BUILD-SNAPSHOT/spring-cloud-skipper-server-2.0.0.BUILD-SNAPSHOT.jar [81483373/81483373] -> "/opt/bamboo-home/xml-data/build-dir/SCDT-LOCAL20XSKIPPER20X-KAFKA/local/skipper-server/skipper-server.jar" [1]
Failed to connect to localhost:7577. Attempt  #1/60... will try again in [5] seconds
Failed to connect to localhost:7577. Attempt  #2/60... will try again in [5] seconds
Failed to connect to localhost:7577. Attempt  #3/60... will try again in [5] seconds
2019-03-05 18:52:51 URL:http://repo.spring.io/libs-snapshot/org/springframework/cloud/spring-cloud-dataflow-server/2.0.0.BUILD-SNAPSHOT/spring-cloud-dataflow-server-2.0.0.BUILD-SNAPSHOT.jar [88069972/88069972] -> "/opt/bamboo-home/xml-data/build-dir/SCDT-LOCAL20XSKIPPER20X-KAFKA/local/server/scdf-server.jar" [1]
Failed to connect to localhost:9393. Attempt  #1/60... will try again in [5] seconds
Failed to connect to localhost:9393. Attempt  #2/60... will try again in [5] seconds
Failed to connect to localhost:9393. Attempt  #3/60... will try again in [5] seconds
Killing process PID [18522]
Killing process PID [18378]
Stopping mysql_mysql_1 ...

Stopping mysql_mysql_1 ... done
Removing mysql_mysql_1 ...

Removing mysql_mysql_1 ... done
Stopping kafka_kafka_1 ...
Stopping kafka_zookeeper_1 ...

Stopping kafka_kafka_1 ... done

Stopping kafka_zookeeper_1 ... done
Removing kafka_kafka_1 ...
Removing kafka_zookeeper_1 ...

Removing kafka_kafka_1 ... done

Removing kafka_zookeeper_1 ... done