Build: #43 failed

Job: Run Data Flow Acceptance Tests for Kafka failed

Stages & jobs

  1. Test Stage - Kafka

  2. Test Stage - Rabbit

Build log

The build generated 1,281 lines of output.The output is too long and has been truncated to the last 1,000 lines. Download or view full build log

05-Mar-2019 18:53:14         at org.junit.runners.ParentRunner$1.schedule(ParentRunner.java:71)
05-Mar-2019 18:53:14         at org.junit.runners.ParentRunner.runChildren(ParentRunner.java:288)
05-Mar-2019 18:53:14         at org.junit.runners.ParentRunner.access$000(ParentRunner.java:58)
05-Mar-2019 18:53:14         at org.junit.runners.ParentRunner$2.evaluate(ParentRunner.java:268)
05-Mar-2019 18:53:14         at org.springframework.test.context.junit4.statements.RunBeforeTestClassCallbacks.evaluate(RunBeforeTestClassCallbacks.java:61)
05-Mar-2019 18:53:14         at org.springframework.test.context.junit4.statements.RunAfterTestClassCallbacks.evaluate(RunAfterTestClassCallbacks.java:70)
05-Mar-2019 18:53:14         at org.junit.runners.ParentRunner.run(ParentRunner.java:363)
05-Mar-2019 18:53:14         at org.springframework.test.context.junit4.SpringJUnit4ClassRunner.run(SpringJUnit4ClassRunner.java:191)
05-Mar-2019 18:53:14         at org.apache.maven.surefire.junit4.JUnit4Provider.execute(JUnit4Provider.java:283)
05-Mar-2019 18:53:14         at org.apache.maven.surefire.junit4.JUnit4Provider.executeWithRerun(JUnit4Provider.java:173)
05-Mar-2019 18:53:14         at org.apache.maven.surefire.junit4.JUnit4Provider.executeTestSet(JUnit4Provider.java:153)
05-Mar-2019 18:53:14         at org.apache.maven.surefire.junit4.JUnit4Provider.invoke(JUnit4Provider.java:128)
05-Mar-2019 18:53:14         at org.apache.maven.surefire.booter.ForkedBooter.invokeProviderInSameClassLoader(ForkedBooter.java:203)
05-Mar-2019 18:53:14         at org.apache.maven.surefire.booter.ForkedBooter.runSuitesInProcess(ForkedBooter.java:155)
05-Mar-2019 18:53:14         at org.apache.maven.surefire.booter.ForkedBooter.main(ForkedBooter.java:103)
05-Mar-2019 18:53:14
05-Mar-2019 18:53:14 2019-03-05 18:53:14.568  INFO 18635 --- [           main] junit.logTestName                        : Finished Test analyticsTest(org.springframework.cloud.dataflow.acceptance.test.AnalyticsTests)
05-Mar-2019 18:53:14 2019-03-05 18:53:14.570  INFO 18635 --- [           main] o.s.c.d.acceptance.test.AnalyticsTests   : Destroy all streams
05-Mar-2019 18:53:14 Tests run: 1, Failures: 0, Errors: 1, Skipped: 0, Time elapsed: 3.381 sec <<< FAILURE! - in org.springframework.cloud.dataflow.acceptance.test.AnalyticsTests
05-Mar-2019 18:53:14 analyticsTest(org.springframework.cloud.dataflow.acceptance.test.AnalyticsTests)  Time elapsed: 1.65 sec  <<< ERROR!
05-Mar-2019 18:53:14 org.springframework.cloud.dataflow.rest.client.DataFlowClientException: Error reading from URL [http://repo.spring.io/libs-release/org/springframework/cloud/stream/app/spring-cloud-stream-app-descriptor/Einstein.GA/spring-cloud-stream-app-descriptor-Einstein.GA.stream-apps-kafka-maven]
05-Mar-2019 18:53:14
05-Mar-2019 18:53:14         at org.springframework.cloud.dataflow.rest.client.VndErrorResponseErrorHandler.handleError(VndErrorResponseErrorHandler.java:63)
05-Mar-2019 18:53:14         at org.springframework.web.client.RestTemplate.handleResponse(RestTemplate.java:667)
05-Mar-2019 18:53:14         at org.springframework.web.client.RestTemplate.doExecute(RestTemplate.java:620)
05-Mar-2019 18:53:14         at org.springframework.web.client.RestTemplate.execute(RestTemplate.java:580)
05-Mar-2019 18:53:14         at org.springframework.web.client.RestTemplate.postForObject(RestTemplate.java:380)
05-Mar-2019 18:53:14         at org.springframework.cloud.dataflow.rest.client.AppRegistryTemplate.importFromResource(AppRegistryTemplate.java:133)
05-Mar-2019 18:53:14         at org.springframework.cloud.dataflow.acceptance.test.AbstractStreamTests.registerApps(AbstractStreamTests.java:231)
05-Mar-2019 18:53:14         at org.springframework.cloud.dataflow.acceptance.test.AbstractStreamTests.setup(AbstractStreamTests.java:129)
05-Mar-2019 18:53:14         at sun.reflect.NativeMethodAccessorImpl.invoke0(Native Method)
05-Mar-2019 18:53:14         at sun.reflect.NativeMethodAccessorImpl.invoke(NativeMethodAccessorImpl.java:62)
05-Mar-2019 18:53:14         at sun.reflect.DelegatingMethodAccessorImpl.invoke(DelegatingMethodAccessorImpl.java:43)
05-Mar-2019 18:53:14         at java.lang.reflect.Method.invoke(Method.java:498)
05-Mar-2019 18:53:14         at org.junit.runners.model.FrameworkMethod$1.runReflectiveCall(FrameworkMethod.java:50)
05-Mar-2019 18:53:14         at org.junit.internal.runners.model.ReflectiveCallable.run(ReflectiveCallable.java:12)
05-Mar-2019 18:53:14         at org.junit.runners.model.FrameworkMethod.invokeExplosively(FrameworkMethod.java:47)
05-Mar-2019 18:53:14         at org.junit.internal.runners.statements.RunBefores.evaluate(RunBefores.java:24)
05-Mar-2019 18:53:14         at org.springframework.test.context.junit4.statements.RunBeforeTestMethodCallbacks.evaluate(RunBeforeTestMethodCallbacks.java:75)
05-Mar-2019 18:53:14         at org.springframework.test.context.junit4.statements.RunAfterTestMethodCallbacks.evaluate(RunAfterTestMethodCallbacks.java:86)
05-Mar-2019 18:53:14         at org.springframework.cloud.stream.test.junit.AbstractExternalResourceTestSupport$1.evaluate(AbstractExternalResourceTestSupport.java:72)
05-Mar-2019 18:53:14         at org.junit.rules.TestWatcher$1.evaluate(TestWatcher.java:55)
05-Mar-2019 18:53:14         at org.junit.rules.ExternalResource$1.evaluate(ExternalResource.java:48)
05-Mar-2019 18:53:14         at org.junit.rules.RunRules.evaluate(RunRules.java:20)
05-Mar-2019 18:53:14         at org.springframework.test.context.junit4.statements.SpringRepeat.evaluate(SpringRepeat.java:84)
05-Mar-2019 18:53:14         at org.junit.runners.ParentRunner.runLeaf(ParentRunner.java:325)
05-Mar-2019 18:53:14         at org.springframework.test.context.junit4.SpringJUnit4ClassRunner.runChild(SpringJUnit4ClassRunner.java:252)
05-Mar-2019 18:53:14         at org.springframework.test.context.junit4.SpringJUnit4ClassRunner.runChild(SpringJUnit4ClassRunner.java:94)
05-Mar-2019 18:53:14         at org.junit.runners.ParentRunner$3.run(ParentRunner.java:290)
05-Mar-2019 18:53:14         at org.junit.runners.ParentRunner$1.schedule(ParentRunner.java:71)
05-Mar-2019 18:53:14         at org.junit.runners.ParentRunner.runChildren(ParentRunner.java:288)
05-Mar-2019 18:53:14         at org.junit.runners.ParentRunner.access$000(ParentRunner.java:58)
05-Mar-2019 18:53:14         at org.junit.runners.ParentRunner$2.evaluate(ParentRunner.java:268)
05-Mar-2019 18:53:14         at org.springframework.test.context.junit4.statements.RunBeforeTestClassCallbacks.evaluate(RunBeforeTestClassCallbacks.java:61)
05-Mar-2019 18:53:14         at org.springframework.test.context.junit4.statements.RunAfterTestClassCallbacks.evaluate(RunAfterTestClassCallbacks.java:70)
05-Mar-2019 18:53:14         at org.junit.runners.ParentRunner.run(ParentRunner.java:363)
05-Mar-2019 18:53:14         at org.springframework.test.context.junit4.SpringJUnit4ClassRunner.run(SpringJUnit4ClassRunner.java:191)
05-Mar-2019 18:53:14         at org.apache.maven.surefire.junit4.JUnit4Provider.execute(JUnit4Provider.java:283)
05-Mar-2019 18:53:14         at org.apache.maven.surefire.junit4.JUnit4Provider.executeWithRerun(JUnit4Provider.java:173)
05-Mar-2019 18:53:14         at org.apache.maven.surefire.junit4.JUnit4Provider.executeTestSet(JUnit4Provider.java:153)
05-Mar-2019 18:53:14         at org.apache.maven.surefire.junit4.JUnit4Provider.invoke(JUnit4Provider.java:128)
05-Mar-2019 18:53:14         at org.apache.maven.surefire.booter.ForkedBooter.invokeProviderInSameClassLoader(ForkedBooter.java:203)
05-Mar-2019 18:53:14         at org.apache.maven.surefire.booter.ForkedBooter.runSuitesInProcess(ForkedBooter.java:155)
05-Mar-2019 18:53:14         at org.apache.maven.surefire.booter.ForkedBooter.main(ForkedBooter.java:103)
05-Mar-2019 18:53:14
05-Mar-2019 18:53:14 Running org.springframework.cloud.dataflow.acceptance.test.WoodChuckTests
05-Mar-2019 18:53:14 2019-03-05 18:53:14.744  INFO 18635 --- [           main] .b.t.c.SpringBootTestContextBootstrapper : Neither @ContextConfiguration nor @ContextHierarchy found for test class [org.springframework.cloud.dataflow.acceptance.test.WoodChuckTests], using SpringBootContextLoader
05-Mar-2019 18:53:14 2019-03-05 18:53:14.757  INFO 18635 --- [           main] .b.t.c.SpringBootTestContextBootstrapper : Loaded default TestExecutionListener class names from location [META-INF/spring.factories]: [org.springframework.boot.test.mock.mockito.MockitoTestExecutionListener, org.springframework.boot.test.mock.mockito.ResetMocksTestExecutionListener, org.springframework.boot.test.autoconfigure.restdocs.RestDocsTestExecutionListener, org.springframework.boot.test.autoconfigure.web.client.MockRestServiceServerResetTestExecutionListener, org.springframework.boot.test.autoconfigure.web.servlet.MockMvcPrintOnlyOnFailureTestExecutionListener, org.springframework.boot.test.autoconfigure.web.servlet.WebDriverTestExecutionListener, org.springframework.test.context.web.ServletTestExecutionListener, org.springframework.test.context.support.DirtiesContextBeforeModesTestExecutionListener, org.springframework.test.context.support.DependencyInjectionTestExecutionListener, org.springframework.test.context.support.DirtiesContextTestExecutionListener, org.springframework.test.context.transaction.TransactionalTestExecutionListener, org.springframework.test.context.jdbc.SqlScriptsTestExecutionListener]
05-Mar-2019 18:53:14 2019-03-05 18:53:14.759  INFO 18635 --- [           main] .b.t.c.SpringBootTestContextBootstrapper : Using TestExecutionListeners: [org.springframework.test.context.web.ServletTestExecutionListener@d109c4f, org.springframework.test.context.support.DirtiesContextBeforeModesTestExecutionListener@3968bc60, org.springframework.boot.test.autoconfigure.SpringBootDependencyInjectionTestExecutionListener@26f46fa6, org.springframework.test.context.support.DirtiesContextTestExecutionListener@227a47, org.springframework.test.context.transaction.TransactionalTestExecutionListener@9596ce8, org.springframework.test.context.jdbc.SqlScriptsTestExecutionListener@75ae4a1f, org.springframework.boot.test.autoconfigure.web.servlet.MockMvcPrintOnlyOnFailureTestExecutionListener@70228253, org.springframework.boot.test.autoconfigure.web.client.MockRestServiceServerResetTestExecutionListener@63c12e52, org.springframework.boot.test.mock.mockito.ResetMocksTestExecutionListener@21bd20ee, org.springframework.boot.test.autoconfigure.web.servlet.WebDriverTestExecutionListener@26c47874, org.springframework.boot.test.autoconfigure.restdocs.RestDocsTestExecutionListener@421056e5, org.springframework.boot.test.mock.mockito.MockitoTestExecutionListener@2849434b]
05-Mar-2019 18:53:14 2019-03-05 18:53:14.859  INFO 18635 --- [           main] junit.logTestName                        : Starting Test testPartitioning(org.springframework.cloud.dataflow.acceptance.test.WoodChuckTests)
05-Mar-2019 18:53:14 2019-03-05 18:53:14.860  INFO 18635 --- [           main] o.s.c.d.acceptance.test.WoodChuckTests   : Importing stream apps from uri resource: http://repo.spring.io/libs-release/org/springframework/cloud/stream/app/spring-cloud-stream-app-descriptor/Einstein.GA/spring-cloud-stream-app-descriptor-Einstein.GA.stream-apps-kafka-maven
05-Mar-2019 18:53:15 2019-03-05 18:53:15.682 ERROR 18635 --- [           main] junit.logTestName                        : !!! Test testPartitioning(org.springframework.cloud.dataflow.acceptance.test.WoodChuckTests) Failed !!!
05-Mar-2019 18:53:15
05-Mar-2019 18:53:15 org.springframework.cloud.dataflow.rest.client.DataFlowClientException: Error reading from URL [http://repo.spring.io/libs-release/org/springframework/cloud/stream/app/spring-cloud-stream-app-descriptor/Einstein.GA/spring-cloud-stream-app-descriptor-Einstein.GA.stream-apps-kafka-maven]
05-Mar-2019 18:53:15
05-Mar-2019 18:53:15         at org.springframework.cloud.dataflow.rest.client.VndErrorResponseErrorHandler.handleError(VndErrorResponseErrorHandler.java:63)
05-Mar-2019 18:53:15         at org.springframework.web.client.RestTemplate.handleResponse(RestTemplate.java:667)
05-Mar-2019 18:53:15         at org.springframework.web.client.RestTemplate.doExecute(RestTemplate.java:620)
05-Mar-2019 18:53:15         at org.springframework.web.client.RestTemplate.execute(RestTemplate.java:580)
05-Mar-2019 18:53:15         at org.springframework.web.client.RestTemplate.postForObject(RestTemplate.java:380)
05-Mar-2019 18:53:15         at org.springframework.cloud.dataflow.rest.client.AppRegistryTemplate.importFromResource(AppRegistryTemplate.java:133)
05-Mar-2019 18:53:15         at org.springframework.cloud.dataflow.acceptance.test.AbstractStreamTests.registerApps(AbstractStreamTests.java:231)
05-Mar-2019 18:53:15         at org.springframework.cloud.dataflow.acceptance.test.AbstractStreamTests.setup(AbstractStreamTests.java:129)
05-Mar-2019 18:53:15         at sun.reflect.NativeMethodAccessorImpl.invoke0(Native Method)
05-Mar-2019 18:53:15         at sun.reflect.NativeMethodAccessorImpl.invoke(NativeMethodAccessorImpl.java:62)
05-Mar-2019 18:53:15         at sun.reflect.DelegatingMethodAccessorImpl.invoke(DelegatingMethodAccessorImpl.java:43)
05-Mar-2019 18:53:15         at java.lang.reflect.Method.invoke(Method.java:498)
05-Mar-2019 18:53:15         at org.junit.runners.model.FrameworkMethod$1.runReflectiveCall(FrameworkMethod.java:50)
05-Mar-2019 18:53:15         at org.junit.internal.runners.model.ReflectiveCallable.run(ReflectiveCallable.java:12)
05-Mar-2019 18:53:15         at org.junit.runners.model.FrameworkMethod.invokeExplosively(FrameworkMethod.java:47)
05-Mar-2019 18:53:15         at org.junit.internal.runners.statements.RunBefores.evaluate(RunBefores.java:24)
05-Mar-2019 18:53:15         at org.springframework.test.context.junit4.statements.RunBeforeTestMethodCallbacks.evaluate(RunBeforeTestMethodCallbacks.java:75)
05-Mar-2019 18:53:15         at org.springframework.test.context.junit4.statements.RunAfterTestMethodCallbacks.evaluate(RunAfterTestMethodCallbacks.java:86)
05-Mar-2019 18:53:15         at org.junit.rules.TestWatcher$1.evaluate(TestWatcher.java:55)
05-Mar-2019 18:53:15         at org.junit.rules.ExternalResource$1.evaluate(ExternalResource.java:48)
05-Mar-2019 18:53:15         at org.junit.rules.RunRules.evaluate(RunRules.java:20)
05-Mar-2019 18:53:15         at org.springframework.test.context.junit4.statements.SpringRepeat.evaluate(SpringRepeat.java:84)
05-Mar-2019 18:53:15         at org.junit.runners.ParentRunner.runLeaf(ParentRunner.java:325)
05-Mar-2019 18:53:15         at org.springframework.test.context.junit4.SpringJUnit4ClassRunner.runChild(SpringJUnit4ClassRunner.java:252)
05-Mar-2019 18:53:15         at org.springframework.test.context.junit4.SpringJUnit4ClassRunner.runChild(SpringJUnit4ClassRunner.java:94)
05-Mar-2019 18:53:15         at org.junit.runners.ParentRunner$3.run(ParentRunner.java:290)
05-Mar-2019 18:53:15         at org.junit.runners.ParentRunner$1.schedule(ParentRunner.java:71)
05-Mar-2019 18:53:15         at org.junit.runners.ParentRunner.runChildren(ParentRunner.java:288)
05-Mar-2019 18:53:15         at org.junit.runners.ParentRunner.access$000(ParentRunner.java:58)
05-Mar-2019 18:53:15         at org.junit.runners.ParentRunner$2.evaluate(ParentRunner.java:268)
05-Mar-2019 18:53:15         at org.springframework.test.context.junit4.statements.RunBeforeTestClassCallbacks.evaluate(RunBeforeTestClassCallbacks.java:61)
05-Mar-2019 18:53:15         at org.springframework.test.context.junit4.statements.RunAfterTestClassCallbacks.evaluate(RunAfterTestClassCallbacks.java:70)
05-Mar-2019 18:53:15         at org.junit.runners.ParentRunner.run(ParentRunner.java:363)
05-Mar-2019 18:53:15         at org.springframework.test.context.junit4.SpringJUnit4ClassRunner.run(SpringJUnit4ClassRunner.java:191)
05-Mar-2019 18:53:15         at org.apache.maven.surefire.junit4.JUnit4Provider.execute(JUnit4Provider.java:283)
05-Mar-2019 18:53:15         at org.apache.maven.surefire.junit4.JUnit4Provider.executeWithRerun(JUnit4Provider.java:173)
05-Mar-2019 18:53:15         at org.apache.maven.surefire.junit4.JUnit4Provider.executeTestSet(JUnit4Provider.java:153)
05-Mar-2019 18:53:15         at org.apache.maven.surefire.junit4.JUnit4Provider.invoke(JUnit4Provider.java:128)
05-Mar-2019 18:53:15         at org.apache.maven.surefire.booter.ForkedBooter.invokeProviderInSameClassLoader(ForkedBooter.java:203)
05-Mar-2019 18:53:15         at org.apache.maven.surefire.booter.ForkedBooter.runSuitesInProcess(ForkedBooter.java:155)
05-Mar-2019 18:53:15         at org.apache.maven.surefire.booter.ForkedBooter.main(ForkedBooter.java:103)
05-Mar-2019 18:53:15
05-Mar-2019 18:53:15 2019-03-05 18:53:15.683  INFO 18635 --- [           main] junit.logTestName                        : Finished Test testPartitioning(org.springframework.cloud.dataflow.acceptance.test.WoodChuckTests)
05-Mar-2019 18:53:15 2019-03-05 18:53:15.683  INFO 18635 --- [           main] o.s.c.d.acceptance.test.WoodChuckTests   : Destroy all streams
05-Mar-2019 18:53:15 Tests run: 1, Failures: 0, Errors: 1, Skipped: 0, Time elapsed: 0.88 sec <<< FAILURE! - in org.springframework.cloud.dataflow.acceptance.test.WoodChuckTests
05-Mar-2019 18:53:15 testPartitioning(org.springframework.cloud.dataflow.acceptance.test.WoodChuckTests)  Time elapsed: 0.831 sec  <<< ERROR!
05-Mar-2019 18:53:15 org.springframework.cloud.dataflow.rest.client.DataFlowClientException: Error reading from URL [http://repo.spring.io/libs-release/org/springframework/cloud/stream/app/spring-cloud-stream-app-descriptor/Einstein.GA/spring-cloud-stream-app-descriptor-Einstein.GA.stream-apps-kafka-maven]
05-Mar-2019 18:53:15
05-Mar-2019 18:53:15         at org.springframework.cloud.dataflow.rest.client.VndErrorResponseErrorHandler.handleError(VndErrorResponseErrorHandler.java:63)
05-Mar-2019 18:53:15         at org.springframework.web.client.RestTemplate.handleResponse(RestTemplate.java:667)
05-Mar-2019 18:53:15         at org.springframework.web.client.RestTemplate.doExecute(RestTemplate.java:620)
05-Mar-2019 18:53:15         at org.springframework.web.client.RestTemplate.execute(RestTemplate.java:580)
05-Mar-2019 18:53:15         at org.springframework.web.client.RestTemplate.postForObject(RestTemplate.java:380)
05-Mar-2019 18:53:15         at org.springframework.cloud.dataflow.rest.client.AppRegistryTemplate.importFromResource(AppRegistryTemplate.java:133)
05-Mar-2019 18:53:15         at org.springframework.cloud.dataflow.acceptance.test.AbstractStreamTests.registerApps(AbstractStreamTests.java:231)
05-Mar-2019 18:53:15         at org.springframework.cloud.dataflow.acceptance.test.AbstractStreamTests.setup(AbstractStreamTests.java:129)
05-Mar-2019 18:53:15         at sun.reflect.NativeMethodAccessorImpl.invoke0(Native Method)
05-Mar-2019 18:53:15         at sun.reflect.NativeMethodAccessorImpl.invoke(NativeMethodAccessorImpl.java:62)
05-Mar-2019 18:53:15         at sun.reflect.DelegatingMethodAccessorImpl.invoke(DelegatingMethodAccessorImpl.java:43)
05-Mar-2019 18:53:15         at java.lang.reflect.Method.invoke(Method.java:498)
05-Mar-2019 18:53:15         at org.junit.runners.model.FrameworkMethod$1.runReflectiveCall(FrameworkMethod.java:50)
05-Mar-2019 18:53:15         at org.junit.internal.runners.model.ReflectiveCallable.run(ReflectiveCallable.java:12)
05-Mar-2019 18:53:15         at org.junit.runners.model.FrameworkMethod.invokeExplosively(FrameworkMethod.java:47)
05-Mar-2019 18:53:15         at org.junit.internal.runners.statements.RunBefores.evaluate(RunBefores.java:24)
05-Mar-2019 18:53:15         at org.springframework.test.context.junit4.statements.RunBeforeTestMethodCallbacks.evaluate(RunBeforeTestMethodCallbacks.java:75)
05-Mar-2019 18:53:15         at org.springframework.test.context.junit4.statements.RunAfterTestMethodCallbacks.evaluate(RunAfterTestMethodCallbacks.java:86)
05-Mar-2019 18:53:15         at org.junit.rules.TestWatcher$1.evaluate(TestWatcher.java:55)
05-Mar-2019 18:53:15         at org.junit.rules.ExternalResource$1.evaluate(ExternalResource.java:48)
05-Mar-2019 18:53:15         at org.junit.rules.RunRules.evaluate(RunRules.java:20)
05-Mar-2019 18:53:15         at org.springframework.test.context.junit4.statements.SpringRepeat.evaluate(SpringRepeat.java:84)
05-Mar-2019 18:53:15         at org.junit.runners.ParentRunner.runLeaf(ParentRunner.java:325)
05-Mar-2019 18:53:15         at org.springframework.test.context.junit4.SpringJUnit4ClassRunner.runChild(SpringJUnit4ClassRunner.java:252)
05-Mar-2019 18:53:15         at org.springframework.test.context.junit4.SpringJUnit4ClassRunner.runChild(SpringJUnit4ClassRunner.java:94)
05-Mar-2019 18:53:15         at org.junit.runners.ParentRunner$3.run(ParentRunner.java:290)
05-Mar-2019 18:53:15         at org.junit.runners.ParentRunner$1.schedule(ParentRunner.java:71)
05-Mar-2019 18:53:15         at org.junit.runners.ParentRunner.runChildren(ParentRunner.java:288)
05-Mar-2019 18:53:15         at org.junit.runners.ParentRunner.access$000(ParentRunner.java:58)
05-Mar-2019 18:53:15         at org.junit.runners.ParentRunner$2.evaluate(ParentRunner.java:268)
05-Mar-2019 18:53:15         at org.springframework.test.context.junit4.statements.RunBeforeTestClassCallbacks.evaluate(RunBeforeTestClassCallbacks.java:61)
05-Mar-2019 18:53:15         at org.springframework.test.context.junit4.statements.RunAfterTestClassCallbacks.evaluate(RunAfterTestClassCallbacks.java:70)
05-Mar-2019 18:53:15         at org.junit.runners.ParentRunner.run(ParentRunner.java:363)
05-Mar-2019 18:53:15         at org.springframework.test.context.junit4.SpringJUnit4ClassRunner.run(SpringJUnit4ClassRunner.java:191)
05-Mar-2019 18:53:15         at org.apache.maven.surefire.junit4.JUnit4Provider.execute(JUnit4Provider.java:283)
05-Mar-2019 18:53:15         at org.apache.maven.surefire.junit4.JUnit4Provider.executeWithRerun(JUnit4Provider.java:173)
05-Mar-2019 18:53:15         at org.apache.maven.surefire.junit4.JUnit4Provider.executeTestSet(JUnit4Provider.java:153)
05-Mar-2019 18:53:15         at org.apache.maven.surefire.junit4.JUnit4Provider.invoke(JUnit4Provider.java:128)
05-Mar-2019 18:53:15         at org.apache.maven.surefire.booter.ForkedBooter.invokeProviderInSameClassLoader(ForkedBooter.java:203)
05-Mar-2019 18:53:15         at org.apache.maven.surefire.booter.ForkedBooter.runSuitesInProcess(ForkedBooter.java:155)
05-Mar-2019 18:53:15         at org.apache.maven.surefire.booter.ForkedBooter.main(ForkedBooter.java:103)
05-Mar-2019 18:53:15
05-Mar-2019 18:53:15 Running org.springframework.cloud.dataflow.acceptance.test.HttpSourceTests
05-Mar-2019 18:53:15 2019-03-05 18:53:15.694  INFO 18635 --- [           main] .b.t.c.SpringBootTestContextBootstrapper : Neither @ContextConfiguration nor @ContextHierarchy found for test class [org.springframework.cloud.dataflow.acceptance.test.HttpSourceTests], using SpringBootContextLoader
05-Mar-2019 18:53:15 2019-03-05 18:53:15.711  INFO 18635 --- [           main] .b.t.c.SpringBootTestContextBootstrapper : Loaded default TestExecutionListener class names from location [META-INF/spring.factories]: [org.springframework.boot.test.mock.mockito.MockitoTestExecutionListener, org.springframework.boot.test.mock.mockito.ResetMocksTestExecutionListener, org.springframework.boot.test.autoconfigure.restdocs.RestDocsTestExecutionListener, org.springframework.boot.test.autoconfigure.web.client.MockRestServiceServerResetTestExecutionListener, org.springframework.boot.test.autoconfigure.web.servlet.MockMvcPrintOnlyOnFailureTestExecutionListener, org.springframework.boot.test.autoconfigure.web.servlet.WebDriverTestExecutionListener, org.springframework.test.context.web.ServletTestExecutionListener, org.springframework.test.context.support.DirtiesContextBeforeModesTestExecutionListener, org.springframework.test.context.support.DependencyInjectionTestExecutionListener, org.springframework.test.context.support.DirtiesContextTestExecutionListener, org.springframework.test.context.transaction.TransactionalTestExecutionListener, org.springframework.test.context.jdbc.SqlScriptsTestExecutionListener]
05-Mar-2019 18:53:15 2019-03-05 18:53:15.713  INFO 18635 --- [           main] .b.t.c.SpringBootTestContextBootstrapper : Using TestExecutionListeners: [org.springframework.test.context.web.ServletTestExecutionListener@4ce94d2f, org.springframework.test.context.support.DirtiesContextBeforeModesTestExecutionListener@68ab0936, org.springframework.boot.test.autoconfigure.SpringBootDependencyInjectionTestExecutionListener@3cd9aa64, org.springframework.test.context.support.DirtiesContextTestExecutionListener@42b84286, org.springframework.test.context.transaction.TransactionalTestExecutionListener@443effcb, org.springframework.test.context.jdbc.SqlScriptsTestExecutionListener@74ecacc3, org.springframework.boot.test.autoconfigure.web.servlet.MockMvcPrintOnlyOnFailureTestExecutionListener@517a2b0, org.springframework.boot.test.autoconfigure.web.client.MockRestServiceServerResetTestExecutionListener@53b7ce6, org.springframework.boot.test.mock.mockito.ResetMocksTestExecutionListener@36480b2d, org.springframework.boot.test.autoconfigure.web.servlet.WebDriverTestExecutionListener@27d33393, org.springframework.boot.test.autoconfigure.restdocs.RestDocsTestExecutionListener@1f6917fb, org.springframework.boot.test.mock.mockito.MockitoTestExecutionListener@41eb94bc]
05-Mar-2019 18:53:15 2019-03-05 18:53:15.791  INFO 18635 --- [           main] junit.logTestName                        : Starting Test httpSourceTests(org.springframework.cloud.dataflow.acceptance.test.HttpSourceTests)
05-Mar-2019 18:53:15 2019-03-05 18:53:15.792  INFO 18635 --- [           main] o.s.c.d.acceptance.test.HttpSourceTests  : Importing stream apps from uri resource: http://repo.spring.io/libs-release/org/springframework/cloud/stream/app/spring-cloud-stream-app-descriptor/Einstein.GA/spring-cloud-stream-app-descriptor-Einstein.GA.stream-apps-kafka-maven
05-Mar-2019 18:53:15 2019-03-05 18:53:15.913 ERROR 18635 --- [           main] junit.logTestName                        : !!! Test httpSourceTests(org.springframework.cloud.dataflow.acceptance.test.HttpSourceTests) Failed !!!
05-Mar-2019 18:53:15
05-Mar-2019 18:53:15 org.springframework.cloud.dataflow.rest.client.DataFlowClientException: Error reading from URL [http://repo.spring.io/libs-release/org/springframework/cloud/stream/app/spring-cloud-stream-app-descriptor/Einstein.GA/spring-cloud-stream-app-descriptor-Einstein.GA.stream-apps-kafka-maven]
05-Mar-2019 18:53:15
05-Mar-2019 18:53:15         at org.springframework.cloud.dataflow.rest.client.VndErrorResponseErrorHandler.handleError(VndErrorResponseErrorHandler.java:63)
05-Mar-2019 18:53:15         at org.springframework.web.client.RestTemplate.handleResponse(RestTemplate.java:667)
05-Mar-2019 18:53:15         at org.springframework.web.client.RestTemplate.doExecute(RestTemplate.java:620)
05-Mar-2019 18:53:15         at org.springframework.web.client.RestTemplate.execute(RestTemplate.java:580)
05-Mar-2019 18:53:15         at org.springframework.web.client.RestTemplate.postForObject(RestTemplate.java:380)
05-Mar-2019 18:53:15         at org.springframework.cloud.dataflow.rest.client.AppRegistryTemplate.importFromResource(AppRegistryTemplate.java:133)
05-Mar-2019 18:53:15         at org.springframework.cloud.dataflow.acceptance.test.AbstractStreamTests.registerApps(AbstractStreamTests.java:231)
05-Mar-2019 18:53:15         at org.springframework.cloud.dataflow.acceptance.test.AbstractStreamTests.setup(AbstractStreamTests.java:129)
05-Mar-2019 18:53:15         at sun.reflect.NativeMethodAccessorImpl.invoke0(Native Method)
05-Mar-2019 18:53:15         at sun.reflect.NativeMethodAccessorImpl.invoke(NativeMethodAccessorImpl.java:62)
05-Mar-2019 18:53:15         at sun.reflect.DelegatingMethodAccessorImpl.invoke(DelegatingMethodAccessorImpl.java:43)
05-Mar-2019 18:53:15         at java.lang.reflect.Method.invoke(Method.java:498)
05-Mar-2019 18:53:15         at org.junit.runners.model.FrameworkMethod$1.runReflectiveCall(FrameworkMethod.java:50)
05-Mar-2019 18:53:15         at org.junit.internal.runners.model.ReflectiveCallable.run(ReflectiveCallable.java:12)
05-Mar-2019 18:53:15         at org.junit.runners.model.FrameworkMethod.invokeExplosively(FrameworkMethod.java:47)
05-Mar-2019 18:53:15         at org.junit.internal.runners.statements.RunBefores.evaluate(RunBefores.java:24)
05-Mar-2019 18:53:15         at org.springframework.test.context.junit4.statements.RunBeforeTestMethodCallbacks.evaluate(RunBeforeTestMethodCallbacks.java:75)
05-Mar-2019 18:53:15         at org.springframework.test.context.junit4.statements.RunAfterTestMethodCallbacks.evaluate(RunAfterTestMethodCallbacks.java:86)
05-Mar-2019 18:53:15         at org.junit.rules.TestWatcher$1.evaluate(TestWatcher.java:55)
05-Mar-2019 18:53:15         at org.junit.rules.ExternalResource$1.evaluate(ExternalResource.java:48)
05-Mar-2019 18:53:15         at org.junit.rules.RunRules.evaluate(RunRules.java:20)
05-Mar-2019 18:53:15         at org.springframework.test.context.junit4.statements.SpringRepeat.evaluate(SpringRepeat.java:84)
05-Mar-2019 18:53:15         at org.junit.runners.ParentRunner.runLeaf(ParentRunner.java:325)
05-Mar-2019 18:53:15         at org.springframework.test.context.junit4.SpringJUnit4ClassRunner.runChild(SpringJUnit4ClassRunner.java:252)
05-Mar-2019 18:53:15         at org.springframework.test.context.junit4.SpringJUnit4ClassRunner.runChild(SpringJUnit4ClassRunner.java:94)
05-Mar-2019 18:53:15         at org.junit.runners.ParentRunner$3.run(ParentRunner.java:290)
05-Mar-2019 18:53:15         at org.junit.runners.ParentRunner$1.schedule(ParentRunner.java:71)
05-Mar-2019 18:53:15         at org.junit.runners.ParentRunner.runChildren(ParentRunner.java:288)
05-Mar-2019 18:53:15         at org.junit.runners.ParentRunner.access$000(ParentRunner.java:58)
05-Mar-2019 18:53:15         at org.junit.runners.ParentRunner$2.evaluate(ParentRunner.java:268)
05-Mar-2019 18:53:15         at org.springframework.test.context.junit4.statements.RunBeforeTestClassCallbacks.evaluate(RunBeforeTestClassCallbacks.java:61)
05-Mar-2019 18:53:15         at org.springframework.test.context.junit4.statements.RunAfterTestClassCallbacks.evaluate(RunAfterTestClassCallbacks.java:70)
05-Mar-2019 18:53:15         at org.junit.runners.ParentRunner.run(ParentRunner.java:363)
05-Mar-2019 18:53:15         at org.springframework.test.context.junit4.SpringJUnit4ClassRunner.run(SpringJUnit4ClassRunner.java:191)
05-Mar-2019 18:53:15         at org.apache.maven.surefire.junit4.JUnit4Provider.execute(JUnit4Provider.java:283)
05-Mar-2019 18:53:15         at org.apache.maven.surefire.junit4.JUnit4Provider.executeWithRerun(JUnit4Provider.java:173)
05-Mar-2019 18:53:15         at org.apache.maven.surefire.junit4.JUnit4Provider.executeTestSet(JUnit4Provider.java:153)
05-Mar-2019 18:53:15         at org.apache.maven.surefire.junit4.JUnit4Provider.invoke(JUnit4Provider.java:128)
05-Mar-2019 18:53:15         at org.apache.maven.surefire.booter.ForkedBooter.invokeProviderInSameClassLoader(ForkedBooter.java:203)
05-Mar-2019 18:53:15         at org.apache.maven.surefire.booter.ForkedBooter.runSuitesInProcess(ForkedBooter.java:155)
05-Mar-2019 18:53:15         at org.apache.maven.surefire.booter.ForkedBooter.main(ForkedBooter.java:103)
05-Mar-2019 18:53:15
05-Mar-2019 18:53:15 2019-03-05 18:53:15.914  INFO 18635 --- [           main] junit.logTestName                        : Finished Test httpSourceTests(org.springframework.cloud.dataflow.acceptance.test.HttpSourceTests)
05-Mar-2019 18:53:15 2019-03-05 18:53:15.914  INFO 18635 --- [           main] o.s.c.d.acceptance.test.HttpSourceTests  : Destroy all streams
05-Mar-2019 18:53:15 Tests run: 1, Failures: 0, Errors: 1, Skipped: 0, Time elapsed: 0.22 sec <<< FAILURE! - in org.springframework.cloud.dataflow.acceptance.test.HttpSourceTests
05-Mar-2019 18:53:15 httpSourceTests(org.springframework.cloud.dataflow.acceptance.test.HttpSourceTests)  Time elapsed: 0.131 sec  <<< ERROR!
05-Mar-2019 18:53:15 org.springframework.cloud.dataflow.rest.client.DataFlowClientException: Error reading from URL [http://repo.spring.io/libs-release/org/springframework/cloud/stream/app/spring-cloud-stream-app-descriptor/Einstein.GA/spring-cloud-stream-app-descriptor-Einstein.GA.stream-apps-kafka-maven]
05-Mar-2019 18:53:15
05-Mar-2019 18:53:15         at org.springframework.cloud.dataflow.rest.client.VndErrorResponseErrorHandler.handleError(VndErrorResponseErrorHandler.java:63)
05-Mar-2019 18:53:15         at org.springframework.web.client.RestTemplate.handleResponse(RestTemplate.java:667)
05-Mar-2019 18:53:15         at org.springframework.web.client.RestTemplate.doExecute(RestTemplate.java:620)
05-Mar-2019 18:53:15         at org.springframework.web.client.RestTemplate.execute(RestTemplate.java:580)
05-Mar-2019 18:53:15         at org.springframework.web.client.RestTemplate.postForObject(RestTemplate.java:380)
05-Mar-2019 18:53:15         at org.springframework.cloud.dataflow.rest.client.AppRegistryTemplate.importFromResource(AppRegistryTemplate.java:133)
05-Mar-2019 18:53:15         at org.springframework.cloud.dataflow.acceptance.test.AbstractStreamTests.registerApps(AbstractStreamTests.java:231)
05-Mar-2019 18:53:15         at org.springframework.cloud.dataflow.acceptance.test.AbstractStreamTests.setup(AbstractStreamTests.java:129)
05-Mar-2019 18:53:15         at sun.reflect.NativeMethodAccessorImpl.invoke0(Native Method)
05-Mar-2019 18:53:15         at sun.reflect.NativeMethodAccessorImpl.invoke(NativeMethodAccessorImpl.java:62)
05-Mar-2019 18:53:15         at sun.reflect.DelegatingMethodAccessorImpl.invoke(DelegatingMethodAccessorImpl.java:43)
05-Mar-2019 18:53:15         at java.lang.reflect.Method.invoke(Method.java:498)
05-Mar-2019 18:53:15         at org.junit.runners.model.FrameworkMethod$1.runReflectiveCall(FrameworkMethod.java:50)
05-Mar-2019 18:53:15         at org.junit.internal.runners.model.ReflectiveCallable.run(ReflectiveCallable.java:12)
05-Mar-2019 18:53:15         at org.junit.runners.model.FrameworkMethod.invokeExplosively(FrameworkMethod.java:47)
05-Mar-2019 18:53:15         at org.junit.internal.runners.statements.RunBefores.evaluate(RunBefores.java:24)
05-Mar-2019 18:53:15         at org.springframework.test.context.junit4.statements.RunBeforeTestMethodCallbacks.evaluate(RunBeforeTestMethodCallbacks.java:75)
05-Mar-2019 18:53:15         at org.springframework.test.context.junit4.statements.RunAfterTestMethodCallbacks.evaluate(RunAfterTestMethodCallbacks.java:86)
05-Mar-2019 18:53:15         at org.junit.rules.TestWatcher$1.evaluate(TestWatcher.java:55)
05-Mar-2019 18:53:15         at org.junit.rules.ExternalResource$1.evaluate(ExternalResource.java:48)
05-Mar-2019 18:53:15         at org.junit.rules.RunRules.evaluate(RunRules.java:20)
05-Mar-2019 18:53:15         at org.springframework.test.context.junit4.statements.SpringRepeat.evaluate(SpringRepeat.java:84)
05-Mar-2019 18:53:15         at org.junit.runners.ParentRunner.runLeaf(ParentRunner.java:325)
05-Mar-2019 18:53:15         at org.springframework.test.context.junit4.SpringJUnit4ClassRunner.runChild(SpringJUnit4ClassRunner.java:252)
05-Mar-2019 18:53:15         at org.springframework.test.context.junit4.SpringJUnit4ClassRunner.runChild(SpringJUnit4ClassRunner.java:94)
05-Mar-2019 18:53:15         at org.junit.runners.ParentRunner$3.run(ParentRunner.java:290)
05-Mar-2019 18:53:15         at org.junit.runners.ParentRunner$1.schedule(ParentRunner.java:71)
05-Mar-2019 18:53:15         at org.junit.runners.ParentRunner.runChildren(ParentRunner.java:288)
05-Mar-2019 18:53:15         at org.junit.runners.ParentRunner.access$000(ParentRunner.java:58)
05-Mar-2019 18:53:15         at org.junit.runners.ParentRunner$2.evaluate(ParentRunner.java:268)
05-Mar-2019 18:53:15         at org.springframework.test.context.junit4.statements.RunBeforeTestClassCallbacks.evaluate(RunBeforeTestClassCallbacks.java:61)
05-Mar-2019 18:53:15         at org.springframework.test.context.junit4.statements.RunAfterTestClassCallbacks.evaluate(RunAfterTestClassCallbacks.java:70)
05-Mar-2019 18:53:15         at org.junit.runners.ParentRunner.run(ParentRunner.java:363)
05-Mar-2019 18:53:15         at org.springframework.test.context.junit4.SpringJUnit4ClassRunner.run(SpringJUnit4ClassRunner.java:191)
05-Mar-2019 18:53:15         at org.apache.maven.surefire.junit4.JUnit4Provider.execute(JUnit4Provider.java:283)
05-Mar-2019 18:53:15         at org.apache.maven.surefire.junit4.JUnit4Provider.executeWithRerun(JUnit4Provider.java:173)
05-Mar-2019 18:53:15         at org.apache.maven.surefire.junit4.JUnit4Provider.executeTestSet(JUnit4Provider.java:153)
05-Mar-2019 18:53:15         at org.apache.maven.surefire.junit4.JUnit4Provider.invoke(JUnit4Provider.java:128)
05-Mar-2019 18:53:15         at org.apache.maven.surefire.booter.ForkedBooter.invokeProviderInSameClassLoader(ForkedBooter.java:203)
05-Mar-2019 18:53:15         at org.apache.maven.surefire.booter.ForkedBooter.runSuitesInProcess(ForkedBooter.java:155)
05-Mar-2019 18:53:15         at org.apache.maven.surefire.booter.ForkedBooter.main(ForkedBooter.java:103)
05-Mar-2019 18:53:15
05-Mar-2019 18:53:15 Running org.springframework.cloud.dataflow.acceptance.test.TimestampTaskTests
05-Mar-2019 18:53:15 2019-03-05 18:53:15.928  INFO 18635 --- [           main] o.s.c.support.GenericApplicationContext  : Refreshing org.springframework.context.support.GenericApplicationContext@6e4f263e: startup date [Tue Mar 05 18:53:15 UTC 2019]; root of context hierarchy
05-Mar-2019 18:53:16 2019-03-05 18:53:16.029  INFO 18635 --- [           main] junit.logTestName                        : Starting Test timeStampTests(org.springframework.cloud.dataflow.acceptance.test.TimestampTaskTests)
05-Mar-2019 18:53:16 2019-03-05 18:53:16.030  INFO 18635 --- [           main] o.s.c.d.a.test.AbstractTaskTests         : Importing task apps from uri resource: http://repo.spring.io/libs-release/org/springframework/cloud/task/app/spring-cloud-task-app-descriptor/Dearborn.SR1/spring-cloud-task-app-descriptor-Dearborn.SR1.task-apps-maven
05-Mar-2019 18:53:16 2019-03-05 18:53:16.463  INFO 18635 --- [           main] o.s.c.d.a.test.AbstractTaskTests         : Done importing task apps.
05-Mar-2019 18:53:26 2019-03-05 18:53:26.966  INFO 18635 --- [           main] junit.logTestName                        : Test timeStampTests(org.springframework.cloud.dataflow.acceptance.test.TimestampTaskTests) Succeeded
05-Mar-2019 18:53:26 2019-03-05 18:53:26.966  INFO 18635 --- [           main] junit.logTestName                        : Finished Test timeStampTests(org.springframework.cloud.dataflow.acceptance.test.TimestampTaskTests)
05-Mar-2019 18:53:27 2019-03-05 18:53:27.045  INFO 18635 --- [           main] junit.logTestName                        : Starting Test timeStampTestsMultipleLaunch(org.springframework.cloud.dataflow.acceptance.test.TimestampTaskTests)
05-Mar-2019 18:53:47 2019-03-05 18:53:47.466  INFO 18635 --- [           main] junit.logTestName                        : Test timeStampTestsMultipleLaunch(org.springframework.cloud.dataflow.acceptance.test.TimestampTaskTests) Succeeded
05-Mar-2019 18:53:47 2019-03-05 18:53:47.466  INFO 18635 --- [           main] junit.logTestName                        : Finished Test timeStampTestsMultipleLaunch(org.springframework.cloud.dataflow.acceptance.test.TimestampTaskTests)
05-Mar-2019 18:53:47 Tests run: 2, Failures: 0, Errors: 0, Skipped: 0, Time elapsed: 31.531 sec - in org.springframework.cloud.dataflow.acceptance.test.TimestampTaskTests
05-Mar-2019 18:53:47 Running org.springframework.cloud.dataflow.acceptance.test.TickTockTests
05-Mar-2019 18:53:47 2019-03-05 18:53:47.467  INFO 18635 --- [           main] .b.t.c.SpringBootTestContextBootstrapper : Neither @ContextConfiguration nor @ContextHierarchy found for test class [org.springframework.cloud.dataflow.acceptance.test.TickTockTests], using SpringBootContextLoader
05-Mar-2019 18:53:47 2019-03-05 18:53:47.472  INFO 18635 --- [           main] .b.t.c.SpringBootTestContextBootstrapper : Loaded default TestExecutionListener class names from location [META-INF/spring.factories]: [org.springframework.boot.test.mock.mockito.MockitoTestExecutionListener, org.springframework.boot.test.mock.mockito.ResetMocksTestExecutionListener, org.springframework.boot.test.autoconfigure.restdocs.RestDocsTestExecutionListener, org.springframework.boot.test.autoconfigure.web.client.MockRestServiceServerResetTestExecutionListener, org.springframework.boot.test.autoconfigure.web.servlet.MockMvcPrintOnlyOnFailureTestExecutionListener, org.springframework.boot.test.autoconfigure.web.servlet.WebDriverTestExecutionListener, org.springframework.test.context.web.ServletTestExecutionListener, org.springframework.test.context.support.DirtiesContextBeforeModesTestExecutionListener, org.springframework.test.context.support.DependencyInjectionTestExecutionListener, org.springframework.test.context.support.DirtiesContextTestExecutionListener, org.springframework.test.context.transaction.TransactionalTestExecutionListener, org.springframework.test.context.jdbc.SqlScriptsTestExecutionListener]
05-Mar-2019 18:53:47 2019-03-05 18:53:47.474  INFO 18635 --- [           main] .b.t.c.SpringBootTestContextBootstrapper : Using TestExecutionListeners: [org.springframework.test.context.web.ServletTestExecutionListener@80bfa9d, org.springframework.test.context.support.DirtiesContextBeforeModesTestExecutionListener@47c40b56, org.springframework.boot.test.autoconfigure.SpringBootDependencyInjectionTestExecutionListener@4b039c6d, org.springframework.test.context.support.DirtiesContextTestExecutionListener@7f5b9db, org.springframework.test.context.transaction.TransactionalTestExecutionListener@507d64aa, org.springframework.test.context.jdbc.SqlScriptsTestExecutionListener@37045b48, org.springframework.boot.test.autoconfigure.web.servlet.MockMvcPrintOnlyOnFailureTestExecutionListener@60b34931, org.springframework.boot.test.autoconfigure.web.client.MockRestServiceServerResetTestExecutionListener@4aa21f9d, org.springframework.boot.test.mock.mockito.ResetMocksTestExecutionListener@71c17a57, org.springframework.boot.test.autoconfigure.web.servlet.WebDriverTestExecutionListener@640ab13c, org.springframework.boot.test.autoconfigure.restdocs.RestDocsTestExecutionListener@1e0a864d, org.springframework.boot.test.mock.mockito.MockitoTestExecutionListener@440e3ce6]
05-Mar-2019 18:53:47 2019-03-05 18:53:47.563  INFO 18635 --- [           main] junit.logTestName                        : Starting Test tickTockUpdateRollbackTests(org.springframework.cloud.dataflow.acceptance.test.TickTockTests)
05-Mar-2019 18:53:47 2019-03-05 18:53:47.564  INFO 18635 --- [           main] o.s.c.d.acceptance.test.TickTockTests    : Importing stream apps from uri resource: http://repo.spring.io/libs-release/org/springframework/cloud/stream/app/spring-cloud-stream-app-descriptor/Einstein.GA/spring-cloud-stream-app-descriptor-Einstein.GA.stream-apps-kafka-maven
05-Mar-2019 18:53:47 2019-03-05 18:53:47.683 ERROR 18635 --- [           main] junit.logTestName                        : !!! Test tickTockUpdateRollbackTests(org.springframework.cloud.dataflow.acceptance.test.TickTockTests) Failed !!!
05-Mar-2019 18:53:47
05-Mar-2019 18:53:47 org.springframework.cloud.dataflow.rest.client.DataFlowClientException: Error reading from URL [http://repo.spring.io/libs-release/org/springframework/cloud/stream/app/spring-cloud-stream-app-descriptor/Einstein.GA/spring-cloud-stream-app-descriptor-Einstein.GA.stream-apps-kafka-maven]
05-Mar-2019 18:53:47
05-Mar-2019 18:53:47         at org.springframework.cloud.dataflow.rest.client.VndErrorResponseErrorHandler.handleError(VndErrorResponseErrorHandler.java:63)
05-Mar-2019 18:53:47         at org.springframework.web.client.RestTemplate.handleResponse(RestTemplate.java:667)
05-Mar-2019 18:53:47         at org.springframework.web.client.RestTemplate.doExecute(RestTemplate.java:620)
05-Mar-2019 18:53:47         at org.springframework.web.client.RestTemplate.execute(RestTemplate.java:580)
05-Mar-2019 18:53:47         at org.springframework.web.client.RestTemplate.postForObject(RestTemplate.java:380)
05-Mar-2019 18:53:47         at org.springframework.cloud.dataflow.rest.client.AppRegistryTemplate.importFromResource(AppRegistryTemplate.java:133)
05-Mar-2019 18:53:47         at org.springframework.cloud.dataflow.acceptance.test.AbstractStreamTests.registerApps(AbstractStreamTests.java:231)
05-Mar-2019 18:53:47         at org.springframework.cloud.dataflow.acceptance.test.AbstractStreamTests.setup(AbstractStreamTests.java:129)
05-Mar-2019 18:53:47         at sun.reflect.NativeMethodAccessorImpl.invoke0(Native Method)
05-Mar-2019 18:53:47         at sun.reflect.NativeMethodAccessorImpl.invoke(NativeMethodAccessorImpl.java:62)
05-Mar-2019 18:53:47         at sun.reflect.DelegatingMethodAccessorImpl.invoke(DelegatingMethodAccessorImpl.java:43)
05-Mar-2019 18:53:47         at java.lang.reflect.Method.invoke(Method.java:498)
05-Mar-2019 18:53:47         at org.junit.runners.model.FrameworkMethod$1.runReflectiveCall(FrameworkMethod.java:50)
05-Mar-2019 18:53:47         at org.junit.internal.runners.model.ReflectiveCallable.run(ReflectiveCallable.java:12)
05-Mar-2019 18:53:47         at org.junit.runners.model.FrameworkMethod.invokeExplosively(FrameworkMethod.java:47)
05-Mar-2019 18:53:47         at org.junit.internal.runners.statements.RunBefores.evaluate(RunBefores.java:24)
05-Mar-2019 18:53:47         at org.springframework.test.context.junit4.statements.RunBeforeTestMethodCallbacks.evaluate(RunBeforeTestMethodCallbacks.java:75)
05-Mar-2019 18:53:47         at org.springframework.test.context.junit4.statements.RunAfterTestMethodCallbacks.evaluate(RunAfterTestMethodCallbacks.java:86)
05-Mar-2019 18:53:47         at org.junit.rules.TestWatcher$1.evaluate(TestWatcher.java:55)
05-Mar-2019 18:53:47         at org.junit.rules.ExternalResource$1.evaluate(ExternalResource.java:48)
05-Mar-2019 18:53:47         at org.junit.rules.RunRules.evaluate(RunRules.java:20)
05-Mar-2019 18:53:47         at org.springframework.test.context.junit4.statements.SpringRepeat.evaluate(SpringRepeat.java:84)
05-Mar-2019 18:53:47         at org.junit.runners.ParentRunner.runLeaf(ParentRunner.java:325)
05-Mar-2019 18:53:47         at org.springframework.test.context.junit4.SpringJUnit4ClassRunner.runChild(SpringJUnit4ClassRunner.java:252)
05-Mar-2019 18:53:47         at org.springframework.test.context.junit4.SpringJUnit4ClassRunner.runChild(SpringJUnit4ClassRunner.java:94)
05-Mar-2019 18:53:47         at org.junit.runners.ParentRunner$3.run(ParentRunner.java:290)
05-Mar-2019 18:53:47         at org.junit.runners.ParentRunner$1.schedule(ParentRunner.java:71)
05-Mar-2019 18:53:47         at org.junit.runners.ParentRunner.runChildren(ParentRunner.java:288)
05-Mar-2019 18:53:47         at org.junit.runners.ParentRunner.access$000(ParentRunner.java:58)
05-Mar-2019 18:53:47         at org.junit.runners.ParentRunner$2.evaluate(ParentRunner.java:268)
05-Mar-2019 18:53:47         at org.springframework.test.context.junit4.statements.RunBeforeTestClassCallbacks.evaluate(RunBeforeTestClassCallbacks.java:61)
05-Mar-2019 18:53:47         at org.springframework.test.context.junit4.statements.RunAfterTestClassCallbacks.evaluate(RunAfterTestClassCallbacks.java:70)
05-Mar-2019 18:53:47         at org.junit.runners.ParentRunner.run(ParentRunner.java:363)
05-Mar-2019 18:53:47         at org.springframework.test.context.junit4.SpringJUnit4ClassRunner.run(SpringJUnit4ClassRunner.java:191)
05-Mar-2019 18:53:47         at org.apache.maven.surefire.junit4.JUnit4Provider.execute(JUnit4Provider.java:283)
05-Mar-2019 18:53:47         at org.apache.maven.surefire.junit4.JUnit4Provider.executeWithRerun(JUnit4Provider.java:173)
05-Mar-2019 18:53:47         at org.apache.maven.surefire.junit4.JUnit4Provider.executeTestSet(JUnit4Provider.java:153)
05-Mar-2019 18:53:47         at org.apache.maven.surefire.junit4.JUnit4Provider.invoke(JUnit4Provider.java:128)
05-Mar-2019 18:53:47         at org.apache.maven.surefire.booter.ForkedBooter.invokeProviderInSameClassLoader(ForkedBooter.java:203)
05-Mar-2019 18:53:47         at org.apache.maven.surefire.booter.ForkedBooter.runSuitesInProcess(ForkedBooter.java:155)
05-Mar-2019 18:53:47         at org.apache.maven.surefire.booter.ForkedBooter.main(ForkedBooter.java:103)
05-Mar-2019 18:53:47
05-Mar-2019 18:53:47 2019-03-05 18:53:47.683  INFO 18635 --- [           main] junit.logTestName                        : Finished Test tickTockUpdateRollbackTests(org.springframework.cloud.dataflow.acceptance.test.TickTockTests)
05-Mar-2019 18:53:47 2019-03-05 18:53:47.683  INFO 18635 --- [           main] o.s.c.d.acceptance.test.TickTockTests    : Destroy all streams
05-Mar-2019 18:53:47 2019-03-05 18:53:47.753  INFO 18635 --- [           main] junit.logTestName                        : Starting Test tickTockTests(org.springframework.cloud.dataflow.acceptance.test.TickTockTests)
05-Mar-2019 18:53:47 2019-03-05 18:53:47.754  INFO 18635 --- [           main] o.s.c.d.acceptance.test.TickTockTests    : Importing stream apps from uri resource: http://repo.spring.io/libs-release/org/springframework/cloud/stream/app/spring-cloud-stream-app-descriptor/Einstein.GA/spring-cloud-stream-app-descriptor-Einstein.GA.stream-apps-kafka-maven
05-Mar-2019 18:53:47 2019-03-05 18:53:47.875 ERROR 18635 --- [           main] junit.logTestName                        : !!! Test tickTockTests(org.springframework.cloud.dataflow.acceptance.test.TickTockTests) Failed !!!
05-Mar-2019 18:53:47
05-Mar-2019 18:53:47 org.springframework.cloud.dataflow.rest.client.DataFlowClientException: Error reading from URL [http://repo.spring.io/libs-release/org/springframework/cloud/stream/app/spring-cloud-stream-app-descriptor/Einstein.GA/spring-cloud-stream-app-descriptor-Einstein.GA.stream-apps-kafka-maven]
05-Mar-2019 18:53:47
05-Mar-2019 18:53:47         at org.springframework.cloud.dataflow.rest.client.VndErrorResponseErrorHandler.handleError(VndErrorResponseErrorHandler.java:63)
05-Mar-2019 18:53:47         at org.springframework.web.client.RestTemplate.handleResponse(RestTemplate.java:667)
05-Mar-2019 18:53:47         at org.springframework.web.client.RestTemplate.doExecute(RestTemplate.java:620)
05-Mar-2019 18:53:47         at org.springframework.web.client.RestTemplate.execute(RestTemplate.java:580)
05-Mar-2019 18:53:47         at org.springframework.web.client.RestTemplate.postForObject(RestTemplate.java:380)
05-Mar-2019 18:53:47         at org.springframework.cloud.dataflow.rest.client.AppRegistryTemplate.importFromResource(AppRegistryTemplate.java:133)
05-Mar-2019 18:53:47         at org.springframework.cloud.dataflow.acceptance.test.AbstractStreamTests.registerApps(AbstractStreamTests.java:231)
05-Mar-2019 18:53:47         at org.springframework.cloud.dataflow.acceptance.test.AbstractStreamTests.setup(AbstractStreamTests.java:129)
05-Mar-2019 18:53:47         at sun.reflect.NativeMethodAccessorImpl.invoke0(Native Method)
05-Mar-2019 18:53:47         at sun.reflect.NativeMethodAccessorImpl.invoke(NativeMethodAccessorImpl.java:62)
05-Mar-2019 18:53:47         at sun.reflect.DelegatingMethodAccessorImpl.invoke(DelegatingMethodAccessorImpl.java:43)
05-Mar-2019 18:53:47         at java.lang.reflect.Method.invoke(Method.java:498)
05-Mar-2019 18:53:47         at org.junit.runners.model.FrameworkMethod$1.runReflectiveCall(FrameworkMethod.java:50)
05-Mar-2019 18:53:47         at org.junit.internal.runners.model.ReflectiveCallable.run(ReflectiveCallable.java:12)
05-Mar-2019 18:53:47         at org.junit.runners.model.FrameworkMethod.invokeExplosively(FrameworkMethod.java:47)
05-Mar-2019 18:53:47         at org.junit.internal.runners.statements.RunBefores.evaluate(RunBefores.java:24)
05-Mar-2019 18:53:47         at org.springframework.test.context.junit4.statements.RunBeforeTestMethodCallbacks.evaluate(RunBeforeTestMethodCallbacks.java:75)
05-Mar-2019 18:53:47         at org.springframework.test.context.junit4.statements.RunAfterTestMethodCallbacks.evaluate(RunAfterTestMethodCallbacks.java:86)
05-Mar-2019 18:53:47         at org.junit.rules.TestWatcher$1.evaluate(TestWatcher.java:55)
05-Mar-2019 18:53:47         at org.junit.rules.ExternalResource$1.evaluate(ExternalResource.java:48)
05-Mar-2019 18:53:47         at org.junit.rules.RunRules.evaluate(RunRules.java:20)
05-Mar-2019 18:53:47         at org.springframework.test.context.junit4.statements.SpringRepeat.evaluate(SpringRepeat.java:84)
05-Mar-2019 18:53:47         at org.junit.runners.ParentRunner.runLeaf(ParentRunner.java:325)
05-Mar-2019 18:53:47         at org.springframework.test.context.junit4.SpringJUnit4ClassRunner.runChild(SpringJUnit4ClassRunner.java:252)
05-Mar-2019 18:53:47         at org.springframework.test.context.junit4.SpringJUnit4ClassRunner.runChild(SpringJUnit4ClassRunner.java:94)
05-Mar-2019 18:53:47         at org.junit.runners.ParentRunner$3.run(ParentRunner.java:290)
05-Mar-2019 18:53:47         at org.junit.runners.ParentRunner$1.schedule(ParentRunner.java:71)
05-Mar-2019 18:53:47         at org.junit.runners.ParentRunner.runChildren(ParentRunner.java:288)
05-Mar-2019 18:53:47         at org.junit.runners.ParentRunner.access$000(ParentRunner.java:58)
05-Mar-2019 18:53:47         at org.junit.runners.ParentRunner$2.evaluate(ParentRunner.java:268)
05-Mar-2019 18:53:47         at org.springframework.test.context.junit4.statements.RunBeforeTestClassCallbacks.evaluate(RunBeforeTestClassCallbacks.java:61)
05-Mar-2019 18:53:47         at org.springframework.test.context.junit4.statements.RunAfterTestClassCallbacks.evaluate(RunAfterTestClassCallbacks.java:70)
05-Mar-2019 18:53:47         at org.junit.runners.ParentRunner.run(ParentRunner.java:363)
05-Mar-2019 18:53:47         at org.springframework.test.context.junit4.SpringJUnit4ClassRunner.run(SpringJUnit4ClassRunner.java:191)
05-Mar-2019 18:53:47         at org.apache.maven.surefire.junit4.JUnit4Provider.execute(JUnit4Provider.java:283)
05-Mar-2019 18:53:47         at org.apache.maven.surefire.junit4.JUnit4Provider.executeWithRerun(JUnit4Provider.java:173)
05-Mar-2019 18:53:47         at org.apache.maven.surefire.junit4.JUnit4Provider.executeTestSet(JUnit4Provider.java:153)
05-Mar-2019 18:53:47         at org.apache.maven.surefire.junit4.JUnit4Provider.invoke(JUnit4Provider.java:128)
05-Mar-2019 18:53:47         at org.apache.maven.surefire.booter.ForkedBooter.invokeProviderInSameClassLoader(ForkedBooter.java:203)
05-Mar-2019 18:53:47         at org.apache.maven.surefire.booter.ForkedBooter.runSuitesInProcess(ForkedBooter.java:155)
05-Mar-2019 18:53:47         at org.apache.maven.surefire.booter.ForkedBooter.main(ForkedBooter.java:103)
05-Mar-2019 18:53:47
05-Mar-2019 18:53:47 2019-03-05 18:53:47.876  INFO 18635 --- [           main] junit.logTestName                        : Finished Test tickTockTests(org.springframework.cloud.dataflow.acceptance.test.TickTockTests)
05-Mar-2019 18:53:47 2019-03-05 18:53:47.876  INFO 18635 --- [           main] o.s.c.d.acceptance.test.TickTockTests    : Destroy all streams
05-Mar-2019 18:53:47 Tests run: 3, Failures: 0, Errors: 2, Skipped: 1, Time elapsed: 0.422 sec <<< FAILURE! - in org.springframework.cloud.dataflow.acceptance.test.TickTockTests
05-Mar-2019 18:53:47 tickTockUpdateRollbackTests(org.springframework.cloud.dataflow.acceptance.test.TickTockTests)  Time elapsed: 0.124 sec  <<< ERROR!
05-Mar-2019 18:53:47 org.springframework.cloud.dataflow.rest.client.DataFlowClientException: Error reading from URL [http://repo.spring.io/libs-release/org/springframework/cloud/stream/app/spring-cloud-stream-app-descriptor/Einstein.GA/spring-cloud-stream-app-descriptor-Einstein.GA.stream-apps-kafka-maven]
05-Mar-2019 18:53:47
05-Mar-2019 18:53:47         at org.springframework.cloud.dataflow.rest.client.VndErrorResponseErrorHandler.handleError(VndErrorResponseErrorHandler.java:63)
05-Mar-2019 18:53:47         at org.springframework.web.client.RestTemplate.handleResponse(RestTemplate.java:667)
05-Mar-2019 18:53:47         at org.springframework.web.client.RestTemplate.doExecute(RestTemplate.java:620)
05-Mar-2019 18:53:47         at org.springframework.web.client.RestTemplate.execute(RestTemplate.java:580)
05-Mar-2019 18:53:47         at org.springframework.web.client.RestTemplate.postForObject(RestTemplate.java:380)
05-Mar-2019 18:53:47         at org.springframework.cloud.dataflow.rest.client.AppRegistryTemplate.importFromResource(AppRegistryTemplate.java:133)
05-Mar-2019 18:53:47         at org.springframework.cloud.dataflow.acceptance.test.AbstractStreamTests.registerApps(AbstractStreamTests.java:231)
05-Mar-2019 18:53:47         at org.springframework.cloud.dataflow.acceptance.test.AbstractStreamTests.setup(AbstractStreamTests.java:129)
05-Mar-2019 18:53:47         at sun.reflect.NativeMethodAccessorImpl.invoke0(Native Method)
05-Mar-2019 18:53:47         at sun.reflect.NativeMethodAccessorImpl.invoke(NativeMethodAccessorImpl.java:62)
05-Mar-2019 18:53:47         at sun.reflect.DelegatingMethodAccessorImpl.invoke(DelegatingMethodAccessorImpl.java:43)
05-Mar-2019 18:53:47         at java.lang.reflect.Method.invoke(Method.java:498)
05-Mar-2019 18:53:47         at org.junit.runners.model.FrameworkMethod$1.runReflectiveCall(FrameworkMethod.java:50)
05-Mar-2019 18:53:47         at org.junit.internal.runners.model.ReflectiveCallable.run(ReflectiveCallable.java:12)
05-Mar-2019 18:53:47         at org.junit.runners.model.FrameworkMethod.invokeExplosively(FrameworkMethod.java:47)
05-Mar-2019 18:53:47         at org.junit.internal.runners.statements.RunBefores.evaluate(RunBefores.java:24)
05-Mar-2019 18:53:47         at org.springframework.test.context.junit4.statements.RunBeforeTestMethodCallbacks.evaluate(RunBeforeTestMethodCallbacks.java:75)
05-Mar-2019 18:53:47         at org.springframework.test.context.junit4.statements.RunAfterTestMethodCallbacks.evaluate(RunAfterTestMethodCallbacks.java:86)
05-Mar-2019 18:53:47         at org.junit.rules.TestWatcher$1.evaluate(TestWatcher.java:55)
05-Mar-2019 18:53:47         at org.junit.rules.ExternalResource$1.evaluate(ExternalResource.java:48)
05-Mar-2019 18:53:47         at org.junit.rules.RunRules.evaluate(RunRules.java:20)
05-Mar-2019 18:53:47         at org.springframework.test.context.junit4.statements.SpringRepeat.evaluate(SpringRepeat.java:84)
05-Mar-2019 18:53:47         at org.junit.runners.ParentRunner.runLeaf(ParentRunner.java:325)
05-Mar-2019 18:53:47         at org.springframework.test.context.junit4.SpringJUnit4ClassRunner.runChild(SpringJUnit4ClassRunner.java:252)
05-Mar-2019 18:53:47         at org.springframework.test.context.junit4.SpringJUnit4ClassRunner.runChild(SpringJUnit4ClassRunner.java:94)
05-Mar-2019 18:53:47         at org.junit.runners.ParentRunner$3.run(ParentRunner.java:290)
05-Mar-2019 18:53:47         at org.junit.runners.ParentRunner$1.schedule(ParentRunner.java:71)
05-Mar-2019 18:53:47         at org.junit.runners.ParentRunner.runChildren(ParentRunner.java:288)
05-Mar-2019 18:53:47         at org.junit.runners.ParentRunner.access$000(ParentRunner.java:58)
05-Mar-2019 18:53:47         at org.junit.runners.ParentRunner$2.evaluate(ParentRunner.java:268)
05-Mar-2019 18:53:47         at org.springframework.test.context.junit4.statements.RunBeforeTestClassCallbacks.evaluate(RunBeforeTestClassCallbacks.java:61)
05-Mar-2019 18:53:47         at org.springframework.test.context.junit4.statements.RunAfterTestClassCallbacks.evaluate(RunAfterTestClassCallbacks.java:70)
05-Mar-2019 18:53:47         at org.junit.runners.ParentRunner.run(ParentRunner.java:363)
05-Mar-2019 18:53:47         at org.springframework.test.context.junit4.SpringJUnit4ClassRunner.run(SpringJUnit4ClassRunner.java:191)
05-Mar-2019 18:53:47         at org.apache.maven.surefire.junit4.JUnit4Provider.execute(JUnit4Provider.java:283)
05-Mar-2019 18:53:47         at org.apache.maven.surefire.junit4.JUnit4Provider.executeWithRerun(JUnit4Provider.java:173)
05-Mar-2019 18:53:47         at org.apache.maven.surefire.junit4.JUnit4Provider.executeTestSet(JUnit4Provider.java:153)
05-Mar-2019 18:53:47         at org.apache.maven.surefire.junit4.JUnit4Provider.invoke(JUnit4Provider.java:128)
05-Mar-2019 18:53:47         at org.apache.maven.surefire.booter.ForkedBooter.invokeProviderInSameClassLoader(ForkedBooter.java:203)
05-Mar-2019 18:53:47         at org.apache.maven.surefire.booter.ForkedBooter.runSuitesInProcess(ForkedBooter.java:155)
05-Mar-2019 18:53:47         at org.apache.maven.surefire.booter.ForkedBooter.main(ForkedBooter.java:103)
05-Mar-2019 18:53:47
05-Mar-2019 18:53:47 tickTockTests(org.springframework.cloud.dataflow.acceptance.test.TickTockTests)  Time elapsed: 0.135 sec  <<< ERROR!
05-Mar-2019 18:53:47 org.springframework.cloud.dataflow.rest.client.DataFlowClientException: Error reading from URL [http://repo.spring.io/libs-release/org/springframework/cloud/stream/app/spring-cloud-stream-app-descriptor/Einstein.GA/spring-cloud-stream-app-descriptor-Einstein.GA.stream-apps-kafka-maven]
05-Mar-2019 18:53:47
05-Mar-2019 18:53:47         at org.springframework.cloud.dataflow.rest.client.VndErrorResponseErrorHandler.handleError(VndErrorResponseErrorHandler.java:63)
05-Mar-2019 18:53:47         at org.springframework.web.client.RestTemplate.handleResponse(RestTemplate.java:667)
05-Mar-2019 18:53:47         at org.springframework.web.client.RestTemplate.doExecute(RestTemplate.java:620)
05-Mar-2019 18:53:47         at org.springframework.web.client.RestTemplate.execute(RestTemplate.java:580)
05-Mar-2019 18:53:47         at org.springframework.web.client.RestTemplate.postForObject(RestTemplate.java:380)
05-Mar-2019 18:53:47         at org.springframework.cloud.dataflow.rest.client.AppRegistryTemplate.importFromResource(AppRegistryTemplate.java:133)
05-Mar-2019 18:53:47         at org.springframework.cloud.dataflow.acceptance.test.AbstractStreamTests.registerApps(AbstractStreamTests.java:231)
05-Mar-2019 18:53:47         at org.springframework.cloud.dataflow.acceptance.test.AbstractStreamTests.setup(AbstractStreamTests.java:129)
05-Mar-2019 18:53:47         at sun.reflect.NativeMethodAccessorImpl.invoke0(Native Method)
05-Mar-2019 18:53:47         at sun.reflect.NativeMethodAccessorImpl.invoke(NativeMethodAccessorImpl.java:62)
05-Mar-2019 18:53:47         at sun.reflect.DelegatingMethodAccessorImpl.invoke(DelegatingMethodAccessorImpl.java:43)
05-Mar-2019 18:53:47         at java.lang.reflect.Method.invoke(Method.java:498)
05-Mar-2019 18:53:47         at org.junit.runners.model.FrameworkMethod$1.runReflectiveCall(FrameworkMethod.java:50)
05-Mar-2019 18:53:47         at org.junit.internal.runners.model.ReflectiveCallable.run(ReflectiveCallable.java:12)
05-Mar-2019 18:53:47         at org.junit.runners.model.FrameworkMethod.invokeExplosively(FrameworkMethod.java:47)
05-Mar-2019 18:53:47         at org.junit.internal.runners.statements.RunBefores.evaluate(RunBefores.java:24)
05-Mar-2019 18:53:47         at org.springframework.test.context.junit4.statements.RunBeforeTestMethodCallbacks.evaluate(RunBeforeTestMethodCallbacks.java:75)
05-Mar-2019 18:53:47         at org.springframework.test.context.junit4.statements.RunAfterTestMethodCallbacks.evaluate(RunAfterTestMethodCallbacks.java:86)
05-Mar-2019 18:53:47         at org.junit.rules.TestWatcher$1.evaluate(TestWatcher.java:55)
05-Mar-2019 18:53:47         at org.junit.rules.ExternalResource$1.evaluate(ExternalResource.java:48)
05-Mar-2019 18:53:47         at org.junit.rules.RunRules.evaluate(RunRules.java:20)
05-Mar-2019 18:53:47         at org.springframework.test.context.junit4.statements.SpringRepeat.evaluate(SpringRepeat.java:84)
05-Mar-2019 18:53:47         at org.junit.runners.ParentRunner.runLeaf(ParentRunner.java:325)
05-Mar-2019 18:53:47         at org.springframework.test.context.junit4.SpringJUnit4ClassRunner.runChild(SpringJUnit4ClassRunner.java:252)
05-Mar-2019 18:53:47         at org.springframework.test.context.junit4.SpringJUnit4ClassRunner.runChild(SpringJUnit4ClassRunner.java:94)
05-Mar-2019 18:53:47         at org.junit.runners.ParentRunner$3.run(ParentRunner.java:290)
05-Mar-2019 18:53:47         at org.junit.runners.ParentRunner$1.schedule(ParentRunner.java:71)
05-Mar-2019 18:53:47         at org.junit.runners.ParentRunner.runChildren(ParentRunner.java:288)
05-Mar-2019 18:53:47         at org.junit.runners.ParentRunner.access$000(ParentRunner.java:58)
05-Mar-2019 18:53:47         at org.junit.runners.ParentRunner$2.evaluate(ParentRunner.java:268)
05-Mar-2019 18:53:47         at org.springframework.test.context.junit4.statements.RunBeforeTestClassCallbacks.evaluate(RunBeforeTestClassCallbacks.java:61)
05-Mar-2019 18:53:47         at org.springframework.test.context.junit4.statements.RunAfterTestClassCallbacks.evaluate(RunAfterTestClassCallbacks.java:70)
05-Mar-2019 18:53:47         at org.junit.runners.ParentRunner.run(ParentRunner.java:363)
05-Mar-2019 18:53:47         at org.springframework.test.context.junit4.SpringJUnit4ClassRunner.run(SpringJUnit4ClassRunner.java:191)
05-Mar-2019 18:53:47         at org.apache.maven.surefire.junit4.JUnit4Provider.execute(JUnit4Provider.java:283)
05-Mar-2019 18:53:47         at org.apache.maven.surefire.junit4.JUnit4Provider.executeWithRerun(JUnit4Provider.java:173)
05-Mar-2019 18:53:47         at org.apache.maven.surefire.junit4.JUnit4Provider.executeTestSet(JUnit4Provider.java:153)
05-Mar-2019 18:53:47         at org.apache.maven.surefire.junit4.JUnit4Provider.invoke(JUnit4Provider.java:128)
05-Mar-2019 18:53:47         at org.apache.maven.surefire.booter.ForkedBooter.invokeProviderInSameClassLoader(ForkedBooter.java:203)
05-Mar-2019 18:53:47         at org.apache.maven.surefire.booter.ForkedBooter.runSuitesInProcess(ForkedBooter.java:155)
05-Mar-2019 18:53:47         at org.apache.maven.surefire.booter.ForkedBooter.main(ForkedBooter.java:103)
05-Mar-2019 18:53:47
05-Mar-2019 18:53:47 Running org.springframework.cloud.dataflow.acceptance.test.TransformTests
05-Mar-2019 18:53:47 2019-03-05 18:53:47.894  INFO 18635 --- [           main] .b.t.c.SpringBootTestContextBootstrapper : Neither @ContextConfiguration nor @ContextHierarchy found for test class [org.springframework.cloud.dataflow.acceptance.test.TransformTests], using SpringBootContextLoader
05-Mar-2019 18:53:47 2019-03-05 18:53:47.899  INFO 18635 --- [           main] .b.t.c.SpringBootTestContextBootstrapper : Loaded default TestExecutionListener class names from location [META-INF/spring.factories]: [org.springframework.boot.test.mock.mockito.MockitoTestExecutionListener, org.springframework.boot.test.mock.mockito.ResetMocksTestExecutionListener, org.springframework.boot.test.autoconfigure.restdocs.RestDocsTestExecutionListener, org.springframework.boot.test.autoconfigure.web.client.MockRestServiceServerResetTestExecutionListener, org.springframework.boot.test.autoconfigure.web.servlet.MockMvcPrintOnlyOnFailureTestExecutionListener, org.springframework.boot.test.autoconfigure.web.servlet.WebDriverTestExecutionListener, org.springframework.test.context.web.ServletTestExecutionListener, org.springframework.test.context.support.DirtiesContextBeforeModesTestExecutionListener, org.springframework.test.context.support.DependencyInjectionTestExecutionListener, org.springframework.test.context.support.DirtiesContextTestExecutionListener, org.springframework.test.context.transaction.TransactionalTestExecutionListener, org.springframework.test.context.jdbc.SqlScriptsTestExecutionListener]
05-Mar-2019 18:53:47 2019-03-05 18:53:47.901  INFO 18635 --- [           main] .b.t.c.SpringBootTestContextBootstrapper : Using TestExecutionListeners: [org.springframework.test.context.web.ServletTestExecutionListener@6e43ddd6, org.springframework.test.context.support.DirtiesContextBeforeModesTestExecutionListener@51d719bc, org.springframework.boot.test.autoconfigure.SpringBootDependencyInjectionTestExecutionListener@2d38edfd, org.springframework.test.context.support.DirtiesContextTestExecutionListener@1507c3c3, org.springframework.test.context.transaction.TransactionalTestExecutionListener@655a01d8, org.springframework.test.context.jdbc.SqlScriptsTestExecutionListener@c29fe36, org.springframework.boot.test.autoconfigure.web.servlet.MockMvcPrintOnlyOnFailureTestExecutionListener@6614bd4b, org.springframework.boot.test.autoconfigure.web.client.MockRestServiceServerResetTestExecutionListener@4d266391, org.springframework.boot.test.mock.mockito.ResetMocksTestExecutionListener@7847ef2c, org.springframework.boot.test.autoconfigure.web.servlet.WebDriverTestExecutionListener@3b5c665c, org.springframework.boot.test.autoconfigure.restdocs.RestDocsTestExecutionListener@78e17a99, org.springframework.boot.test.mock.mockito.MockitoTestExecutionListener@625a4ff]
05-Mar-2019 18:53:47 2019-03-05 18:53:47.971  INFO 18635 --- [           main] junit.logTestName                        : Starting Test transformTests(org.springframework.cloud.dataflow.acceptance.test.TransformTests)
05-Mar-2019 18:53:47 2019-03-05 18:53:47.972  INFO 18635 --- [           main] o.s.c.d.acceptance.test.TransformTests   : Importing stream apps from uri resource: http://repo.spring.io/libs-release/org/springframework/cloud/stream/app/spring-cloud-stream-app-descriptor/Einstein.GA/spring-cloud-stream-app-descriptor-Einstein.GA.stream-apps-kafka-maven
05-Mar-2019 18:53:48 2019-03-05 18:53:48.090 ERROR 18635 --- [           main] junit.logTestName                        : !!! Test transformTests(org.springframework.cloud.dataflow.acceptance.test.TransformTests) Failed !!!
05-Mar-2019 18:53:48
05-Mar-2019 18:53:48 org.springframework.cloud.dataflow.rest.client.DataFlowClientException: Error reading from URL [http://repo.spring.io/libs-release/org/springframework/cloud/stream/app/spring-cloud-stream-app-descriptor/Einstein.GA/spring-cloud-stream-app-descriptor-Einstein.GA.stream-apps-kafka-maven]
05-Mar-2019 18:53:48
05-Mar-2019 18:53:48         at org.springframework.cloud.dataflow.rest.client.VndErrorResponseErrorHandler.handleError(VndErrorResponseErrorHandler.java:63)
05-Mar-2019 18:53:48         at org.springframework.web.client.RestTemplate.handleResponse(RestTemplate.java:667)
05-Mar-2019 18:53:48         at org.springframework.web.client.RestTemplate.doExecute(RestTemplate.java:620)
05-Mar-2019 18:53:48         at org.springframework.web.client.RestTemplate.execute(RestTemplate.java:580)
05-Mar-2019 18:53:48         at org.springframework.web.client.RestTemplate.postForObject(RestTemplate.java:380)
05-Mar-2019 18:53:48         at org.springframework.cloud.dataflow.rest.client.AppRegistryTemplate.importFromResource(AppRegistryTemplate.java:133)
05-Mar-2019 18:53:48         at org.springframework.cloud.dataflow.acceptance.test.AbstractStreamTests.registerApps(AbstractStreamTests.java:231)
05-Mar-2019 18:53:48         at org.springframework.cloud.dataflow.acceptance.test.AbstractStreamTests.setup(AbstractStreamTests.java:129)
05-Mar-2019 18:53:48         at sun.reflect.NativeMethodAccessorImpl.invoke0(Native Method)
05-Mar-2019 18:53:48         at sun.reflect.NativeMethodAccessorImpl.invoke(NativeMethodAccessorImpl.java:62)
05-Mar-2019 18:53:48         at sun.reflect.DelegatingMethodAccessorImpl.invoke(DelegatingMethodAccessorImpl.java:43)
05-Mar-2019 18:53:48         at java.lang.reflect.Method.invoke(Method.java:498)
05-Mar-2019 18:53:48         at org.junit.runners.model.FrameworkMethod$1.runReflectiveCall(FrameworkMethod.java:50)
05-Mar-2019 18:53:48         at org.junit.internal.runners.model.ReflectiveCallable.run(ReflectiveCallable.java:12)
05-Mar-2019 18:53:48         at org.junit.runners.model.FrameworkMethod.invokeExplosively(FrameworkMethod.java:47)
05-Mar-2019 18:53:48         at org.junit.internal.runners.statements.RunBefores.evaluate(RunBefores.java:24)
05-Mar-2019 18:53:48         at org.springframework.test.context.junit4.statements.RunBeforeTestMethodCallbacks.evaluate(RunBeforeTestMethodCallbacks.java:75)
05-Mar-2019 18:53:48         at org.springframework.test.context.junit4.statements.RunAfterTestMethodCallbacks.evaluate(RunAfterTestMethodCallbacks.java:86)
05-Mar-2019 18:53:48         at org.junit.rules.TestWatcher$1.evaluate(TestWatcher.java:55)
05-Mar-2019 18:53:48         at org.junit.rules.ExternalResource$1.evaluate(ExternalResource.java:48)
05-Mar-2019 18:53:48         at org.junit.rules.RunRules.evaluate(RunRules.java:20)
05-Mar-2019 18:53:48         at org.springframework.test.context.junit4.statements.SpringRepeat.evaluate(SpringRepeat.java:84)
05-Mar-2019 18:53:48         at org.junit.runners.ParentRunner.runLeaf(ParentRunner.java:325)
05-Mar-2019 18:53:48         at org.springframework.test.context.junit4.SpringJUnit4ClassRunner.runChild(SpringJUnit4ClassRunner.java:252)
05-Mar-2019 18:53:48         at org.springframework.test.context.junit4.SpringJUnit4ClassRunner.runChild(SpringJUnit4ClassRunner.java:94)
05-Mar-2019 18:53:48         at org.junit.runners.ParentRunner$3.run(ParentRunner.java:290)
05-Mar-2019 18:53:48         at org.junit.runners.ParentRunner$1.schedule(ParentRunner.java:71)
05-Mar-2019 18:53:48         at org.junit.runners.ParentRunner.runChildren(ParentRunner.java:288)
05-Mar-2019 18:53:48         at org.junit.runners.ParentRunner.access$000(ParentRunner.java:58)
05-Mar-2019 18:53:48         at org.junit.runners.ParentRunner$2.evaluate(ParentRunner.java:268)
05-Mar-2019 18:53:48         at org.springframework.test.context.junit4.statements.RunBeforeTestClassCallbacks.evaluate(RunBeforeTestClassCallbacks.java:61)
05-Mar-2019 18:53:48         at org.springframework.test.context.junit4.statements.RunAfterTestClassCallbacks.evaluate(RunAfterTestClassCallbacks.java:70)
05-Mar-2019 18:53:48         at org.junit.runners.ParentRunner.run(ParentRunner.java:363)
05-Mar-2019 18:53:48         at org.springframework.test.context.junit4.SpringJUnit4ClassRunner.run(SpringJUnit4ClassRunner.java:191)
05-Mar-2019 18:53:48         at org.apache.maven.surefire.junit4.JUnit4Provider.execute(JUnit4Provider.java:283)
05-Mar-2019 18:53:48         at org.apache.maven.surefire.junit4.JUnit4Provider.executeWithRerun(JUnit4Provider.java:173)
05-Mar-2019 18:53:48         at org.apache.maven.surefire.junit4.JUnit4Provider.executeTestSet(JUnit4Provider.java:153)
05-Mar-2019 18:53:48         at org.apache.maven.surefire.junit4.JUnit4Provider.invoke(JUnit4Provider.java:128)
05-Mar-2019 18:53:48         at org.apache.maven.surefire.booter.ForkedBooter.invokeProviderInSameClassLoader(ForkedBooter.java:203)
05-Mar-2019 18:53:48         at org.apache.maven.surefire.booter.ForkedBooter.runSuitesInProcess(ForkedBooter.java:155)
05-Mar-2019 18:53:48         at org.apache.maven.surefire.booter.ForkedBooter.main(ForkedBooter.java:103)
05-Mar-2019 18:53:48
05-Mar-2019 18:53:48 2019-03-05 18:53:48.091  INFO 18635 --- [           main] junit.logTestName                        : Finished Test transformTests(org.springframework.cloud.dataflow.acceptance.test.TransformTests)
05-Mar-2019 18:53:48 2019-03-05 18:53:48.091  INFO 18635 --- [           main] o.s.c.d.acceptance.test.TransformTests   : Destroy all streams
05-Mar-2019 18:53:48 Tests run: 1, Failures: 0, Errors: 1, Skipped: 0, Time elapsed: 0.181 sec <<< FAILURE! - in org.springframework.cloud.dataflow.acceptance.test.TransformTests
05-Mar-2019 18:53:48 transformTests(org.springframework.cloud.dataflow.acceptance.test.TransformTests)  Time elapsed: 0.129 sec  <<< ERROR!
05-Mar-2019 18:53:48 org.springframework.cloud.dataflow.rest.client.DataFlowClientException: Error reading from URL [http://repo.spring.io/libs-release/org/springframework/cloud/stream/app/spring-cloud-stream-app-descriptor/Einstein.GA/spring-cloud-stream-app-descriptor-Einstein.GA.stream-apps-kafka-maven]
05-Mar-2019 18:53:48
05-Mar-2019 18:53:48         at org.springframework.cloud.dataflow.rest.client.VndErrorResponseErrorHandler.handleError(VndErrorResponseErrorHandler.java:63)
05-Mar-2019 18:53:48         at org.springframework.web.client.RestTemplate.handleResponse(RestTemplate.java:667)
05-Mar-2019 18:53:48         at org.springframework.web.client.RestTemplate.doExecute(RestTemplate.java:620)
05-Mar-2019 18:53:48         at org.springframework.web.client.RestTemplate.execute(RestTemplate.java:580)
05-Mar-2019 18:53:48         at org.springframework.web.client.RestTemplate.postForObject(RestTemplate.java:380)
05-Mar-2019 18:53:48         at org.springframework.cloud.dataflow.rest.client.AppRegistryTemplate.importFromResource(AppRegistryTemplate.java:133)
05-Mar-2019 18:53:48         at org.springframework.cloud.dataflow.acceptance.test.AbstractStreamTests.registerApps(AbstractStreamTests.java:231)
05-Mar-2019 18:53:48         at org.springframework.cloud.dataflow.acceptance.test.AbstractStreamTests.setup(AbstractStreamTests.java:129)
05-Mar-2019 18:53:48         at sun.reflect.NativeMethodAccessorImpl.invoke0(Native Method)
05-Mar-2019 18:53:48         at sun.reflect.NativeMethodAccessorImpl.invoke(NativeMethodAccessorImpl.java:62)
05-Mar-2019 18:53:48         at sun.reflect.DelegatingMethodAccessorImpl.invoke(DelegatingMethodAccessorImpl.java:43)
05-Mar-2019 18:53:48         at java.lang.reflect.Method.invoke(Method.java:498)
05-Mar-2019 18:53:48         at org.junit.runners.model.FrameworkMethod$1.runReflectiveCall(FrameworkMethod.java:50)
05-Mar-2019 18:53:48         at org.junit.internal.runners.model.ReflectiveCallable.run(ReflectiveCallable.java:12)
05-Mar-2019 18:53:48         at org.junit.runners.model.FrameworkMethod.invokeExplosively(FrameworkMethod.java:47)
05-Mar-2019 18:53:48         at org.junit.internal.runners.statements.RunBefores.evaluate(RunBefores.java:24)
05-Mar-2019 18:53:48         at org.springframework.test.context.junit4.statements.RunBeforeTestMethodCallbacks.evaluate(RunBeforeTestMethodCallbacks.java:75)
05-Mar-2019 18:53:48         at org.springframework.test.context.junit4.statements.RunAfterTestMethodCallbacks.evaluate(RunAfterTestMethodCallbacks.java:86)
05-Mar-2019 18:53:48         at org.junit.rules.TestWatcher$1.evaluate(TestWatcher.java:55)
05-Mar-2019 18:53:48         at org.junit.rules.ExternalResource$1.evaluate(ExternalResource.java:48)
05-Mar-2019 18:53:48         at org.junit.rules.RunRules.evaluate(RunRules.java:20)
05-Mar-2019 18:53:48         at org.springframework.test.context.junit4.statements.SpringRepeat.evaluate(SpringRepeat.java:84)
05-Mar-2019 18:53:48         at org.junit.runners.ParentRunner.runLeaf(ParentRunner.java:325)
05-Mar-2019 18:53:48         at org.springframework.test.context.junit4.SpringJUnit4ClassRunner.runChild(SpringJUnit4ClassRunner.java:252)
05-Mar-2019 18:53:48         at org.springframework.test.context.junit4.SpringJUnit4ClassRunner.runChild(SpringJUnit4ClassRunner.java:94)
05-Mar-2019 18:53:48         at org.junit.runners.ParentRunner$3.run(ParentRunner.java:290)
05-Mar-2019 18:53:48         at org.junit.runners.ParentRunner$1.schedule(ParentRunner.java:71)
05-Mar-2019 18:53:48         at org.junit.runners.ParentRunner.runChildren(ParentRunner.java:288)
05-Mar-2019 18:53:48         at org.junit.runners.ParentRunner.access$000(ParentRunner.java:58)
05-Mar-2019 18:53:48         at org.junit.runners.ParentRunner$2.evaluate(ParentRunner.java:268)
05-Mar-2019 18:53:48         at org.springframework.test.context.junit4.statements.RunBeforeTestClassCallbacks.evaluate(RunBeforeTestClassCallbacks.java:61)
05-Mar-2019 18:53:48         at org.springframework.test.context.junit4.statements.RunAfterTestClassCallbacks.evaluate(RunAfterTestClassCallbacks.java:70)
05-Mar-2019 18:53:48         at org.junit.runners.ParentRunner.run(ParentRunner.java:363)
05-Mar-2019 18:53:48         at org.springframework.test.context.junit4.SpringJUnit4ClassRunner.run(SpringJUnit4ClassRunner.java:191)
05-Mar-2019 18:53:48         at org.apache.maven.surefire.junit4.JUnit4Provider.execute(JUnit4Provider.java:283)
05-Mar-2019 18:53:48         at org.apache.maven.surefire.junit4.JUnit4Provider.executeWithRerun(JUnit4Provider.java:173)
05-Mar-2019 18:53:48         at org.apache.maven.surefire.junit4.JUnit4Provider.executeTestSet(JUnit4Provider.java:153)
05-Mar-2019 18:53:48         at org.apache.maven.surefire.junit4.JUnit4Provider.invoke(JUnit4Provider.java:128)
05-Mar-2019 18:53:48         at org.apache.maven.surefire.booter.ForkedBooter.invokeProviderInSameClassLoader(ForkedBooter.java:203)
05-Mar-2019 18:53:48         at org.apache.maven.surefire.booter.ForkedBooter.runSuitesInProcess(ForkedBooter.java:155)
05-Mar-2019 18:53:48         at org.apache.maven.surefire.booter.ForkedBooter.main(ForkedBooter.java:103)
05-Mar-2019 18:53:48
05-Mar-2019 18:53:48 Running org.springframework.cloud.dataflow.acceptance.test.SchedulerTests
05-Mar-2019 18:53:48 2019-03-05 18:53:48.211  INFO 18635 --- [           main] s.c.a.AnnotationConfigApplicationContext : Refreshing org.springframework.context.annotation.AnnotationConfigApplicationContext@5f631ca0: startup date [Tue Mar 05 18:53:48 UTC 2019]; root of context hierarchy
05-Mar-2019 18:53:48 2019-03-05 18:53:48.232  INFO 18635 --- [           main] trationDelegate$BeanPostProcessorChecker : Bean 'configurationPropertiesRebinderAutoConfiguration' of type [class org.springframework.cloud.autoconfigure.ConfigurationPropertiesRebinderAutoConfiguration$$EnhancerBySpringCGLIB$$95ff43c0] is not eligible for getting processed by all BeanPostProcessors (for example: not eligible for auto-proxying)
05-Mar-2019 18:53:48
05-Mar-2019 18:53:48   .   ____          _            __ _ _
05-Mar-2019 18:53:48 /\\ / ___'_ __ _ _(_)_ __  __ _ \ \ \ \
05-Mar-2019 18:53:48 ( ( )\___ | '_ | '_| | '_ \/ _` | \ \ \ \
05-Mar-2019 18:53:48 \\/  ___)| |_)| | | | | || (_| |  ) ) ) )
05-Mar-2019 18:53:48   '  |____| .__|_| |_|_| |_\__, | / / / /
05-Mar-2019 18:53:48 =========|_|==============|___/=/_/_/_/
05-Mar-2019 18:53:48 :: Spring Boot ::        (v1.4.1.RELEASE)
05-Mar-2019 18:53:48
05-Mar-2019 18:53:48 2019-03-05 18:53:48.335  INFO 18635 --- [           main] c.c.c.ConfigServicePropertySourceLocator : Fetching config from server at: http://localhost:8888
05-Mar-2019 18:53:48 2019-03-05 18:53:48.338  WARN 18635 --- [           main] c.c.c.ConfigServicePropertySourceLocator : Could not locate PropertySource: I/O error on GET request for "http://localhost:8888//blah": Connection refused (Connection refused); nested exception is java.net.ConnectException: Connection refused (Connection refused)
05-Mar-2019 18:53:48 2019-03-05 18:53:48.339  INFO 18635 --- [           main] o.a.maven.surefire.booter.ForkedBooter   : The following profiles are active: blah
05-Mar-2019 18:53:48 2019-03-05 18:53:48.340  INFO 18635 --- [           main] s.c.a.AnnotationConfigApplicationContext : Refreshing org.springframework.context.annotation.AnnotationConfigApplicationContext@753fd7a1: startup date [Tue Mar 05 18:53:48 UTC 2019]; parent: org.springframework.context.annotation.AnnotationConfigApplicationContext@5f631ca0
05-Mar-2019 18:53:48 2019-03-05 18:53:48.430  INFO 18635 --- [           main] o.a.maven.surefire.booter.ForkedBooter   : Started ForkedBooter in 0.321 seconds (JVM running for 37.683)
05-Mar-2019 18:53:48 2019-03-05 18:53:48.431  INFO 18635 --- [           main] s.c.a.AnnotationConfigApplicationContext : Closing org.springframework.context.annotation.AnnotationConfigApplicationContext@753fd7a1: startup date [Tue Mar 05 18:53:48 UTC 2019]; parent: org.springframework.context.annotation.AnnotationConfigApplicationContext@5f631ca0
05-Mar-2019 18:53:48 2019-03-05 18:53:48.432 ERROR 18635 --- [           main] o.s.c.d.a.test.util.SchedulerRule        : SCHEDULER IS NOT AVAILABLE, SKIPPING TESTS
05-Mar-2019 18:53:48
05-Mar-2019 18:53:48 java.lang.IllegalArgumentException: no SchedulerOperations bean is available.  Skipping test.
05-Mar-2019 18:53:48         at org.springframework.util.Assert.notNull(Assert.java:115)
05-Mar-2019 18:53:48         at org.springframework.cloud.dataflow.acceptance.test.util.SchedulerRule.obtainResource(SchedulerRule.java:57)
05-Mar-2019 18:53:48         at org.springframework.cloud.scheduler.spi.junit.AbstractExternalResourceTestSupport.apply(AbstractExternalResourceTestSupport.java:58)
05-Mar-2019 18:53:48         at org.junit.rules.RunRules.applyAll(RunRules.java:26)
05-Mar-2019 18:53:48         at org.junit.rules.RunRules.<init>(RunRules.java:15)
05-Mar-2019 18:53:48         at org.junit.runners.ParentRunner.withClassRules(ParentRunner.java:245)
05-Mar-2019 18:53:48         at org.junit.runners.ParentRunner.classBlock(ParentRunner.java:194)
05-Mar-2019 18:53:48         at org.junit.runners.ParentRunner.run(ParentRunner.java:362)
05-Mar-2019 18:53:48         at org.springframework.test.context.junit4.SpringJUnit4ClassRunner.run(SpringJUnit4ClassRunner.java:191)
05-Mar-2019 18:53:48         at org.apache.maven.surefire.junit4.JUnit4Provider.execute(JUnit4Provider.java:283)
05-Mar-2019 18:53:48         at org.apache.maven.surefire.junit4.JUnit4Provider.executeWithRerun(JUnit4Provider.java:173)
05-Mar-2019 18:53:48         at org.apache.maven.surefire.junit4.JUnit4Provider.executeTestSet(JUnit4Provider.java:153)
05-Mar-2019 18:53:48         at org.apache.maven.surefire.junit4.JUnit4Provider.invoke(JUnit4Provider.java:128)
05-Mar-2019 18:53:48         at org.apache.maven.surefire.booter.ForkedBooter.invokeProviderInSameClassLoader(ForkedBooter.java:203)
05-Mar-2019 18:53:48         at org.apache.maven.surefire.booter.ForkedBooter.runSuitesInProcess(ForkedBooter.java:155)
05-Mar-2019 18:53:48         at org.apache.maven.surefire.booter.ForkedBooter.main(ForkedBooter.java:103)
05-Mar-2019 18:53:48
05-Mar-2019 18:53:48 Tests run: 1, Failures: 0, Errors: 0, Skipped: 1, Time elapsed: 0.317 sec - in org.springframework.cloud.dataflow.acceptance.test.SchedulerTests
05-Mar-2019 18:53:48 Running org.springframework.cloud.dataflow.acceptance.test.NamedChannelTests
05-Mar-2019 18:53:48 2019-03-05 18:53:48.435  INFO 18635 --- [           main] .b.t.c.SpringBootTestContextBootstrapper : Neither @ContextConfiguration nor @ContextHierarchy found for test class [org.springframework.cloud.dataflow.acceptance.test.NamedChannelTests], using SpringBootContextLoader
05-Mar-2019 18:53:48 2019-03-05 18:53:48.442  INFO 18635 --- [           main] .b.t.c.SpringBootTestContextBootstrapper : Loaded default TestExecutionListener class names from location [META-INF/spring.factories]: [org.springframework.boot.test.mock.mockito.MockitoTestExecutionListener, org.springframework.boot.test.mock.mockito.ResetMocksTestExecutionListener, org.springframework.boot.test.autoconfigure.restdocs.RestDocsTestExecutionListener, org.springframework.boot.test.autoconfigure.web.client.MockRestServiceServerResetTestExecutionListener, org.springframework.boot.test.autoconfigure.web.servlet.MockMvcPrintOnlyOnFailureTestExecutionListener, org.springframework.boot.test.autoconfigure.web.servlet.WebDriverTestExecutionListener, org.springframework.test.context.web.ServletTestExecutionListener, org.springframework.test.context.support.DirtiesContextBeforeModesTestExecutionListener, org.springframework.test.context.support.DependencyInjectionTestExecutionListener, org.springframework.test.context.support.DirtiesContextTestExecutionListener, org.springframework.test.context.transaction.TransactionalTestExecutionListener, org.springframework.test.context.jdbc.SqlScriptsTestExecutionListener]
05-Mar-2019 18:53:48 2019-03-05 18:53:48.447  INFO 18635 --- [           main] .b.t.c.SpringBootTestContextBootstrapper : Using TestExecutionListeners: [org.springframework.test.context.web.ServletTestExecutionListener@682abca7, org.springframework.test.context.support.DirtiesContextBeforeModesTestExecutionListener@1d858300, org.springframework.boot.test.autoconfigure.SpringBootDependencyInjectionTestExecutionListener@76f881d9, org.springframework.test.context.support.DirtiesContextTestExecutionListener@6dd36ab6, org.springframework.test.context.transaction.TransactionalTestExecutionListener@50a13c2f, org.springframework.test.context.jdbc.SqlScriptsTestExecutionListener@610d28b8, org.springframework.boot.test.autoconfigure.web.servlet.MockMvcPrintOnlyOnFailureTestExecutionListener@53c99b09, org.springframework.boot.test.autoconfigure.web.client.MockRestServiceServerResetTestExecutionListener@2539cd1c, org.springframework.boot.test.mock.mockito.ResetMocksTestExecutionListener@7c20cdd0, org.springframework.boot.test.autoconfigure.web.servlet.WebDriverTestExecutionListener@74606204, org.springframework.boot.test.autoconfigure.restdocs.RestDocsTestExecutionListener@6b6eae52, org.springframework.boot.test.mock.mockito.MockitoTestExecutionListener@d4df0e]
05-Mar-2019 18:53:48 2019-03-05 18:53:48.525  INFO 18635 --- [           main] junit.logTestName                        : Starting Test testDestination(org.springframework.cloud.dataflow.acceptance.test.NamedChannelTests)
05-Mar-2019 18:53:48 2019-03-05 18:53:48.526  INFO 18635 --- [           main] o.s.c.d.a.test.NamedChannelTests         : Importing stream apps from uri resource: http://repo.spring.io/libs-release/org/springframework/cloud/stream/app/spring-cloud-stream-app-descriptor/Einstein.GA/spring-cloud-stream-app-descriptor-Einstein.GA.stream-apps-kafka-maven
05-Mar-2019 18:53:48 2019-03-05 18:53:48.639 ERROR 18635 --- [           main] junit.logTestName                        : !!! Test testDestination(org.springframework.cloud.dataflow.acceptance.test.NamedChannelTests) Failed !!!
05-Mar-2019 18:53:48
05-Mar-2019 18:53:48 org.springframework.cloud.dataflow.rest.client.DataFlowClientException: Error reading from URL [http://repo.spring.io/libs-release/org/springframework/cloud/stream/app/spring-cloud-stream-app-descriptor/Einstein.GA/spring-cloud-stream-app-descriptor-Einstein.GA.stream-apps-kafka-maven]
05-Mar-2019 18:53:48
05-Mar-2019 18:53:48         at org.springframework.cloud.dataflow.rest.client.VndErrorResponseErrorHandler.handleError(VndErrorResponseErrorHandler.java:63)
05-Mar-2019 18:53:48         at org.springframework.web.client.RestTemplate.handleResponse(RestTemplate.java:667)
05-Mar-2019 18:53:48         at org.springframework.web.client.RestTemplate.doExecute(RestTemplate.java:620)
05-Mar-2019 18:53:48         at org.springframework.web.client.RestTemplate.execute(RestTemplate.java:580)
05-Mar-2019 18:53:48         at org.springframework.web.client.RestTemplate.postForObject(RestTemplate.java:380)
05-Mar-2019 18:53:48         at org.springframework.cloud.dataflow.rest.client.AppRegistryTemplate.importFromResource(AppRegistryTemplate.java:133)
05-Mar-2019 18:53:48         at org.springframework.cloud.dataflow.acceptance.test.AbstractStreamTests.registerApps(AbstractStreamTests.java:231)
05-Mar-2019 18:53:48         at org.springframework.cloud.dataflow.acceptance.test.AbstractStreamTests.setup(AbstractStreamTests.java:129)
05-Mar-2019 18:53:48         at sun.reflect.NativeMethodAccessorImpl.invoke0(Native Method)
05-Mar-2019 18:53:48         at sun.reflect.NativeMethodAccessorImpl.invoke(NativeMethodAccessorImpl.java:62)
05-Mar-2019 18:53:48         at sun.reflect.DelegatingMethodAccessorImpl.invoke(DelegatingMethodAccessorImpl.java:43)
05-Mar-2019 18:53:48         at java.lang.reflect.Method.invoke(Method.java:498)
05-Mar-2019 18:53:48         at org.junit.runners.model.FrameworkMethod$1.runReflectiveCall(FrameworkMethod.java:50)
05-Mar-2019 18:53:48         at org.junit.internal.runners.model.ReflectiveCallable.run(ReflectiveCallable.java:12)
05-Mar-2019 18:53:48         at org.junit.runners.model.FrameworkMethod.invokeExplosively(FrameworkMethod.java:47)
05-Mar-2019 18:53:48         at org.junit.internal.runners.statements.RunBefores.evaluate(RunBefores.java:24)
05-Mar-2019 18:53:48         at org.springframework.test.context.junit4.statements.RunBeforeTestMethodCallbacks.evaluate(RunBeforeTestMethodCallbacks.java:75)
05-Mar-2019 18:53:48         at org.springframework.test.context.junit4.statements.RunAfterTestMethodCallbacks.evaluate(RunAfterTestMethodCallbacks.java:86)
05-Mar-2019 18:53:48         at org.junit.rules.TestWatcher$1.evaluate(TestWatcher.java:55)
05-Mar-2019 18:53:48         at org.junit.rules.ExternalResource$1.evaluate(ExternalResource.java:48)
05-Mar-2019 18:53:48         at org.junit.rules.RunRules.evaluate(RunRules.java:20)
05-Mar-2019 18:53:48         at org.springframework.test.context.junit4.statements.SpringRepeat.evaluate(SpringRepeat.java:84)
05-Mar-2019 18:53:48         at org.junit.runners.ParentRunner.runLeaf(ParentRunner.java:325)
05-Mar-2019 18:53:48         at org.springframework.test.context.junit4.SpringJUnit4ClassRunner.runChild(SpringJUnit4ClassRunner.java:252)
05-Mar-2019 18:53:48         at org.springframework.test.context.junit4.SpringJUnit4ClassRunner.runChild(SpringJUnit4ClassRunner.java:94)
05-Mar-2019 18:53:48         at org.junit.runners.ParentRunner$3.run(ParentRunner.java:290)
05-Mar-2019 18:53:48         at org.junit.runners.ParentRunner$1.schedule(ParentRunner.java:71)
05-Mar-2019 18:53:48         at org.junit.runners.ParentRunner.runChildren(ParentRunner.java:288)
05-Mar-2019 18:53:48         at org.junit.runners.ParentRunner.access$000(ParentRunner.java:58)
05-Mar-2019 18:53:48         at org.junit.runners.ParentRunner$2.evaluate(ParentRunner.java:268)
05-Mar-2019 18:53:48         at org.springframework.test.context.junit4.statements.RunBeforeTestClassCallbacks.evaluate(RunBeforeTestClassCallbacks.java:61)
05-Mar-2019 18:53:48         at org.springframework.test.context.junit4.statements.RunAfterTestClassCallbacks.evaluate(RunAfterTestClassCallbacks.java:70)
05-Mar-2019 18:53:48         at org.junit.runners.ParentRunner.run(ParentRunner.java:363)
05-Mar-2019 18:53:48         at org.springframework.test.context.junit4.SpringJUnit4ClassRunner.run(SpringJUnit4ClassRunner.java:191)
05-Mar-2019 18:53:48         at org.apache.maven.surefire.junit4.JUnit4Provider.execute(JUnit4Provider.java:283)
05-Mar-2019 18:53:48         at org.apache.maven.surefire.junit4.JUnit4Provider.executeWithRerun(JUnit4Provider.java:173)
05-Mar-2019 18:53:48         at org.apache.maven.surefire.junit4.JUnit4Provider.executeTestSet(JUnit4Provider.java:153)
05-Mar-2019 18:53:48         at org.apache.maven.surefire.junit4.JUnit4Provider.invoke(JUnit4Provider.java:128)
05-Mar-2019 18:53:48         at org.apache.maven.surefire.booter.ForkedBooter.invokeProviderInSameClassLoader(ForkedBooter.java:203)
05-Mar-2019 18:53:48         at org.apache.maven.surefire.booter.ForkedBooter.runSuitesInProcess(ForkedBooter.java:155)
05-Mar-2019 18:53:48         at org.apache.maven.surefire.booter.ForkedBooter.main(ForkedBooter.java:103)
05-Mar-2019 18:53:48
05-Mar-2019 18:53:48 2019-03-05 18:53:48.640  INFO 18635 --- [           main] junit.logTestName                        : Finished Test testDestination(org.springframework.cloud.dataflow.acceptance.test.NamedChannelTests)
05-Mar-2019 18:53:48 2019-03-05 18:53:48.640  INFO 18635 --- [           main] o.s.c.d.a.test.NamedChannelTests         : Destroy all streams
05-Mar-2019 18:53:48 2019-03-05 18:53:48.704  INFO 18635 --- [           main] junit.logTestName                        : Starting Test testTap(org.springframework.cloud.dataflow.acceptance.test.NamedChannelTests)
05-Mar-2019 18:53:48 2019-03-05 18:53:48.705  INFO 18635 --- [           main] o.s.c.d.a.test.NamedChannelTests         : Importing stream apps from uri resource: http://repo.spring.io/libs-release/org/springframework/cloud/stream/app/spring-cloud-stream-app-descriptor/Einstein.GA/spring-cloud-stream-app-descriptor-Einstein.GA.stream-apps-kafka-maven
05-Mar-2019 18:53:48 2019-03-05 18:53:48.823 ERROR 18635 --- [           main] junit.logTestName                        : !!! Test testTap(org.springframework.cloud.dataflow.acceptance.test.NamedChannelTests) Failed !!!
05-Mar-2019 18:53:48
05-Mar-2019 18:53:48 org.springframework.cloud.dataflow.rest.client.DataFlowClientException: Error reading from URL [http://repo.spring.io/libs-release/org/springframework/cloud/stream/app/spring-cloud-stream-app-descriptor/Einstein.GA/spring-cloud-stream-app-descriptor-Einstein.GA.stream-apps-kafka-maven]
05-Mar-2019 18:53:48
05-Mar-2019 18:53:48         at org.springframework.cloud.dataflow.rest.client.VndErrorResponseErrorHandler.handleError(VndErrorResponseErrorHandler.java:63)
05-Mar-2019 18:53:48         at org.springframework.web.client.RestTemplate.handleResponse(RestTemplate.java:667)
05-Mar-2019 18:53:48         at org.springframework.web.client.RestTemplate.doExecute(RestTemplate.java:620)
05-Mar-2019 18:53:48         at org.springframework.web.client.RestTemplate.execute(RestTemplate.java:580)
05-Mar-2019 18:53:48         at org.springframework.web.client.RestTemplate.postForObject(RestTemplate.java:380)
05-Mar-2019 18:53:48         at org.springframework.cloud.dataflow.rest.client.AppRegistryTemplate.importFromResource(AppRegistryTemplate.java:133)
05-Mar-2019 18:53:48         at org.springframework.cloud.dataflow.acceptance.test.AbstractStreamTests.registerApps(AbstractStreamTests.java:231)
05-Mar-2019 18:53:48         at org.springframework.cloud.dataflow.acceptance.test.AbstractStreamTests.setup(AbstractStreamTests.java:129)
05-Mar-2019 18:53:48         at sun.reflect.NativeMethodAccessorImpl.invoke0(Native Method)
05-Mar-2019 18:53:48         at sun.reflect.NativeMethodAccessorImpl.invoke(NativeMethodAccessorImpl.java:62)
05-Mar-2019 18:53:48         at sun.reflect.DelegatingMethodAccessorImpl.invoke(DelegatingMethodAccessorImpl.java:43)
05-Mar-2019 18:53:48         at java.lang.reflect.Method.invoke(Method.java:498)
05-Mar-2019 18:53:48         at org.junit.runners.model.FrameworkMethod$1.runReflectiveCall(FrameworkMethod.java:50)
05-Mar-2019 18:53:48         at org.junit.internal.runners.model.ReflectiveCallable.run(ReflectiveCallable.java:12)
05-Mar-2019 18:53:48         at org.junit.runners.model.FrameworkMethod.invokeExplosively(FrameworkMethod.java:47)
05-Mar-2019 18:53:48         at org.junit.internal.runners.statements.RunBefores.evaluate(RunBefores.java:24)
05-Mar-2019 18:53:48         at org.springframework.test.context.junit4.statements.RunBeforeTestMethodCallbacks.evaluate(RunBeforeTestMethodCallbacks.java:75)
05-Mar-2019 18:53:48         at org.springframework.test.context.junit4.statements.RunAfterTestMethodCallbacks.evaluate(RunAfterTestMethodCallbacks.java:86)
05-Mar-2019 18:53:48         at org.junit.rules.TestWatcher$1.evaluate(TestWatcher.java:55)
05-Mar-2019 18:53:48         at org.junit.rules.ExternalResource$1.evaluate(ExternalResource.java:48)
05-Mar-2019 18:53:48         at org.junit.rules.RunRules.evaluate(RunRules.java:20)
05-Mar-2019 18:53:48         at org.springframework.test.context.junit4.statements.SpringRepeat.evaluate(SpringRepeat.java:84)
05-Mar-2019 18:53:48         at org.junit.runners.ParentRunner.runLeaf(ParentRunner.java:325)
05-Mar-2019 18:53:48         at org.springframework.test.context.junit4.SpringJUnit4ClassRunner.runChild(SpringJUnit4ClassRunner.java:252)
05-Mar-2019 18:53:48         at org.springframework.test.context.junit4.SpringJUnit4ClassRunner.runChild(SpringJUnit4ClassRunner.java:94)
05-Mar-2019 18:53:48         at org.junit.runners.ParentRunner$3.run(ParentRunner.java:290)
05-Mar-2019 18:53:48         at org.junit.runners.ParentRunner$1.schedule(ParentRunner.java:71)
05-Mar-2019 18:53:48         at org.junit.runners.ParentRunner.runChildren(ParentRunner.java:288)
05-Mar-2019 18:53:48         at org.junit.runners.ParentRunner.access$000(ParentRunner.java:58)
05-Mar-2019 18:53:48         at org.junit.runners.ParentRunner$2.evaluate(ParentRunner.java:268)
05-Mar-2019 18:53:48         at org.springframework.test.context.junit4.statements.RunBeforeTestClassCallbacks.evaluate(RunBeforeTestClassCallbacks.java:61)
05-Mar-2019 18:53:48         at org.springframework.test.context.junit4.statements.RunAfterTestClassCallbacks.evaluate(RunAfterTestClassCallbacks.java:70)
05-Mar-2019 18:53:48         at org.junit.runners.ParentRunner.run(ParentRunner.java:363)
05-Mar-2019 18:53:48         at org.springframework.test.context.junit4.SpringJUnit4ClassRunner.run(SpringJUnit4ClassRunner.java:191)
05-Mar-2019 18:53:48         at org.apache.maven.surefire.junit4.JUnit4Provider.execute(JUnit4Provider.java:283)
05-Mar-2019 18:53:48         at org.apache.maven.surefire.junit4.JUnit4Provider.executeWithRerun(JUnit4Provider.java:173)
05-Mar-2019 18:53:48         at org.apache.maven.surefire.junit4.JUnit4Provider.executeTestSet(JUnit4Provider.java:153)
05-Mar-2019 18:53:48         at org.apache.maven.surefire.junit4.JUnit4Provider.invoke(JUnit4Provider.java:128)
05-Mar-2019 18:53:48         at org.apache.maven.surefire.booter.ForkedBooter.invokeProviderInSameClassLoader(ForkedBooter.java:203)
05-Mar-2019 18:53:48         at org.apache.maven.surefire.booter.ForkedBooter.runSuitesInProcess(ForkedBooter.java:155)
05-Mar-2019 18:53:48         at org.apache.maven.surefire.booter.ForkedBooter.main(ForkedBooter.java:103)
05-Mar-2019 18:53:48
05-Mar-2019 18:53:48 2019-03-05 18:53:48.824  INFO 18635 --- [           main] junit.logTestName                        : Finished Test testTap(org.springframework.cloud.dataflow.acceptance.test.NamedChannelTests)
05-Mar-2019 18:53:48 2019-03-05 18:53:48.824  INFO 18635 --- [           main] o.s.c.d.a.test.NamedChannelTests         : Destroy all streams
05-Mar-2019 18:53:48 2019-03-05 18:53:48.897  INFO 18635 --- [           main] junit.logTestName                        : Starting Test manyToOneTest(org.springframework.cloud.dataflow.acceptance.test.NamedChannelTests)
05-Mar-2019 18:53:48 2019-03-05 18:53:48.898  INFO 18635 --- [           main] o.s.c.d.a.test.NamedChannelTests         : Importing stream apps from uri resource: http://repo.spring.io/libs-release/org/springframework/cloud/stream/app/spring-cloud-stream-app-descriptor/Einstein.GA/spring-cloud-stream-app-descriptor-Einstein.GA.stream-apps-kafka-maven
05-Mar-2019 18:53:49 2019-03-05 18:53:49.019 ERROR 18635 --- [           main] junit.logTestName                        : !!! Test manyToOneTest(org.springframework.cloud.dataflow.acceptance.test.NamedChannelTests) Failed !!!
05-Mar-2019 18:53:49
05-Mar-2019 18:53:49 org.springframework.cloud.dataflow.rest.client.DataFlowClientException: Error reading from URL [http://repo.spring.io/libs-release/org/springframework/cloud/stream/app/spring-cloud-stream-app-descriptor/Einstein.GA/spring-cloud-stream-app-descriptor-Einstein.GA.stream-apps-kafka-maven]
05-Mar-2019 18:53:49
05-Mar-2019 18:53:49         at org.springframework.cloud.dataflow.rest.client.VndErrorResponseErrorHandler.handleError(VndErrorResponseErrorHandler.java:63)
05-Mar-2019 18:53:49         at org.springframework.web.client.RestTemplate.handleResponse(RestTemplate.java:667)
05-Mar-2019 18:53:49         at org.springframework.web.client.RestTemplate.doExecute(RestTemplate.java:620)
05-Mar-2019 18:53:49         at org.springframework.web.client.RestTemplate.execute(RestTemplate.java:580)
05-Mar-2019 18:53:49         at org.springframework.web.client.RestTemplate.postForObject(RestTemplate.java:380)
05-Mar-2019 18:53:49         at org.springframework.cloud.dataflow.rest.client.AppRegistryTemplate.importFromResource(AppRegistryTemplate.java:133)
05-Mar-2019 18:53:49         at org.springframework.cloud.dataflow.acceptance.test.AbstractStreamTests.registerApps(AbstractStreamTests.java:231)
05-Mar-2019 18:53:49         at org.springframework.cloud.dataflow.acceptance.test.AbstractStreamTests.setup(AbstractStreamTests.java:129)
05-Mar-2019 18:53:49         at sun.reflect.NativeMethodAccessorImpl.invoke0(Native Method)
05-Mar-2019 18:53:49         at sun.reflect.NativeMethodAccessorImpl.invoke(NativeMethodAccessorImpl.java:62)
05-Mar-2019 18:53:49         at sun.reflect.DelegatingMethodAccessorImpl.invoke(DelegatingMethodAccessorImpl.java:43)
05-Mar-2019 18:53:49         at java.lang.reflect.Method.invoke(Method.java:498)
05-Mar-2019 18:53:49         at org.junit.runners.model.FrameworkMethod$1.runReflectiveCall(FrameworkMethod.java:50)
05-Mar-2019 18:53:49         at org.junit.internal.runners.model.ReflectiveCallable.run(ReflectiveCallable.java:12)
05-Mar-2019 18:53:49         at org.junit.runners.model.FrameworkMethod.invokeExplosively(FrameworkMethod.java:47)
05-Mar-2019 18:53:49         at org.junit.internal.runners.statements.RunBefores.evaluate(RunBefores.java:24)
05-Mar-2019 18:53:49         at org.springframework.test.context.junit4.statements.RunBeforeTestMethodCallbacks.evaluate(RunBeforeTestMethodCallbacks.java:75)
05-Mar-2019 18:53:49         at org.springframework.test.context.junit4.statements.RunAfterTestMethodCallbacks.evaluate(RunAfterTestMethodCallbacks.java:86)
05-Mar-2019 18:53:49         at org.junit.rules.TestWatcher$1.evaluate(TestWatcher.java:55)
05-Mar-2019 18:53:49         at org.junit.rules.ExternalResource$1.evaluate(ExternalResource.java:48)
05-Mar-2019 18:53:49         at org.junit.rules.RunRules.evaluate(RunRules.java:20)
05-Mar-2019 18:53:49         at org.springframework.test.context.junit4.statements.SpringRepeat.evaluate(SpringRepeat.java:84)
05-Mar-2019 18:53:49         at org.junit.runners.ParentRunner.runLeaf(ParentRunner.java:325)
05-Mar-2019 18:53:49         at org.springframework.test.context.junit4.SpringJUnit4ClassRunner.runChild(SpringJUnit4ClassRunner.java:252)
05-Mar-2019 18:53:49         at org.springframework.test.context.junit4.SpringJUnit4ClassRunner.runChild(SpringJUnit4ClassRunner.java:94)
05-Mar-2019 18:53:49         at org.junit.runners.ParentRunner$3.run(ParentRunner.java:290)
05-Mar-2019 18:53:49         at org.junit.runners.ParentRunner$1.schedule(ParentRunner.java:71)
05-Mar-2019 18:53:49         at org.junit.runners.ParentRunner.runChildren(ParentRunner.java:288)
05-Mar-2019 18:53:49         at org.junit.runners.ParentRunner.access$000(ParentRunner.java:58)
05-Mar-2019 18:53:49         at org.junit.runners.ParentRunner$2.evaluate(ParentRunner.java:268)
05-Mar-2019 18:53:49         at org.springframework.test.context.junit4.statements.RunBeforeTestClassCallbacks.evaluate(RunBeforeTestClassCallbacks.java:61)
05-Mar-2019 18:53:49         at org.springframework.test.context.junit4.statements.RunAfterTestClassCallbacks.evaluate(RunAfterTestClassCallbacks.java:70)
05-Mar-2019 18:53:49         at org.junit.runners.ParentRunner.run(ParentRunner.java:363)
05-Mar-2019 18:53:49         at org.springframework.test.context.junit4.SpringJUnit4ClassRunner.run(SpringJUnit4ClassRunner.java:191)
05-Mar-2019 18:53:49         at org.apache.maven.surefire.junit4.JUnit4Provider.execute(JUnit4Provider.java:283)
05-Mar-2019 18:53:49         at org.apache.maven.surefire.junit4.JUnit4Provider.executeWithRerun(JUnit4Provider.java:173)
05-Mar-2019 18:53:49         at org.apache.maven.surefire.junit4.JUnit4Provider.executeTestSet(JUnit4Provider.java:153)
05-Mar-2019 18:53:49         at org.apache.maven.surefire.junit4.JUnit4Provider.invoke(JUnit4Provider.java:128)
05-Mar-2019 18:53:49         at org.apache.maven.surefire.booter.ForkedBooter.invokeProviderInSameClassLoader(ForkedBooter.java:203)
05-Mar-2019 18:53:49         at org.apache.maven.surefire.booter.ForkedBooter.runSuitesInProcess(ForkedBooter.java:155)
05-Mar-2019 18:53:49         at org.apache.maven.surefire.booter.ForkedBooter.main(ForkedBooter.java:103)
05-Mar-2019 18:53:49
05-Mar-2019 18:53:49 2019-03-05 18:53:49.020  INFO 18635 --- [           main] junit.logTestName                        : Finished Test manyToOneTest(org.springframework.cloud.dataflow.acceptance.test.NamedChannelTests)
05-Mar-2019 18:53:49 2019-03-05 18:53:49.020  INFO 18635 --- [           main] o.s.c.d.a.test.NamedChannelTests         : Destroy all streams
05-Mar-2019 18:53:49 Tests run: 4, Failures: 0, Errors: 3, Skipped: 1, Time elapsed: 0.589 sec <<< FAILURE! - in org.springframework.cloud.dataflow.acceptance.test.NamedChannelTests
05-Mar-2019 18:53:49 testDestination(org.springframework.cloud.dataflow.acceptance.test.NamedChannelTests)  Time elapsed: 0.122 sec  <<< ERROR!
05-Mar-2019 18:53:49 org.springframework.cloud.dataflow.rest.client.DataFlowClientException: Error reading from URL [http://repo.spring.io/libs-release/org/springframework/cloud/stream/app/spring-cloud-stream-app-descriptor/Einstein.GA/spring-cloud-stream-app-descriptor-Einstein.GA.stream-apps-kafka-maven]
05-Mar-2019 18:53:49
05-Mar-2019 18:53:49         at org.springframework.cloud.dataflow.rest.client.VndErrorResponseErrorHandler.handleError(VndErrorResponseErrorHandler.java:63)
05-Mar-2019 18:53:49         at org.springframework.web.client.RestTemplate.handleResponse(RestTemplate.java:667)
05-Mar-2019 18:53:49         at org.springframework.web.client.RestTemplate.doExecute(RestTemplate.java:620)
05-Mar-2019 18:53:49         at org.springframework.web.client.RestTemplate.execute(RestTemplate.java:580)
05-Mar-2019 18:53:49         at org.springframework.web.client.RestTemplate.postForObject(RestTemplate.java:380)
05-Mar-2019 18:53:49         at org.springframework.cloud.dataflow.rest.client.AppRegistryTemplate.importFromResource(AppRegistryTemplate.java:133)
05-Mar-2019 18:53:49         at org.springframework.cloud.dataflow.acceptance.test.AbstractStreamTests.registerApps(AbstractStreamTests.java:231)
05-Mar-2019 18:53:49         at org.springframework.cloud.dataflow.acceptance.test.AbstractStreamTests.setup(AbstractStreamTests.java:129)
05-Mar-2019 18:53:49         at sun.reflect.NativeMethodAccessorImpl.invoke0(Native Method)
05-Mar-2019 18:53:49         at sun.reflect.NativeMethodAccessorImpl.invoke(NativeMethodAccessorImpl.java:62)
05-Mar-2019 18:53:49         at sun.reflect.DelegatingMethodAccessorImpl.invoke(DelegatingMethodAccessorImpl.java:43)
05-Mar-2019 18:53:49         at java.lang.reflect.Method.invoke(Method.java:498)
05-Mar-2019 18:53:49         at org.junit.runners.model.FrameworkMethod$1.runReflectiveCall(FrameworkMethod.java:50)
05-Mar-2019 18:53:49         at org.junit.internal.runners.model.ReflectiveCallable.run(ReflectiveCallable.java:12)
05-Mar-2019 18:53:49         at org.junit.runners.model.FrameworkMethod.invokeExplosively(FrameworkMethod.java:47)
05-Mar-2019 18:53:49         at org.junit.internal.runners.statements.RunBefores.evaluate(RunBefores.java:24)
05-Mar-2019 18:53:49         at org.springframework.test.context.junit4.statements.RunBeforeTestMethodCallbacks.evaluate(RunBeforeTestMethodCallbacks.java:75)
05-Mar-2019 18:53:49         at org.springframework.test.context.junit4.statements.RunAfterTestMethodCallbacks.evaluate(RunAfterTestMethodCallbacks.java:86)
05-Mar-2019 18:53:49         at org.junit.rules.TestWatcher$1.evaluate(TestWatcher.java:55)
05-Mar-2019 18:53:49         at org.junit.rules.ExternalResource$1.evaluate(ExternalResource.java:48)
05-Mar-2019 18:53:49         at org.junit.rules.RunRules.evaluate(RunRules.java:20)
05-Mar-2019 18:53:49         at org.springframework.test.context.junit4.statements.SpringRepeat.evaluate(SpringRepeat.java:84)
05-Mar-2019 18:53:49         at org.junit.runners.ParentRunner.runLeaf(ParentRunner.java:325)
05-Mar-2019 18:53:49         at org.springframework.test.context.junit4.SpringJUnit4ClassRunner.runChild(SpringJUnit4ClassRunner.java:252)
05-Mar-2019 18:53:49         at org.springframework.test.context.junit4.SpringJUnit4ClassRunner.runChild(SpringJUnit4ClassRunner.java:94)
05-Mar-2019 18:53:49         at org.junit.runners.ParentRunner$3.run(ParentRunner.java:290)
05-Mar-2019 18:53:49         at org.junit.runners.ParentRunner$1.schedule(ParentRunner.java:71)
05-Mar-2019 18:53:49         at org.junit.runners.ParentRunner.runChildren(ParentRunner.java:288)
05-Mar-2019 18:53:49         at org.junit.runners.ParentRunner.access$000(ParentRunner.java:58)
05-Mar-2019 18:53:49         at org.junit.runners.ParentRunner$2.evaluate(ParentRunner.java:268)
05-Mar-2019 18:53:49         at org.springframework.test.context.junit4.statements.RunBeforeTestClassCallbacks.evaluate(RunBeforeTestClassCallbacks.java:61)
05-Mar-2019 18:53:49         at org.springframework.test.context.junit4.statements.RunAfterTestClassCallbacks.evaluate(RunAfterTestClassCallbacks.java:70)
05-Mar-2019 18:53:49         at org.junit.runners.ParentRunner.run(ParentRunner.java:363)
05-Mar-2019 18:53:49         at org.springframework.test.context.junit4.SpringJUnit4ClassRunner.run(SpringJUnit4ClassRunner.java:191)
05-Mar-2019 18:53:49         at org.apache.maven.surefire.junit4.JUnit4Provider.execute(JUnit4Provider.java:283)
05-Mar-2019 18:53:49         at org.apache.maven.surefire.junit4.JUnit4Provider.executeWithRerun(JUnit4Provider.java:173)
05-Mar-2019 18:53:49         at org.apache.maven.surefire.junit4.JUnit4Provider.executeTestSet(JUnit4Provider.java:153)
05-Mar-2019 18:53:49         at org.apache.maven.surefire.junit4.JUnit4Provider.invoke(JUnit4Provider.java:128)
05-Mar-2019 18:53:49         at org.apache.maven.surefire.booter.ForkedBooter.invokeProviderInSameClassLoader(ForkedBooter.java:203)
05-Mar-2019 18:53:49         at org.apache.maven.surefire.booter.ForkedBooter.runSuitesInProcess(ForkedBooter.java:155)
05-Mar-2019 18:53:49         at org.apache.maven.surefire.booter.ForkedBooter.main(ForkedBooter.java:103)
05-Mar-2019 18:53:49
05-Mar-2019 18:53:49 testTap(org.springframework.cloud.dataflow.acceptance.test.NamedChannelTests)  Time elapsed: 0.126 sec  <<< ERROR!
05-Mar-2019 18:53:49 org.springframework.cloud.dataflow.rest.client.DataFlowClientException: Error reading from URL [http://repo.spring.io/libs-release/org/springframework/cloud/stream/app/spring-cloud-stream-app-descriptor/Einstein.GA/spring-cloud-stream-app-descriptor-Einstein.GA.stream-apps-kafka-maven]
05-Mar-2019 18:53:49
05-Mar-2019 18:53:49         at org.springframework.cloud.dataflow.rest.client.VndErrorResponseErrorHandler.handleError(VndErrorResponseErrorHandler.java:63)
05-Mar-2019 18:53:49         at org.springframework.web.client.RestTemplate.handleResponse(RestTemplate.java:667)
05-Mar-2019 18:53:49         at org.springframework.web.client.RestTemplate.doExecute(RestTemplate.java:620)
05-Mar-2019 18:53:49         at org.springframework.web.client.RestTemplate.execute(RestTemplate.java:580)
05-Mar-2019 18:53:49         at org.springframework.web.client.RestTemplate.postForObject(RestTemplate.java:380)
05-Mar-2019 18:53:49         at org.springframework.cloud.dataflow.rest.client.AppRegistryTemplate.importFromResource(AppRegistryTemplate.java:133)
05-Mar-2019 18:53:49         at org.springframework.cloud.dataflow.acceptance.test.AbstractStreamTests.registerApps(AbstractStreamTests.java:231)
05-Mar-2019 18:53:49         at org.springframework.cloud.dataflow.acceptance.test.AbstractStreamTests.setup(AbstractStreamTests.java:129)
05-Mar-2019 18:53:49         at sun.reflect.NativeMethodAccessorImpl.invoke0(Native Method)
05-Mar-2019 18:53:49         at sun.reflect.NativeMethodAccessorImpl.invoke(NativeMethodAccessorImpl.java:62)
05-Mar-2019 18:53:49         at sun.reflect.DelegatingMethodAccessorImpl.invoke(DelegatingMethodAccessorImpl.java:43)
05-Mar-2019 18:53:49         at java.lang.reflect.Method.invoke(Method.java:498)
05-Mar-2019 18:53:49         at org.junit.runners.model.FrameworkMethod$1.runReflectiveCall(FrameworkMethod.java:50)
05-Mar-2019 18:53:49         at org.junit.internal.runners.model.ReflectiveCallable.run(ReflectiveCallable.java:12)
05-Mar-2019 18:53:49         at org.junit.runners.model.FrameworkMethod.invokeExplosively(FrameworkMethod.java:47)
05-Mar-2019 18:53:49         at org.junit.internal.runners.statements.RunBefores.evaluate(RunBefores.java:24)
05-Mar-2019 18:53:49         at org.springframework.test.context.junit4.statements.RunBeforeTestMethodCallbacks.evaluate(RunBeforeTestMethodCallbacks.java:75)
05-Mar-2019 18:53:49         at org.springframework.test.context.junit4.statements.RunAfterTestMethodCallbacks.evaluate(RunAfterTestMethodCallbacks.java:86)
05-Mar-2019 18:53:49         at org.junit.rules.TestWatcher$1.evaluate(TestWatcher.java:55)
05-Mar-2019 18:53:49         at org.junit.rules.ExternalResource$1.evaluate(ExternalResource.java:48)
05-Mar-2019 18:53:49         at org.junit.rules.RunRules.evaluate(RunRules.java:20)
05-Mar-2019 18:53:49         at org.springframework.test.context.junit4.statements.SpringRepeat.evaluate(SpringRepeat.java:84)
05-Mar-2019 18:53:49         at org.junit.runners.ParentRunner.runLeaf(ParentRunner.java:325)
05-Mar-2019 18:53:49         at org.springframework.test.context.junit4.SpringJUnit4ClassRunner.runChild(SpringJUnit4ClassRunner.java:252)
05-Mar-2019 18:53:49         at org.springframework.test.context.junit4.SpringJUnit4ClassRunner.runChild(SpringJUnit4ClassRunner.java:94)
05-Mar-2019 18:53:49         at org.junit.runners.ParentRunner$3.run(ParentRunner.java:290)
05-Mar-2019 18:53:49         at org.junit.runners.ParentRunner$1.schedule(ParentRunner.java:71)
05-Mar-2019 18:53:49         at org.junit.runners.ParentRunner.runChildren(ParentRunner.java:288)
05-Mar-2019 18:53:49         at org.junit.runners.ParentRunner.access$000(ParentRunner.java:58)
05-Mar-2019 18:53:49         at org.junit.runners.ParentRunner$2.evaluate(ParentRunner.java:268)
05-Mar-2019 18:53:49         at org.springframework.test.context.junit4.statements.RunBeforeTestClassCallbacks.evaluate(RunBeforeTestClassCallbacks.java:61)
05-Mar-2019 18:53:49         at org.springframework.test.context.junit4.statements.RunAfterTestClassCallbacks.evaluate(RunAfterTestClassCallbacks.java:70)
05-Mar-2019 18:53:49         at org.junit.runners.ParentRunner.run(ParentRunner.java:363)
05-Mar-2019 18:53:49         at org.springframework.test.context.junit4.SpringJUnit4ClassRunner.run(SpringJUnit4ClassRunner.java:191)
05-Mar-2019 18:53:49         at org.apache.maven.surefire.junit4.JUnit4Provider.execute(JUnit4Provider.java:283)
05-Mar-2019 18:53:49         at org.apache.maven.surefire.junit4.JUnit4Provider.executeWithRerun(JUnit4Provider.java:173)
05-Mar-2019 18:53:49         at org.apache.maven.surefire.junit4.JUnit4Provider.executeTestSet(JUnit4Provider.java:153)
05-Mar-2019 18:53:49         at org.apache.maven.surefire.junit4.JUnit4Provider.invoke(JUnit4Provider.java:128)
05-Mar-2019 18:53:49         at org.apache.maven.surefire.booter.ForkedBooter.invokeProviderInSameClassLoader(ForkedBooter.java:203)
05-Mar-2019 18:53:49         at org.apache.maven.surefire.booter.ForkedBooter.runSuitesInProcess(ForkedBooter.java:155)
05-Mar-2019 18:53:49         at org.apache.maven.surefire.booter.ForkedBooter.main(ForkedBooter.java:103)
05-Mar-2019 18:53:49
05-Mar-2019 18:53:49 manyToOneTest(org.springframework.cloud.dataflow.acceptance.test.NamedChannelTests)  Time elapsed: 0.13 sec  <<< ERROR!
05-Mar-2019 18:53:49 org.springframework.cloud.dataflow.rest.client.DataFlowClientException: Error reading from URL [http://repo.spring.io/libs-release/org/springframework/cloud/stream/app/spring-cloud-stream-app-descriptor/Einstein.GA/spring-cloud-stream-app-descriptor-Einstein.GA.stream-apps-kafka-maven]
05-Mar-2019 18:53:49
05-Mar-2019 18:53:49         at org.springframework.cloud.dataflow.rest.client.VndErrorResponseErrorHandler.handleError(VndErrorResponseErrorHandler.java:63)
05-Mar-2019 18:53:49         at org.springframework.web.client.RestTemplate.handleResponse(RestTemplate.java:667)
05-Mar-2019 18:53:49         at org.springframework.web.client.RestTemplate.doExecute(RestTemplate.java:620)
05-Mar-2019 18:53:49         at org.springframework.web.client.RestTemplate.execute(RestTemplate.java:580)
05-Mar-2019 18:53:49         at org.springframework.web.client.RestTemplate.postForObject(RestTemplate.java:380)
05-Mar-2019 18:53:49         at org.springframework.cloud.dataflow.rest.client.AppRegistryTemplate.importFromResource(AppRegistryTemplate.java:133)
05-Mar-2019 18:53:49         at org.springframework.cloud.dataflow.acceptance.test.AbstractStreamTests.registerApps(AbstractStreamTests.java:231)
05-Mar-2019 18:53:49         at org.springframework.cloud.dataflow.acceptance.test.AbstractStreamTests.setup(AbstractStreamTests.java:129)
05-Mar-2019 18:53:49         at sun.reflect.NativeMethodAccessorImpl.invoke0(Native Method)
05-Mar-2019 18:53:49         at sun.reflect.NativeMethodAccessorImpl.invoke(NativeMethodAccessorImpl.java:62)
05-Mar-2019 18:53:49         at sun.reflect.DelegatingMethodAccessorImpl.invoke(DelegatingMethodAccessorImpl.java:43)
05-Mar-2019 18:53:49         at java.lang.reflect.Method.invoke(Method.java:498)
05-Mar-2019 18:53:49         at org.junit.runners.model.FrameworkMethod$1.runReflectiveCall(FrameworkMethod.java:50)
05-Mar-2019 18:53:49         at org.junit.internal.runners.model.ReflectiveCallable.run(ReflectiveCallable.java:12)
05-Mar-2019 18:53:49         at org.junit.runners.model.FrameworkMethod.invokeExplosively(FrameworkMethod.java:47)
05-Mar-2019 18:53:49         at org.junit.internal.runners.statements.RunBefores.evaluate(RunBefores.java:24)
05-Mar-2019 18:53:49         at org.springframework.test.context.junit4.statements.RunBeforeTestMethodCallbacks.evaluate(RunBeforeTestMethodCallbacks.java:75)
05-Mar-2019 18:53:49         at org.springframework.test.context.junit4.statements.RunAfterTestMethodCallbacks.evaluate(RunAfterTestMethodCallbacks.java:86)
05-Mar-2019 18:53:49         at org.junit.rules.TestWatcher$1.evaluate(TestWatcher.java:55)
05-Mar-2019 18:53:49         at org.junit.rules.ExternalResource$1.evaluate(ExternalResource.java:48)
05-Mar-2019 18:53:49         at org.junit.rules.RunRules.evaluate(RunRules.java:20)
05-Mar-2019 18:53:49         at org.springframework.test.context.junit4.statements.SpringRepeat.evaluate(SpringRepeat.java:84)
05-Mar-2019 18:53:49         at org.junit.runners.ParentRunner.runLeaf(ParentRunner.java:325)
05-Mar-2019 18:53:49         at org.springframework.test.context.junit4.SpringJUnit4ClassRunner.runChild(SpringJUnit4ClassRunner.java:252)
05-Mar-2019 18:53:49         at org.springframework.test.context.junit4.SpringJUnit4ClassRunner.runChild(SpringJUnit4ClassRunner.java:94)
05-Mar-2019 18:53:49         at org.junit.runners.ParentRunner$3.run(ParentRunner.java:290)
05-Mar-2019 18:53:49         at org.junit.runners.ParentRunner$1.schedule(ParentRunner.java:71)
05-Mar-2019 18:53:49         at org.junit.runners.ParentRunner.runChildren(ParentRunner.java:288)
05-Mar-2019 18:53:49         at org.junit.runners.ParentRunner.access$000(ParentRunner.java:58)
05-Mar-2019 18:53:49         at org.junit.runners.ParentRunner$2.evaluate(ParentRunner.java:268)
05-Mar-2019 18:53:49         at org.springframework.test.context.junit4.statements.RunBeforeTestClassCallbacks.evaluate(RunBeforeTestClassCallbacks.java:61)
05-Mar-2019 18:53:49         at org.springframework.test.context.junit4.statements.RunAfterTestClassCallbacks.evaluate(RunAfterTestClassCallbacks.java:70)
05-Mar-2019 18:53:49         at org.junit.runners.ParentRunner.run(ParentRunner.java:363)
05-Mar-2019 18:53:49         at org.springframework.test.context.junit4.SpringJUnit4ClassRunner.run(SpringJUnit4ClassRunner.java:191)
05-Mar-2019 18:53:49         at org.apache.maven.surefire.junit4.JUnit4Provider.execute(JUnit4Provider.java:283)
05-Mar-2019 18:53:49         at org.apache.maven.surefire.junit4.JUnit4Provider.executeWithRerun(JUnit4Provider.java:173)
05-Mar-2019 18:53:49         at org.apache.maven.surefire.junit4.JUnit4Provider.executeTestSet(JUnit4Provider.java:153)
05-Mar-2019 18:53:49         at org.apache.maven.surefire.junit4.JUnit4Provider.invoke(JUnit4Provider.java:128)
05-Mar-2019 18:53:49         at org.apache.maven.surefire.booter.ForkedBooter.invokeProviderInSameClassLoader(ForkedBooter.java:203)
05-Mar-2019 18:53:49         at org.apache.maven.surefire.booter.ForkedBooter.runSuitesInProcess(ForkedBooter.java:155)
05-Mar-2019 18:53:49         at org.apache.maven.surefire.booter.ForkedBooter.main(ForkedBooter.java:103)
05-Mar-2019 18:53:49
05-Mar-2019 18:53:49 Running org.springframework.cloud.dataflow.acceptance.test.util.PlatformHelperTests
05-Mar-2019 18:53:49 Tests run: 3, Failures: 0, Errors: 0, Skipped: 0, Time elapsed: 0.072 sec - in org.springframework.cloud.dataflow.acceptance.test.util.PlatformHelperTests
05-Mar-2019 18:53:49 Running org.springframework.cloud.dataflow.acceptance.test.util.ApplicationTests
05-Mar-2019 18:53:49 Tests run: 2, Failures: 0, Errors: 0, Skipped: 0, Time elapsed: 0 sec - in org.springframework.cloud.dataflow.acceptance.test.util.ApplicationTests
05-Mar-2019 18:53:49 2019-03-05 18:53:49.125  INFO 18635 --- [       Thread-6] o.s.c.support.GenericApplicationContext  : Closing org.springframework.context.support.GenericApplicationContext@6e4f263e: startup date [Tue Mar 05 18:53:15 UTC 2019]; root of context hierarchy
05-Mar-2019 18:53:49
05-Mar-2019 18:53:49 Results :
05-Mar-2019 18:53:49
05-Mar-2019 18:53:49 Tests in error:
05-Mar-2019 18:53:49   AnalyticsTests>AbstractStreamTests.setup:129->AbstractStreamTests.registerApps:231 » DataFlowClient
05-Mar-2019 18:53:49   HttpSourceTests>AbstractStreamTests.setup:129->AbstractStreamTests.registerApps:231 » DataFlowClient
05-Mar-2019 18:53:49   NamedChannelTests>AbstractStreamTests.setup:129->AbstractStreamTests.registerApps:231 » DataFlowClient
05-Mar-2019 18:53:49   NamedChannelTests>AbstractStreamTests.setup:129->AbstractStreamTests.registerApps:231 » DataFlowClient
05-Mar-2019 18:53:49   NamedChannelTests>AbstractStreamTests.setup:129->AbstractStreamTests.registerApps:231 » DataFlowClient
05-Mar-2019 18:53:49   TickTockTests>AbstractStreamTests.setup:129->AbstractStreamTests.registerApps:231 » DataFlowClient
05-Mar-2019 18:53:49   TickTockTests>AbstractStreamTests.setup:129->AbstractStreamTests.registerApps:231 » DataFlowClient
05-Mar-2019 18:53:49   TransformTests>AbstractStreamTests.setup:129->AbstractStreamTests.registerApps:231 » DataFlowClient
05-Mar-2019 18:53:49   WoodChuckTests>AbstractStreamTests.setup:129->AbstractStreamTests.registerApps:231 » DataFlowClient
05-Mar-2019 18:53:49
05-Mar-2019 18:53:49 Tests run: 19, Failures: 0, Errors: 9, Skipped: 3
05-Mar-2019 18:53:49
05-Mar-2019 18:53:49 [INFO] ------------------------------------------------------------------------
05-Mar-2019 18:53:49 [INFO] BUILD FAILURE
05-Mar-2019 18:53:49 [INFO] ------------------------------------------------------------------------
05-Mar-2019 18:53:49 [INFO] Total time: 41.420 s
05-Mar-2019 18:53:49 [INFO] Finished at: 2019-03-05T18:53:49+00:00
05-Mar-2019 18:53:49 [INFO] Final Memory: 56M/463M
05-Mar-2019 18:53:49 [INFO] ------------------------------------------------------------------------
05-Mar-2019 18:53:49 [ERROR] Failed to execute goal org.apache.maven.plugins:maven-surefire-plugin:2.18.1:test (default-test) on project spring-cloud-dataflow-acceptance-tests: There are test failures.
05-Mar-2019 18:53:49 [ERROR]
05-Mar-2019 18:53:49 [ERROR] Please refer to /opt/bamboo-home/xml-data/build-dir/SCDT-LOCAL20XSKIPPER20X-KAFKA/target/surefire-reports for the individual test results.
05-Mar-2019 18:53:49 [ERROR] -> [Help 1]
05-Mar-2019 18:53:49 [ERROR]
05-Mar-2019 18:53:49 [ERROR] To see the full stack trace of the errors, re-run Maven with the -e switch.
05-Mar-2019 18:53:49 [ERROR] Re-run Maven using the -X switch to enable full debug logging.
05-Mar-2019 18:53:49 [ERROR]
05-Mar-2019 18:53:49 [ERROR] For more information about the errors and possible solutions, please read the following articles:
05-Mar-2019 18:53:49 [ERROR] [Help 1] http://cwiki.apache.org/confluence/display/MAVEN/MojoFailureException
05-Mar-2019 18:53:49 Clean up, clean up, everybody everywhere; clean up clean up, everybody do your share!
05-Mar-2019 18:53:49 Killing process PID [18522]
05-Mar-2019 18:53:49 Killing process PID [18378]
05-Mar-2019 18:53:49 No stopped containers
05-Mar-2019 18:53:50 Stopping mysql_mysql_1 ...
05-Mar-2019 18:53:51
05-Mar-2019 18:53:51 Stopping mysql_mysql_1 ... done
05-Mar-2019 18:53:51 Removing mysql_mysql_1 ...
05-Mar-2019 18:53:51
05-Mar-2019 18:53:51 Removing mysql_mysql_1 ... done
05-Mar-2019 18:53:51 Going to remove mysql_mysql_1
05-Mar-2019 18:53:51 Stopping kafka_kafka_1 ...
05-Mar-2019 18:53:51 Stopping kafka_zookeeper_1 ...
05-Mar-2019 18:53:55
05-Mar-2019 18:53:55 Stopping kafka_kafka_1 ... done
05-Mar-2019 18:54:02
05-Mar-2019 18:54:02 Stopping kafka_zookeeper_1 ... done
05-Mar-2019 18:54:02 Removing kafka_kafka_1 ...
05-Mar-2019 18:54:02 Removing kafka_zookeeper_1 ...
05-Mar-2019 18:54:02
05-Mar-2019 18:54:02 Removing kafka_kafka_1 ... done
05-Mar-2019 18:54:02
05-Mar-2019 18:54:02 Removing kafka_zookeeper_1 ... done
05-Mar-2019 18:54:02 Going to remove kafka_kafka_1, kafka_zookeeper_1
05-Mar-2019 18:54:02
05-Mar-2019 18:54:02 Finished task 'Execute Acceptance Tests' with result: Success
05-Mar-2019 18:54:02 Starting task 'JUnit Parser' of type 'com.atlassian.bamboo.plugins.testresultparser:task.testresultparser.junit'
05-Mar-2019 18:54:02 Parsing test results under /opt/bamboo-home/xml-data/build-dir/SCDT-LOCAL20XSKIPPER20X-KAFKA...
05-Mar-2019 18:54:02 Failing task since 9 failing test cases were found.
05-Mar-2019 18:54:02 Finished task 'JUnit Parser' with result: Failed
05-Mar-2019 18:54:02 Starting task 'clean up' of type 'com.atlassian.bamboo.plugins.scripttask:task.builder.script'
05-Mar-2019 18:54:02
Beginning to execute external process for build 'Spring Cloud Data Flow Acceptance Tests - Local + SCDF-2.0.0.BS + Skipper 2.0.0.BS - Run Data Flow Acceptance Tests for Kafka #43 (SCDT-LOCAL20XSKIPPER20X-KAFKA-43)'
... running command line:
/opt/bamboo-home/temp/SCDT-LOCAL20XSKIPPER20X-KAFKA-43-ScriptBuildTask-4857464987156700540.sh
... in: /opt/bamboo-home/xml-data/build-dir/SCDT-LOCAL20XSKIPPER20X-KAFKA
... using extra environment variables:
bamboo_planRepository_1_branch=master
bamboo_********_username_password=********
bamboo_signing_store_password=********
bamboo_capability_system_builder_ant_Ant_1_9=/opt/ant-1.9
bamboo_capability_system_builder_ant_Ant_1_8=/opt/ant-1.8
bamboo_planRepository_1_branchDisplayName=master
bamboo_repository_274694331_git_username=spring-buildmaster
bamboo_capability_system_jdk_OpenJDK_7u181=/opt/openjdk-7
bamboo_repository_revision_number=4d6bba78ca2b8629684e8fda0b50bfa8dd69649c
bamboo_capability_system_builder_node_Node_js_6=/usr/bin/node
bamboo_RIAK_BIN=/usr/sbin/riak
bamboo_buildKey=SCDT-LOCAL20XSKIPPER20X-KAFKA
bamboo_repository_274694331_branch_name=master
bamboo_bintray_password=********
bamboo_sonar_token_password=********
bamboo_shortJobName=Run Data Flow Acceptance Tests for Kafka
bamboo_capability_system_builder_gradle___gradlew=./gradlew
bamboo_buildResultsUrl=https://build.spring.io/browse/SCDT-LOCAL20XSKIPPER20X-KAFKA-43
bamboo_capability_system_builder_mvn3_Maven_3_3=/opt/maven-3.3
bamboo_capability_system_builder_mvn3_Maven_3_2=/opt/maven-3.2
bamboo_capability_system_builder_mvn3_Maven_3_1=/opt/maven-3.1
bamboo_planRepository_repositoryUrl=https://github.com/spring-cloud/spring-cloud-dataflow-acceptance-tests.git
bamboo_agentId=208568324
bamboo_capability_system_builder_mvn3_Maven_3_5=/opt/maven-3.5
bamboo_capability_system_builder_mvn3_Maven_3_0=/opt/maven-3.0
bamboo_planRepository_revision=4d6bba78ca2b8629684e8fda0b50bfa8dd69649c
bamboo_planRepository_previousRevision=3db3b46e74aed550d213fdaf60a66dfe2f784175
bamboo_capability_remote_build=true
bamboo_repository_branch_name=master
bamboo_sonatype_token_password=********
bamboo_repository_274694331_name=Git
bamboo_scdf_acceptance_tests_password=********
bamboo_dependenciesDisabled=false
bamboo_repository_274694331_git_branch=master
bamboo_capability_Agent=bamboo-05.af.pivotal.io
bamboo_planRepository_branch=master
bamboo_planRepository_1_type=gitv2
bamboo_planRepository_branchName=master
bamboo_sonar_password=********
bamboo_hg_cache_directory=/opt/bamboo-home/xml-data/build-dir/_hg-repositories-cache
bamboo_planRepository_1_username=spring-buildmaster
bamboo_repository_274694331_git_repositoryUrl=https://github.com/spring-cloud/spring-cloud-dataflow-acceptance-tests.git
bamboo_planRepository_type=gitv2
bamboo_ManualBuildTriggerReason_userName=sabby
bamboo_git_cache_directory=/opt/bamboo-home/xml-data/build-dir/_git-repositories-cache
bamboo_artifactory_username=buildmaster
bamboo_tmp_directory=/opt/bamboo-home/temp
bamboo_planKey=SCDT-LOCAL20XSKIPPER20X
bamboo_planRepository_username=spring-buildmaster
bamboo_JDK8_HOME=/opt/jdk-8
bamboo_repository_274694331_previous_revision_number=3db3b46e74aed550d213fdaf60a66dfe2f784175
bamboo_planRepository_1_branchName=master
bamboo_sonar_version=5.6.3
bamboo_capability_system_jdk_JDK_1_11=/opt/jdk-11
bamboo_resultsUrl=https://build.spring.io/browse/SCDT-LOCAL20XSKIPPER20X-KAFKA-43
bamboo_capability_system_jdk_JDK_1_10=/opt/jdk-10
bamboo_build_working_directory=/opt/bamboo-home/xml-data/build-dir/SCDT-LOCAL20XSKIPPER20X-KAFKA
bamboo_planRepository_1_name=Git
bamboo_capability_system_os=ubuntu1604
bamboo_nexusPush_stagingProfile=buildmaster
bamboo_shortPlanName=Local + SCDF-2.0.0.BS + Skipper 2.0.0.BS
bamboo_planRepository_name=Git
bamboo_buildNumber=43
bamboo_planName=Spring Cloud Data Flow Acceptance Tests - Local + SCDF-2.0.0.BS + Skipper 2.0.0.BS
bamboo_JDK7_HOME=/opt/jdk-7
bamboo_build_commandline_com_atlassian_bamboo_plugins_scripttask_task_builder_script_7=/opt/bamboo-home/temp/SCDT-LOCAL20XSKIPPER20X-KAFKA-43-ScriptBuildTask-1419039551647091560.sh
bamboo_shortPlanKey=LOCAL20XSKIPPER20X
bamboo_shortJobKey=KAFKA
bamboo_artifactory_password=********
bamboo_buildTimeStamp=2019-03-05T18:51:16.526Z
bamboo_repository_previous_revision_number=3db3b46e74aed550d213fdaf60a66dfe2f784175
bamboo_sonar_username=buildmaster
bamboo_********_password=********
bamboo_repository_git_branch=master
bamboo_buildResultKey=SCDT-LOCAL20XSKIPPER20X-KAFKA-43
bamboo_nexusPush_close=true
bamboo_buildPlanName=Spring Cloud Data Flow Acceptance Tests - Local + SCDF-2.0.0.BS + Skipper 2.0.0.BS - Run Data Flow Acceptance Tests for Kafka
bamboo_repository_274694331_revision_number=4d6bba78ca2b8629684e8fda0b50bfa8dd69649c
bamboo_planRepository_1_revision=4d6bba78ca2b8629684e8fda0b50bfa8dd69649c
bamboo_repository_name=Git
bamboo_signing_key_password=********
bamboo_buildFailed=true
bamboo_capability_system_docker_executable=/usr/bin/docker
bamboo_capability_system_builder_groovy_Groovy_2_4=/opt/groovy-2.4
bamboo_capability_system_builder_command_Bash=/bin/bash
bamboo_jobFailed=true
bamboo_agentWorkingDirectory=/opt/bamboo-home/xml-data/build-dir
bamboo_capability_system_git_executable=/usr/bin/git
bamboo_repository_git_username=spring-buildmaster
bamboo_planRepository_1_previousRevision=3db3b46e74aed550d213fdaf60a66dfe2f784175
bamboo_capability_os_family=unix
bamboo_planRepository_branchDisplayName=master
bamboo_capability_system_builder_maven_Artifactory_Maven_3_5=/opt/maven-3.5
bamboo_capability_system_builder_maven_Artifactory_Maven_3_3=/opt/maven-3.3
bamboo_capability_system_builder_maven_Artifactory_Maven_3_2=/opt/maven-3.2
bamboo_s3_properties=/home/bamboo/tools/s3.properties
bamboo_capability_system_builder_maven_Artifactory_Maven_3_1=/opt/maven-3.1
bamboo_capability_system_builder_maven_Artifactory_Maven_3_0=/opt/maven-3.0
bamboo_plan_storageTag=plan-274497908
bamboo_bintray_username_password=********
bamboo_repository_git_repositoryUrl=https://github.com/spring-cloud/spring-cloud-dataflow-acceptance-tests.git
bamboo_working_directory=/opt/bamboo-home/xml-data/build-dir/SCDT-LOCAL20XSKIPPER20X-KAFKA
bamboo_planRepository_1_repositoryUrl=https://github.com/spring-cloud/spring-cloud-dataflow-acceptance-tests.git
bamboo_capability_system_jdk_JDK_1_8=/opt/jdk-8
bamboo_capability_system_jdk_JDK_1_9=/opt/jdk-9
bamboo_capability_system_jdk_JDK_1_6=/opt/jdk-6
bamboo_sonatype_password=********
bamboo_capability_system_jdk_JDK_1_7=/opt/jdk-7
bamboo_sonar_ip=10.194.6.9
05-Mar-2019 18:54:02 CLEANING UP RESOURCES AFTER RUNNING TESTS
05-Mar-2019 18:54:02 Environment variable JAVA_HOME must be set
05-Mar-2019 18:54:02 FINISHED CLEANING UP RESOURCES
05-Mar-2019 18:54:02 Finished task 'clean up' with result: Success
05-Mar-2019 18:54:02 Running post build plugin 'Docker Container Cleanup'
05-Mar-2019 18:54:02 Running post build plugin 'NCover Results Collector'
05-Mar-2019 18:54:02 Running post build plugin 'Artifactory Release Management Staging'
05-Mar-2019 18:54:02 Running post build plugin 'Artifactory Build Info Copier'
05-Mar-2019 18:54:02 Running post build plugin 'Artifactory Gradle Properties Info Copier'
05-Mar-2019 18:54:02 Running post build plugin 'Clover Results Collector'
05-Mar-2019 18:54:02 Running post build plugin 'npm Cache Cleanup'
05-Mar-2019 18:54:02 Running post build plugin 'Artifact Copier'
05-Mar-2019 18:54:02 Publishing an artifact: Test Results
05-Mar-2019 18:54:02 Finished publishing of artifact Job artifact: [Test Results], pattern: [**/target/surefire-reports/**/*.*] in 43.72 ms
05-Mar-2019 18:54:02 Publishing an artifact: App and Server Logs
05-Mar-2019 18:54:02 Finished publishing of artifact Job artifact: [App and Server Logs], pattern: [**/*.log] anchored at: [local] in 10.05 ms
05-Mar-2019 18:54:02 Successfully removed working directory at '/opt/bamboo-home/xml-data/build-dir/SCDT-LOCAL20XSKIPPER20X-KAFKA'
05-Mar-2019 18:54:02 Finalising the build...
05-Mar-2019 18:54:02 Stopping timer.
05-Mar-2019 18:54:02 Build SCDT-LOCAL20XSKIPPER20X-KAFKA-43 completed.
05-Mar-2019 18:54:02 Running on server: post build plugin 'NCover Results Collector'
05-Mar-2019 18:54:02 Running on server: post build plugin 'Build Hanging Detection Configuration'
05-Mar-2019 18:54:02 Running on server: post build plugin 'Clover Delta Calculator'
05-Mar-2019 18:54:02 Running on server: post build plugin 'Maven Dependencies Postprocessor'
05-Mar-2019 18:54:02 All post build plugins have finished
05-Mar-2019 18:54:02 Generating build results summary...
05-Mar-2019 18:54:02 Saving build results to disk...
05-Mar-2019 18:54:02 Logging substituted variables...
05-Mar-2019 18:54:02 Indexing build results...
05-Mar-2019 18:54:02 Finished building SCDT-LOCAL20XSKIPPER20X-KAFKA-43.