Build: #44 was successful

Job: Run Data Flow Acceptance Tests for Kafka was successful

Stages & jobs

  1. Test Stage - Kafka

  2. Test Stage - Rabbit

Build log

The build generated 753 lines of output. Download or view full build log

05-Mar-2019 18:59:11 Build Spring Cloud Data Flow Acceptance Tests - Local + SCDF-2.0.0.BS + Skipper 2.0.0.BS - Run Data Flow Acceptance Tests for Kafka #44 (SCDT-LOCAL20XSKIPPER20X-KAFKA-44) started building on agent bamboo-09.af.pivotal.io
05-Mar-2019 18:59:11 Remote agent on host bamboo-09.af.pivotal.io
05-Mar-2019 18:59:11 Build working directory is /opt/bamboo-home/xml-data/build-dir/SCDT-LOCAL20XSKIPPER20X-KAFKA
05-Mar-2019 18:59:11 Executing build Spring Cloud Data Flow Acceptance Tests - Local + SCDF-2.0.0.BS + Skipper 2.0.0.BS - Run Data Flow Acceptance Tests for Kafka #44 (SCDT-LOCAL20XSKIPPER20X-KAFKA-44)
05-Mar-2019 18:59:11 Starting task 'Checkout Default Repository' of type 'com.atlassian.bamboo.plugins.vcs:task.vcs.checkout'
05-Mar-2019 18:59:11 Checking out into /opt/bamboo-home/xml-data/build-dir/SCDT-LOCAL20XSKIPPER20X-KAFKA
05-Mar-2019 18:59:11 Updating source code to revision: 4d6bba78ca2b8629684e8fda0b50bfa8dd69649c
05-Mar-2019 18:59:11 Creating local git repository in '/opt/bamboo-home/xml-data/build-dir/SCDT-LOCAL20XSKIPPER20X-KAFKA/.git'.
05-Mar-2019 18:59:11 Initialized empty Git repository in /opt/bamboo-home/xml-data/build-dir/SCDT-LOCAL20XSKIPPER20X-KAFKA/.git/
05-Mar-2019 18:59:12 Fetching 'refs/heads/master' from 'https://github.com/spring-cloud/spring-cloud-dataflow-acceptance-tests.git'.
05-Mar-2019 18:59:14 From https://github.com/spring-cloud/spring-cloud-dataflow-acceptance-tests
05-Mar-2019 18:59:14 * [new branch]      master     -> master
05-Mar-2019 18:59:14 Checking out revision 4d6bba78ca2b8629684e8fda0b50bfa8dd69649c.
05-Mar-2019 18:59:14 Already on 'master'
05-Mar-2019 18:59:14 Updated source code to revision: 4d6bba78ca2b8629684e8fda0b50bfa8dd69649c
05-Mar-2019 18:59:14 Finished task 'Checkout Default Repository' with result: Success
05-Mar-2019 18:59:14 Running pre-build action: Artifactory Release Staging
05-Mar-2019 18:59:14 Running pre-build action: VCS Version Collector
05-Mar-2019 18:59:14 Starting task 'Execute Acceptance Tests' of type 'com.atlassian.bamboo.plugins.scripttask:task.builder.script'
05-Mar-2019 18:59:14
Beginning to execute external process for build 'Spring Cloud Data Flow Acceptance Tests - Local + SCDF-2.0.0.BS + Skipper 2.0.0.BS - Run Data Flow Acceptance Tests for Kafka #44 (SCDT-LOCAL20XSKIPPER20X-KAFKA-44)'
... running command line:
/opt/bamboo-home/temp/SCDT-LOCAL20XSKIPPER20X-KAFKA-44-ScriptBuildTask-3441985501033280333.sh
... in: /opt/bamboo-home/xml-data/build-dir/SCDT-LOCAL20XSKIPPER20X-KAFKA
... using extra environment variables:
bamboo_planRepository_1_branch=master
bamboo_********_username_password=********
bamboo_signing_store_password=********
bamboo_capability_system_builder_ant_Ant_1_9=/opt/ant-1.9
bamboo_capability_system_builder_ant_Ant_1_8=/opt/ant-1.8
bamboo_planRepository_1_branchDisplayName=master
bamboo_repository_274694331_git_username=spring-buildmaster
bamboo_capability_system_jdk_OpenJDK_7u181=/opt/openjdk-7
bamboo_repository_revision_number=4d6bba78ca2b8629684e8fda0b50bfa8dd69649c
bamboo_capability_system_builder_node_Node_js_6=/usr/bin/node
bamboo_RIAK_BIN=/usr/sbin/riak
bamboo_buildKey=SCDT-LOCAL20XSKIPPER20X-KAFKA
bamboo_repository_274694331_branch_name=master
bamboo_bintray_password=********
bamboo_sonar_token_password=********
bamboo_shortJobName=Run Data Flow Acceptance Tests for Kafka
bamboo_capability_system_builder_gradle___gradlew=./gradlew
bamboo_buildResultsUrl=https://build.spring.io/browse/SCDT-LOCAL20XSKIPPER20X-KAFKA-44
bamboo_capability_system_builder_mvn3_Maven_3_3=/opt/maven-3.3
bamboo_capability_system_builder_mvn3_Maven_3_2=/opt/maven-3.2
bamboo_capability_system_builder_mvn3_Maven_3_1=/opt/maven-3.1
bamboo_planRepository_repositoryUrl=https://github.com/spring-cloud/spring-cloud-dataflow-acceptance-tests.git
bamboo_agentId=208568328
bamboo_capability_system_builder_mvn3_Maven_3_5=/opt/maven-3.5
bamboo_capability_system_builder_mvn3_Maven_3_0=/opt/maven-3.0
bamboo_planRepository_revision=4d6bba78ca2b8629684e8fda0b50bfa8dd69649c
bamboo_planRepository_previousRevision=4d6bba78ca2b8629684e8fda0b50bfa8dd69649c
bamboo_capability_remote_build=true
bamboo_repository_branch_name=master
bamboo_sonatype_token_password=********
bamboo_repository_274694331_name=Git
bamboo_scdf_acceptance_tests_password=********
JAVA_HOME=/opt/jdk-8
bamboo_dependenciesDisabled=false
bamboo_repository_274694331_git_branch=master
bamboo_capability_Agent=bamboo-09.af.pivotal.io
bamboo_planRepository_branch=master
bamboo_planRepository_1_type=gitv2
bamboo_planRepository_branchName=master
bamboo_sonar_password=********
bamboo_hg_cache_directory=/opt/bamboo-home/xml-data/build-dir/_hg-repositories-cache
bamboo_planRepository_1_username=spring-buildmaster
bamboo_repository_274694331_git_repositoryUrl=https://github.com/spring-cloud/spring-cloud-dataflow-acceptance-tests.git
bamboo_planRepository_type=gitv2
bamboo_ManualBuildTriggerReason_userName=sabby
bamboo_git_cache_directory=/opt/bamboo-home/xml-data/build-dir/_git-repositories-cache
bamboo_artifactory_username=buildmaster
bamboo_tmp_directory=/opt/bamboo-home/temp
bamboo_planKey=SCDT-LOCAL20XSKIPPER20X
bamboo_planRepository_username=spring-buildmaster
bamboo_JDK8_HOME=/opt/jdk-8
bamboo_repository_274694331_previous_revision_number=4d6bba78ca2b8629684e8fda0b50bfa8dd69649c
bamboo_planRepository_1_branchName=master
bamboo_sonar_version=5.6.3
bamboo_capability_system_jdk_JDK_1_11=/opt/jdk-11
bamboo_resultsUrl=https://build.spring.io/browse/SCDT-LOCAL20XSKIPPER20X-KAFKA-44
bamboo_capability_system_jdk_JDK_1_10=/opt/jdk-10
bamboo_build_working_directory=/opt/bamboo-home/xml-data/build-dir/SCDT-LOCAL20XSKIPPER20X-KAFKA
bamboo_planRepository_1_name=Git
bamboo_capability_system_os=ubuntu1604
bamboo_nexusPush_stagingProfile=buildmaster
bamboo_shortPlanName=Local + SCDF-2.0.0.BS + Skipper 2.0.0.BS
bamboo_planRepository_name=Git
bamboo_buildNumber=44
bamboo_planName=Spring Cloud Data Flow Acceptance Tests - Local + SCDF-2.0.0.BS + Skipper 2.0.0.BS
bamboo_JDK7_HOME=/opt/jdk-7
bamboo_shortPlanKey=LOCAL20XSKIPPER20X
bamboo_shortJobKey=KAFKA
bamboo_artifactory_password=********
bamboo_buildTimeStamp=2019-03-05T18:59:11.515Z
bamboo_repository_previous_revision_number=4d6bba78ca2b8629684e8fda0b50bfa8dd69649c
bamboo_sonar_username=buildmaster
bamboo_********_password=********
bamboo_repository_git_branch=master
bamboo_buildResultKey=SCDT-LOCAL20XSKIPPER20X-KAFKA-44
bamboo_nexusPush_close=true
bamboo_buildPlanName=Spring Cloud Data Flow Acceptance Tests - Local + SCDF-2.0.0.BS + Skipper 2.0.0.BS - Run Data Flow Acceptance Tests for Kafka
bamboo_repository_274694331_revision_number=4d6bba78ca2b8629684e8fda0b50bfa8dd69649c
bamboo_planRepository_1_revision=4d6bba78ca2b8629684e8fda0b50bfa8dd69649c
bamboo_repository_name=Git
bamboo_signing_key_password=********
bamboo_buildFailed=false
bamboo_capability_system_docker_executable=/usr/bin/docker
bamboo_capability_system_builder_groovy_Groovy_2_4=/opt/groovy-2.4
bamboo_capability_system_builder_command_Bash=/bin/bash
bamboo_agentWorkingDirectory=/opt/bamboo-home/xml-data/build-dir
bamboo_capability_system_git_executable=/usr/bin/git
bamboo_repository_git_username=spring-buildmaster
bamboo_planRepository_1_previousRevision=4d6bba78ca2b8629684e8fda0b50bfa8dd69649c
bamboo_capability_os_family=unix
bamboo_planRepository_branchDisplayName=master
bamboo_capability_system_builder_maven_Artifactory_Maven_3_5=/opt/maven-3.5
bamboo_capability_system_builder_maven_Artifactory_Maven_3_3=/opt/maven-3.3
bamboo_capability_system_builder_maven_Artifactory_Maven_3_2=/opt/maven-3.2
bamboo_s3_properties=/home/bamboo/tools/s3.properties
bamboo_capability_system_builder_maven_Artifactory_Maven_3_1=/opt/maven-3.1
bamboo_capability_system_builder_maven_Artifactory_Maven_3_0=/opt/maven-3.0
bamboo_plan_storageTag=plan-274497908
bamboo_bintray_username_password=********
bamboo_repository_git_repositoryUrl=https://github.com/spring-cloud/spring-cloud-dataflow-acceptance-tests.git
bamboo_working_directory=/opt/bamboo-home/xml-data/build-dir/SCDT-LOCAL20XSKIPPER20X-KAFKA
bamboo_planRepository_1_repositoryUrl=https://github.com/spring-cloud/spring-cloud-dataflow-acceptance-tests.git
bamboo_capability_system_jdk_JDK_1_8=/opt/jdk-8
bamboo_capability_system_jdk_JDK_1_9=/opt/jdk-9
bamboo_capability_system_jdk_JDK_1_6=/opt/jdk-6
bamboo_sonatype_password=********
bamboo_capability_system_jdk_JDK_1_7=/opt/jdk-7
bamboo_sonar_ip=10.194.6.9
05-Mar-2019 18:59:14 CLEANING UP RESOURCES BEFORE TESTS
05-Mar-2019 18:59:14 Setting the environment variables
05-Mar-2019 18:59:14 Export the unset env. variables from /opt/bamboo-home/xml-data/build-dir/SCDT-LOCAL20XSKIPPER20X-KAFKA/local/init/env.properties :
05-Mar-2019 18:59:14    SPRING_CLOUD_DATAFLOW_SERVER_DOWNLOAD_URL = http://repo.spring.io/libs-snapshot/org/springframework/cloud/spring-cloud-dataflow-server-local//spring-cloud-dataflow-server-local-.jar
05-Mar-2019 18:59:14    SPRING_CLOUD_SKIPPER_SERVER_DOWNLOAD_URL = http://repo.spring.io/libs-snapshot/org/springframework/cloud/spring-cloud-skipper-server//spring-cloud-skipper-server-.jar
05-Mar-2019 18:59:14    SPRING_DATASOURCE_USERNAME = spring
05-Mar-2019 18:59:14    SPRING_DATASOURCE_PASSWORD = cloud
05-Mar-2019 18:59:14    SPRING_SCHEMA_NAME = dataflow
05-Mar-2019 18:59:14    DOCKER_SERVER = localhost
05-Mar-2019 18:59:14 Setting retries to 60 and WAIT_TIME to 5
05-Mar-2019 18:59:14 Export the unset env. variables from /opt/bamboo-home/xml-data/build-dir/SCDT-LOCAL20XSKIPPER20X-KAFKA/local/binder/rabbit/env.properties :
05-Mar-2019 18:59:14    STREAM_REGISTRATION_RESOURCE = http://repo.spring.io/libs-release/org/springframework/cloud/stream/app/spring-cloud-stream-app-descriptor/Celsius.SR3/spring-cloud-stream-app-descriptor-Celsius.SR3.stream-apps-rabbit-maven
05-Mar-2019 18:59:14    TASK_REGISTRATION_RESOURCE = http://repo.spring.io/libs-release/org/springframework/cloud/task/app/spring-cloud-task-app-descriptor/Clark.RELEASE/spring-cloud-task-app-descriptor-Clark.RELEASE.task-apps-maven
05-Mar-2019 18:59:14 SCDF SERVER URI: http://localhost:9393
05-Mar-2019 18:59:14 Clean up, clean up, everybody everywhere; clean up clean up, everybody do your share!
05-Mar-2019 18:59:14 No stopped containers
05-Mar-2019 18:59:15 No stopped containers
05-Mar-2019 18:59:15 No stopped containers
05-Mar-2019 18:59:15 FINISHED CLEANING UP RESOURCES
05-Mar-2019 18:59:15 Setting the environment variables
05-Mar-2019 18:59:15 Export the unset env. variables from /opt/bamboo-home/xml-data/build-dir/SCDT-LOCAL20XSKIPPER20X-KAFKA/local/init/env.properties :
05-Mar-2019 18:59:15    SPRING_CLOUD_DATAFLOW_SERVER_DOWNLOAD_URL = http://repo.spring.io/libs-snapshot/org/springframework/cloud/spring-cloud-dataflow-server/2.0.0.BUILD-SNAPSHOT/spring-cloud-dataflow-server-2.0.0.BUILD-SNAPSHOT.jar
05-Mar-2019 18:59:15    SPRING_CLOUD_SKIPPER_SERVER_DOWNLOAD_URL = http://repo.spring.io/libs-snapshot/org/springframework/cloud/spring-cloud-skipper-server/2.0.0.BUILD-SNAPSHOT/spring-cloud-skipper-server-2.0.0.BUILD-SNAPSHOT.jar
05-Mar-2019 18:59:15    SPRING_DATASOURCE_USERNAME = spring
05-Mar-2019 18:59:15    SPRING_DATASOURCE_PASSWORD = cloud
05-Mar-2019 18:59:15    SPRING_SCHEMA_NAME = dataflow
05-Mar-2019 18:59:15    DOCKER_SERVER = localhost
05-Mar-2019 18:59:15 Setting retries to 60 and WAIT_TIME to 5
05-Mar-2019 18:59:15 cleaning up any previous mysql docker containers...
05-Mar-2019 18:59:15 done cleaning up.
05-Mar-2019 18:59:15 Could not find a local mysql server, trying docker.
05-Mar-2019 18:59:16 Pulling mysql (mysql:5.7)...
05-Mar-2019 18:59:17 5.7: Pulling from library/mysql
05-Mar-2019 18:59:25 Digest: sha256:de482b2b0fdbe5bb142462c07c5650a74e0daa31e501bc52448a2be10f384e6d
05-Mar-2019 18:59:25 Status: Downloaded newer image for mysql:5.7
05-Mar-2019 18:59:25 Creating mysql_mysql_1
05-Mar-2019 18:59:26 mysql running on localhost:3306
05-Mar-2019 18:59:26 Service host is localhost
05-Mar-2019 18:59:26 Creating kafka compose file on /opt/bamboo-home/xml-data/build-dir/SCDT-LOCAL20XSKIPPER20X-KAFKA/local/binder/kafka/docker-compose.yml
05-Mar-2019 18:59:26 cleaning up any previous kafka docker containers...
05-Mar-2019 18:59:26 done cleaning up
05-Mar-2019 18:59:26 Could not find a local kafka server, trying docker.
05-Mar-2019 18:59:26 Pulling zookeeper (wurstmeister/zookeeper:latest)...
05-Mar-2019 18:59:27 latest: Pulling from wurstmeister/zookeeper
05-Mar-2019 18:59:43 Digest: sha256:7a7fd44a72104bfbd24a77844bad5fabc86485b036f988ea927d1780782a6680
05-Mar-2019 18:59:43 Status: Downloaded newer image for wurstmeister/zookeeper:latest
05-Mar-2019 18:59:43 Pulling kafka (wurstmeister/kafka:2.11-0.11.0.3)...
05-Mar-2019 18:59:44 2.11-0.11.0.3: Pulling from wurstmeister/kafka
05-Mar-2019 18:59:56 Digest: sha256:a0f24a2599a606afdf49be2e2c66639baf68d5c66fb6f98ea5c193f1e1396398
05-Mar-2019 18:59:56 Status: Downloaded newer image for wurstmeister/kafka:2.11-0.11.0.3
05-Mar-2019 18:59:56 Creating kafka_zookeeper_1
05-Mar-2019 18:59:56 Creating kafka_kafka_1
05-Mar-2019 18:59:56 kafka running on localhost:9092
05-Mar-2019 18:59:56 Export the unset env. variables from /opt/bamboo-home/xml-data/build-dir/SCDT-LOCAL20XSKIPPER20X-KAFKA/local/binder/kafka/env.properties :
05-Mar-2019 18:59:56    STREAM_REGISTRATION_RESOURCE = http://repo.spring.io/libs-release/org/springframework/cloud/stream/app/spring-cloud-stream-app-descriptor/Einstein.RELEASE/spring-cloud-stream-app-descriptor-Einstein.RELEASE.stream-apps-kafka-maven
05-Mar-2019 18:59:56    TASK_REGISTRATION_RESOURCE = http://repo.spring.io/libs-release/org/springframework/cloud/task/app/spring-cloud-task-app-descriptor/Dearborn.SR1/spring-cloud-task-app-descriptor-Dearborn.SR1.task-apps-maven
05-Mar-2019 18:59:56 cleaning up any previous redis docker containers...
05-Mar-2019 18:59:56 done cleaning up.
05-Mar-2019 18:59:57 redis found on localhost
05-Mar-2019 18:59:57 SKIPPER SERVER URI: http://localhost:7577
05-Mar-2019 18:59:57 Downloading server from http://repo.spring.io/libs-snapshot/org/springframework/cloud/spring-cloud-skipper-server/2.0.0.BUILD-SNAPSHOT/spring-cloud-skipper-server-2.0.0.BUILD-SNAPSHOT.jar
05-Mar-2019 19:00:33 2019-03-05 19:00:33 URL:http://repo.spring.io/libs-snapshot/org/springframework/cloud/spring-cloud-skipper-server/2.0.0.BUILD-SNAPSHOT/spring-cloud-skipper-server-2.0.0.BUILD-SNAPSHOT.jar [81483373/81483373] -> "/opt/bamboo-home/xml-data/build-dir/SCDT-LOCAL20XSKIPPER20X-KAFKA/local/skipper-server/skipper-server.jar" [1]
05-Mar-2019 19:00:33 executing [nohup /opt/jdk-8/bin/java  -Dlogging.level.org.springframework.cloud.deployer.spi.local.LocalAppDeployer=DEBUG -Xmx1024m -Xss1024k -jar /opt/bamboo-home/xml-data/build-dir/SCDT-LOCAL20XSKIPPER20X-KAFKA/local/skipper-server/skipper-server.jar  --spring.datasource.driver-class-name=org.mariadb.jdbc.Driver --spring.datasource.url=jdbc:mysql://localhost/dataflow --spring.datasource.username=spring --spring.datasource.password=cloud  --spring.cloud.dataflow.applicationProperties.stream.spring.cloud.stream.kafka.binder.brokers=localhost --spring.cloud.dataflow.applicationProperties.stream.spring.cloud.stream.kafka.binder.zkNodes=localhost  --spring.redis.host=127.0.0.1 --spring.cloud.skipper.server.platform.local.accounts.default.workingDirectoriesRoot=/opt/bamboo-home/xml-data/build-dir/SCDT-LOCAL20XSKIPPER20X-KAFKA/local/skipper-server/app-logs > /opt/bamboo-home/xml-data/build-dir/SCDT-LOCAL20XSKIPPER20X-KAFKA/local/skipper-server/skipper-server.log &]
05-Mar-2019 19:00:33 [/opt/bamboo-home/xml-data/build-dir/SCDT-LOCAL20XSKIPPER20X-KAFKA/local/skipper-server] process pid is [7182]
05-Mar-2019 19:00:33 System props are []
05-Mar-2019 19:00:33 Logs are under [/opt/bamboo-home/xml-data/build-dir/SCDT-LOCAL20XSKIPPER20X-KAFKA/local/skipper-server/skipper-server.log] or from nohup [/opt/bamboo-home/xml-data/build-dir/SCDT-LOCAL20XSKIPPER20X-KAFKA/local/skipper-server/nohup.log]
05-Mar-2019 19:00:33 Failed to connect to localhost:7577. Attempt  #1/60... will try again in [5] seconds
05-Mar-2019 19:00:38 Failed to connect to localhost:7577. Attempt  #2/60... will try again in [5] seconds
05-Mar-2019 19:00:43 Failed to connect to localhost:7577. Attempt  #3/60... will try again in [5] seconds
05-Mar-2019 19:00:49 SCDF SERVER URI: http://localhost:9393
05-Mar-2019 19:00:49 Downloading server from http://repo.spring.io/libs-snapshot/org/springframework/cloud/spring-cloud-dataflow-server/2.0.0.BUILD-SNAPSHOT/spring-cloud-dataflow-server-2.0.0.BUILD-SNAPSHOT.jar
05-Mar-2019 19:01:28 2019-03-05 19:01:28 URL:http://repo.spring.io/libs-snapshot/org/springframework/cloud/spring-cloud-dataflow-server/2.0.0.BUILD-SNAPSHOT/spring-cloud-dataflow-server-2.0.0.BUILD-SNAPSHOT.jar [88071194/88071194] -> "/opt/bamboo-home/xml-data/build-dir/SCDT-LOCAL20XSKIPPER20X-KAFKA/local/server/scdf-server.jar" [1]
05-Mar-2019 19:01:28 SPRING_PROFILES_ACTIVE []
05-Mar-2019 19:01:28 executing [nohup /opt/jdk-8/bin/java  -Xmx1024m -Xss1024k -jar /opt/bamboo-home/xml-data/build-dir/SCDT-LOCAL20XSKIPPER20X-KAFKA/local/server/scdf-server.jar  --spring.datasource.driver-class-name=org.mariadb.jdbc.Driver --spring.datasource.url=jdbc:mysql://localhost/dataflow --spring.datasource.username=spring --spring.datasource.password=cloud  --spring.cloud.dataflow.applicationProperties.stream.spring.cloud.stream.kafka.binder.brokers=localhost --spring.cloud.dataflow.applicationProperties.stream.spring.cloud.stream.kafka.binder.zkNodes=localhost  --spring.redis.host=127.0.0.1 --spring.cloud.skipper.server.platform.local.accounts.default.workingDirectoriesRoot=/opt/bamboo-home/xml-data/build-dir/SCDT-LOCAL20XSKIPPER20X-KAFKA/local/skipper-server/app-logs --spring.cloud.dataflow.features.skipper-enabled=true > /opt/bamboo-home/xml-data/build-dir/SCDT-LOCAL20XSKIPPER20X-KAFKA/local/server/scdf-server.log &]
05-Mar-2019 19:01:28 [/opt/bamboo-home/xml-data/build-dir/SCDT-LOCAL20XSKIPPER20X-KAFKA/local/server] process pid is [7279]
05-Mar-2019 19:01:28 System props are []
05-Mar-2019 19:01:28 Logs are under [/opt/bamboo-home/xml-data/build-dir/SCDT-LOCAL20XSKIPPER20X-KAFKA/local/server/scdf-server.log] or from nohup [/opt/bamboo-home/xml-data/build-dir/SCDT-LOCAL20XSKIPPER20X-KAFKA/local/server/nohup.log]
05-Mar-2019 19:01:28 Failed to connect to localhost:9393. Attempt  #1/60... will try again in [5] seconds
05-Mar-2019 19:01:33 Failed to connect to localhost:9393. Attempt  #2/60... will try again in [5] seconds
05-Mar-2019 19:01:38 Failed to connect to localhost:9393. Attempt  #3/60... will try again in [5] seconds
05-Mar-2019 19:01:43 SCDF SERVER ABOUT:
05-Mar-2019 19:01:44 {
05-Mar-2019 19:01:44     "_links": {
05-Mar-2019 19:01:44         "self": {
05-Mar-2019 19:01:44             "href": "http://localhost:9393/about"
05-Mar-2019 19:01:44         }
05-Mar-2019 19:01:44     },
05-Mar-2019 19:01:44     "featureInfo": {
05-Mar-2019 19:01:44         "analyticsEnabled": true,
05-Mar-2019 19:01:44         "grafanaEnabled": false,
05-Mar-2019 19:01:44         "schedulerEnabled": false,
05-Mar-2019 19:01:44         "streamsEnabled": true,
05-Mar-2019 19:01:44         "tasksEnabled": true
05-Mar-2019 19:01:44     },
05-Mar-2019 19:01:44     "grafanaInfo": {
05-Mar-2019 19:01:44         "refreshInterval": 15,
05-Mar-2019 19:01:44         "url": ""
05-Mar-2019 19:01:44     },
05-Mar-2019 19:01:44     "runtimeEnvironment": {
05-Mar-2019 19:01:44         "appDeployer": {
05-Mar-2019 19:01:44             "deployerImplementationVersion": "2.0.0.BUILD-SNAPSHOT",
05-Mar-2019 19:01:44             "deployerName": "Spring Cloud Skipper Server",
05-Mar-2019 19:01:44             "deployerSpiVersion": "2.0.0.BUILD-SNAPSHOT",
05-Mar-2019 19:01:44             "javaVersion": "1.8.0_144",
05-Mar-2019 19:01:44             "platformApiVersion": "",
05-Mar-2019 19:01:44             "platformClientVersion": "",
05-Mar-2019 19:01:44             "platformHostVersion": "",
05-Mar-2019 19:01:44             "platformSpecificInfo": {
05-Mar-2019 19:01:44                 "default": "local"
05-Mar-2019 19:01:44             },
05-Mar-2019 19:01:44             "platformType": "Skipper Managed",
05-Mar-2019 19:01:44             "springBootVersion": "2.1.2.RELEASE",
05-Mar-2019 19:01:44             "springVersion": "5.1.4.RELEASE"
05-Mar-2019 19:01:44         },
05-Mar-2019 19:01:44         "taskLaunchers": [
05-Mar-2019 19:01:44             {
05-Mar-2019 19:01:44                 "deployerImplementationVersion": "2.0.0.RELEASE",
05-Mar-2019 19:01:44                 "deployerName": "LocalTaskLauncher",
05-Mar-2019 19:01:44                 "deployerSpiVersion": "2.0.0.RELEASE",
05-Mar-2019 19:01:44                 "javaVersion": "1.8.0_144",
05-Mar-2019 19:01:44                 "platformApiVersion": "Linux 4.4.0-141-generic",
05-Mar-2019 19:01:44                 "platformClientVersion": "4.4.0-141-generic",
05-Mar-2019 19:01:44                 "platformHostVersion": "4.4.0-141-generic",
05-Mar-2019 19:01:44                 "platformSpecificInfo": {},
05-Mar-2019 19:01:44                 "platformType": "Local",
05-Mar-2019 19:01:44                 "springBootVersion": "2.1.2.RELEASE",
05-Mar-2019 19:01:44                 "springVersion": "5.1.4.RELEASE"
05-Mar-2019 19:01:44             }
05-Mar-2019 19:01:44         ]
05-Mar-2019 19:01:44     },
05-Mar-2019 19:01:44     "securityInfo": {
05-Mar-2019 19:01:44         "authenticated": false,
05-Mar-2019 19:01:44         "authenticationEnabled": false,
05-Mar-2019 19:01:44         "roles": [],
05-Mar-2019 19:01:44         "username": null
05-Mar-2019 19:01:44     },
05-Mar-2019 19:01:44     "versionInfo": {
05-Mar-2019 19:01:44         "core": {
05-Mar-2019 19:01:44             "name": "Spring Cloud Data Flow Core",
05-Mar-2019 19:01:44             "version": "2.0.0.BUILD-SNAPSHOT"
05-Mar-2019 19:01:44         },
05-Mar-2019 19:01:44         "dashboard": {
05-Mar-2019 19:01:44             "name": "Spring Cloud Dataflow UI",
05-Mar-2019 19:01:44             "version": "2.0.0.BUILD-SNAPSHOT"
05-Mar-2019 19:01:44         },
05-Mar-2019 19:01:44         "implementation": {
05-Mar-2019 19:01:44             "name": "spring-cloud-dataflow-server",
05-Mar-2019 19:01:44             "version": "2.0.0.BUILD-SNAPSHOT"
05-Mar-2019 19:01:44         },
05-Mar-2019 19:01:44         "shell": {
05-Mar-2019 19:01:44             "name": "Spring Cloud Data Flow Shell",
05-Mar-2019 19:01:44             "url": "https://repo.spring.io/libs-snapshot/org/springframework/cloud/spring-cloud-dataflow-shell/2.0.0.BUILD-SNAPSHOT/spring-cloud-dataflow-shell-2.0.0.BUILD-SNAPSHOT.jar",
05-Mar-2019 19:01:44             "version": "2.0.0.BUILD-SNAPSHOT"
05-Mar-2019 19:01:44         }
05-Mar-2019 19:01:44     }
05-Mar-2019 19:01:44 }
05-Mar-2019 19:01:44 SKIPPER SERVER ABOUT:
05-Mar-2019 19:01:44 {
05-Mar-2019 19:01:44     "versionInfo": {
05-Mar-2019 19:01:44         "server": {
05-Mar-2019 19:01:44             "name": "Spring Cloud Skipper Server",
05-Mar-2019 19:01:44             "version": "2.0.0.BUILD-SNAPSHOT"
05-Mar-2019 19:01:44         },
05-Mar-2019 19:01:44         "shell": {
05-Mar-2019 19:01:44             "name": "Spring Cloud Skipper Shell",
05-Mar-2019 19:01:44             "url": "https://repo.spring.io/libs-snapshot/org/springframework/cloud/spring-cloud-skipper-shell/2.0.0.BUILD-SNAPSHOT/spring-cloud-skipper-shell-2.0.0.BUILD-SNAPSHOT.jar",
05-Mar-2019 19:01:44             "version": "2.0.0.BUILD-SNAPSHOT"
05-Mar-2019 19:01:44         }
05-Mar-2019 19:01:44     }
05-Mar-2019 19:01:44 }
05-Mar-2019 19:01:44 [INFO] Scanning for projects...
05-Mar-2019 19:01:45 [INFO]                                                                         
05-Mar-2019 19:01:45 [INFO] ------------------------------------------------------------------------
05-Mar-2019 19:01:45 [INFO] Building Data Flow Acceptance Tests 1.1.0.BUILD-SNAPSHOT
05-Mar-2019 19:01:45 [INFO] ------------------------------------------------------------------------
05-Mar-2019 19:01:45 [INFO]
05-Mar-2019 19:01:45 [INFO] --- maven-checkstyle-plugin:2.17:check (checkstyle-validation) @ spring-cloud-dataflow-acceptance-tests ---
05-Mar-2019 19:01:46 [INFO]
05-Mar-2019 19:01:46 [INFO] --- maven-resources-plugin:2.6:resources (default-resources) @ spring-cloud-dataflow-acceptance-tests ---
05-Mar-2019 19:01:46 [INFO] Using 'UTF-8' encoding to copy filtered resources.
05-Mar-2019 19:01:46 [INFO] skip non existing resourceDirectory /opt/bamboo-home/xml-data/build-dir/SCDT-LOCAL20XSKIPPER20X-KAFKA/src/main/resources
05-Mar-2019 19:01:46 [INFO] skip non existing resourceDirectory /opt/bamboo-home/xml-data/build-dir/SCDT-LOCAL20XSKIPPER20X-KAFKA/src/main/resources
05-Mar-2019 19:01:46 [INFO]
05-Mar-2019 19:01:46 [INFO] --- maven-compiler-plugin:3.1:compile (default-compile) @ spring-cloud-dataflow-acceptance-tests ---
05-Mar-2019 19:01:46 [INFO] Changes detected - recompiling the module!
05-Mar-2019 19:01:46 [INFO] Compiling 8 source files to /opt/bamboo-home/xml-data/build-dir/SCDT-LOCAL20XSKIPPER20X-KAFKA/target/classes
05-Mar-2019 19:01:47 [INFO]
05-Mar-2019 19:01:47 [INFO] --- maven-resources-plugin:2.6:testResources (default-testResources) @ spring-cloud-dataflow-acceptance-tests ---
05-Mar-2019 19:01:47 [INFO] Using 'UTF-8' encoding to copy filtered resources.
05-Mar-2019 19:01:47 [INFO] Copying 1 resource
05-Mar-2019 19:01:47 [INFO]
05-Mar-2019 19:01:47 [INFO] --- maven-compiler-plugin:3.1:testCompile (default-testCompile) @ spring-cloud-dataflow-acceptance-tests ---
05-Mar-2019 19:01:47 [INFO] Changes detected - recompiling the module!
05-Mar-2019 19:01:47 [INFO] Compiling 15 source files to /opt/bamboo-home/xml-data/build-dir/SCDT-LOCAL20XSKIPPER20X-KAFKA/target/test-classes
05-Mar-2019 19:01:47 [WARNING] /opt/bamboo-home/xml-data/build-dir/SCDT-LOCAL20XSKIPPER20X-KAFKA/src/test/java/org/springframework/cloud/dataflow/acceptance/test/AbstractTaskTests.java: Some input files use unchecked or unsafe operations.
05-Mar-2019 19:01:47 [WARNING] /opt/bamboo-home/xml-data/build-dir/SCDT-LOCAL20XSKIPPER20X-KAFKA/src/test/java/org/springframework/cloud/dataflow/acceptance/test/AbstractTaskTests.java: Recompile with -Xlint:unchecked for details.
05-Mar-2019 19:01:47 [INFO]
05-Mar-2019 19:01:47 [INFO] --- maven-surefire-plugin:2.18.1:test (default-test) @ spring-cloud-dataflow-acceptance-tests ---
05-Mar-2019 19:01:47 [INFO] Surefire report directory: /opt/bamboo-home/xml-data/build-dir/SCDT-LOCAL20XSKIPPER20X-KAFKA/target/surefire-reports
05-Mar-2019 19:01:47
05-Mar-2019 19:01:47 -------------------------------------------------------
05-Mar-2019 19:01:47 T E S T S
05-Mar-2019 19:01:47 -------------------------------------------------------
05-Mar-2019 19:01:48 2019-03-05 19:01:48.326  INFO   --- [           main] .b.t.c.SpringBootTestContextBootstrapper : Neither @ContextConfiguration nor @ContextHierarchy found for test class [org.springframework.cloud.dataflow.acceptance.test.AnalyticsTests], using SpringBootContextLoader
05-Mar-2019 19:01:48 2019-03-05 19:01:48.369  INFO   --- [           main] .b.t.c.SpringBootTestContextBootstrapper : Loaded default TestExecutionListener class names from location [META-INF/spring.factories]: [org.springframework.boot.test.mock.mockito.MockitoTestExecutionListener, org.springframework.boot.test.mock.mockito.ResetMocksTestExecutionListener, org.springframework.boot.test.autoconfigure.restdocs.RestDocsTestExecutionListener, org.springframework.boot.test.autoconfigure.web.client.MockRestServiceServerResetTestExecutionListener, org.springframework.boot.test.autoconfigure.web.servlet.MockMvcPrintOnlyOnFailureTestExecutionListener, org.springframework.boot.test.autoconfigure.web.servlet.WebDriverTestExecutionListener, org.springframework.test.context.web.ServletTestExecutionListener, org.springframework.test.context.support.DirtiesContextBeforeModesTestExecutionListener, org.springframework.test.context.support.DependencyInjectionTestExecutionListener, org.springframework.test.context.support.DirtiesContextTestExecutionListener, org.springframework.test.context.transaction.TransactionalTestExecutionListener, org.springframework.test.context.jdbc.SqlScriptsTestExecutionListener]
05-Mar-2019 19:01:48 2019-03-05 19:01:48.385  INFO   --- [           main] .b.t.c.SpringBootTestContextBootstrapper : Using TestExecutionListeners: [org.springframework.test.context.web.ServletTestExecutionListener@636be97c, org.springframework.test.context.support.DirtiesContextBeforeModesTestExecutionListener@50a638b5, org.springframework.boot.test.autoconfigure.SpringBootDependencyInjectionTestExecutionListener@1817d444, org.springframework.test.context.support.DirtiesContextTestExecutionListener@6ca8564a, org.springframework.test.context.transaction.TransactionalTestExecutionListener@50b472aa, org.springframework.test.context.jdbc.SqlScriptsTestExecutionListener@31368b99, org.springframework.boot.test.autoconfigure.web.servlet.MockMvcPrintOnlyOnFailureTestExecutionListener@1725dc0f, org.springframework.boot.test.autoconfigure.web.client.MockRestServiceServerResetTestExecutionListener@3911c2a7, org.springframework.boot.test.mock.mockito.ResetMocksTestExecutionListener@4ac3c60d, org.springframework.boot.test.autoconfigure.web.servlet.WebDriverTestExecutionListener@4facf68f, org.springframework.boot.test.autoconfigure.restdocs.RestDocsTestExecutionListener@76508ed1, org.springframework.boot.test.mock.mockito.MockitoTestExecutionListener@41e36e46]
05-Mar-2019 19:01:48 2019-03-05 19:01:48.386  INFO   --- [           main] .b.t.c.SpringBootTestContextBootstrapper : Neither @ContextConfiguration nor @ContextHierarchy found for test class [org.springframework.cloud.dataflow.acceptance.test.WoodChuckTests], using SpringBootContextLoader
05-Mar-2019 19:01:48 2019-03-05 19:01:48.398  INFO   --- [           main] .b.t.c.SpringBootTestContextBootstrapper : Loaded default TestExecutionListener class names from location [META-INF/spring.factories]: [org.springframework.boot.test.mock.mockito.MockitoTestExecutionListener, org.springframework.boot.test.mock.mockito.ResetMocksTestExecutionListener, org.springframework.boot.test.autoconfigure.restdocs.RestDocsTestExecutionListener, org.springframework.boot.test.autoconfigure.web.client.MockRestServiceServerResetTestExecutionListener, org.springframework.boot.test.autoconfigure.web.servlet.MockMvcPrintOnlyOnFailureTestExecutionListener, org.springframework.boot.test.autoconfigure.web.servlet.WebDriverTestExecutionListener, org.springframework.test.context.web.ServletTestExecutionListener, org.springframework.test.context.support.DirtiesContextBeforeModesTestExecutionListener, org.springframework.test.context.support.DependencyInjectionTestExecutionListener, org.springframework.test.context.support.DirtiesContextTestExecutionListener, org.springframework.test.context.transaction.TransactionalTestExecutionListener, org.springframework.test.context.jdbc.SqlScriptsTestExecutionListener]
05-Mar-2019 19:01:48 2019-03-05 19:01:48.401  INFO   --- [           main] .b.t.c.SpringBootTestContextBootstrapper : Using TestExecutionListeners: [org.springframework.test.context.web.ServletTestExecutionListener@49139829, org.springframework.test.context.support.DirtiesContextBeforeModesTestExecutionListener@9597028, org.springframework.boot.test.autoconfigure.SpringBootDependencyInjectionTestExecutionListener@6069db50, org.springframework.test.context.support.DirtiesContextTestExecutionListener@4efbca5a, org.springframework.test.context.transaction.TransactionalTestExecutionListener@1b7cc17c, org.springframework.test.context.jdbc.SqlScriptsTestExecutionListener@59662a0b, org.springframework.boot.test.autoconfigure.web.servlet.MockMvcPrintOnlyOnFailureTestExecutionListener@77fbd92c, org.springframework.boot.test.autoconfigure.web.client.MockRestServiceServerResetTestExecutionListener@67c27493, org.springframework.boot.test.mock.mockito.ResetMocksTestExecutionListener@1a482e36, org.springframework.boot.test.autoconfigure.web.servlet.WebDriverTestExecutionListener@72967906, org.springframework.boot.test.autoconfigure.restdocs.RestDocsTestExecutionListener@5b8dfcc1, org.springframework.boot.test.mock.mockito.MockitoTestExecutionListener@2f9f7dcf]
05-Mar-2019 19:01:48 2019-03-05 19:01:48.402  INFO   --- [           main] .b.t.c.SpringBootTestContextBootstrapper : Neither @ContextConfiguration nor @ContextHierarchy found for test class [org.springframework.cloud.dataflow.acceptance.test.HttpSourceTests], using SpringBootContextLoader
05-Mar-2019 19:01:48 2019-03-05 19:01:48.411  INFO   --- [           main] .b.t.c.SpringBootTestContextBootstrapper : Loaded default TestExecutionListener class names from location [META-INF/spring.factories]: [org.springframework.boot.test.mock.mockito.MockitoTestExecutionListener, org.springframework.boot.test.mock.mockito.ResetMocksTestExecutionListener, org.springframework.boot.test.autoconfigure.restdocs.RestDocsTestExecutionListener, org.springframework.boot.test.autoconfigure.web.client.MockRestServiceServerResetTestExecutionListener, org.springframework.boot.test.autoconfigure.web.servlet.MockMvcPrintOnlyOnFailureTestExecutionListener, org.springframework.boot.test.autoconfigure.web.servlet.WebDriverTestExecutionListener, org.springframework.test.context.web.ServletTestExecutionListener, org.springframework.test.context.support.DirtiesContextBeforeModesTestExecutionListener, org.springframework.test.context.support.DependencyInjectionTestExecutionListener, org.springframework.test.context.support.DirtiesContextTestExecutionListener, org.springframework.test.context.transaction.TransactionalTestExecutionListener, org.springframework.test.context.jdbc.SqlScriptsTestExecutionListener]
05-Mar-2019 19:01:48 2019-03-05 19:01:48.414  INFO   --- [           main] .b.t.c.SpringBootTestContextBootstrapper : Using TestExecutionListeners: [org.springframework.test.context.web.ServletTestExecutionListener@1a677343, org.springframework.test.context.support.DirtiesContextBeforeModesTestExecutionListener@15de0b3c, org.springframework.boot.test.autoconfigure.SpringBootDependencyInjectionTestExecutionListener@489115ef, org.springframework.test.context.support.DirtiesContextTestExecutionListener@3857f613, org.springframework.test.context.transaction.TransactionalTestExecutionListener@198b6731, org.springframework.test.context.jdbc.SqlScriptsTestExecutionListener@7c6908d7, org.springframework.boot.test.autoconfigure.web.servlet.MockMvcPrintOnlyOnFailureTestExecutionListener@3c9754d8, org.springframework.boot.test.autoconfigure.web.client.MockRestServiceServerResetTestExecutionListener@3bf7ca37, org.springframework.boot.test.mock.mockito.ResetMocksTestExecutionListener@79079097, org.springframework.boot.test.autoconfigure.web.servlet.WebDriverTestExecutionListener@4d1c00d0, org.springframework.boot.test.autoconfigure.restdocs.RestDocsTestExecutionListener@4b2bac3f, org.springframework.boot.test.mock.mockito.MockitoTestExecutionListener@4e08711f]
05-Mar-2019 19:01:48 2019-03-05 19:01:48.431  INFO   --- [           main] .b.t.c.SpringBootTestContextBootstrapper : Neither @ContextConfiguration nor @ContextHierarchy found for test class [org.springframework.cloud.dataflow.acceptance.test.TickTockTests], using SpringBootContextLoader
05-Mar-2019 19:01:48 2019-03-05 19:01:48.440  INFO   --- [           main] .b.t.c.SpringBootTestContextBootstrapper : Loaded default TestExecutionListener class names from location [META-INF/spring.factories]: [org.springframework.boot.test.mock.mockito.MockitoTestExecutionListener, org.springframework.boot.test.mock.mockito.ResetMocksTestExecutionListener, org.springframework.boot.test.autoconfigure.restdocs.RestDocsTestExecutionListener, org.springframework.boot.test.autoconfigure.web.client.MockRestServiceServerResetTestExecutionListener, org.springframework.boot.test.autoconfigure.web.servlet.MockMvcPrintOnlyOnFailureTestExecutionListener, org.springframework.boot.test.autoconfigure.web.servlet.WebDriverTestExecutionListener, org.springframework.test.context.web.ServletTestExecutionListener, org.springframework.test.context.support.DirtiesContextBeforeModesTestExecutionListener, org.springframework.test.context.support.DependencyInjectionTestExecutionListener, org.springframework.test.context.support.DirtiesContextTestExecutionListener, org.springframework.test.context.transaction.TransactionalTestExecutionListener, org.springframework.test.context.jdbc.SqlScriptsTestExecutionListener]
05-Mar-2019 19:01:48 2019-03-05 19:01:48.442  INFO   --- [           main] .b.t.c.SpringBootTestContextBootstrapper : Using TestExecutionListeners: [org.springframework.test.context.web.ServletTestExecutionListener@72cde7cc, org.springframework.test.context.support.DirtiesContextBeforeModesTestExecutionListener@5fd4f8f5, org.springframework.boot.test.autoconfigure.SpringBootDependencyInjectionTestExecutionListener@696da30b, org.springframework.test.context.support.DirtiesContextTestExecutionListener@4e7912d8, org.springframework.test.context.transaction.TransactionalTestExecutionListener@53976f5c, org.springframework.test.context.jdbc.SqlScriptsTestExecutionListener@2bfc268b, org.springframework.boot.test.autoconfigure.web.servlet.MockMvcPrintOnlyOnFailureTestExecutionListener@2f8dad04, org.springframework.boot.test.autoconfigure.web.client.MockRestServiceServerResetTestExecutionListener@29e495ff, org.springframework.boot.test.mock.mockito.ResetMocksTestExecutionListener@41e1e210, org.springframework.boot.test.autoconfigure.web.servlet.WebDriverTestExecutionListener@be35cd9, org.springframework.boot.test.autoconfigure.restdocs.RestDocsTestExecutionListener@4944252c, org.springframework.boot.test.mock.mockito.MockitoTestExecutionListener@44821a96]
05-Mar-2019 19:01:48 2019-03-05 19:01:48.444  INFO   --- [           main] .b.t.c.SpringBootTestContextBootstrapper : Neither @ContextConfiguration nor @ContextHierarchy found for test class [org.springframework.cloud.dataflow.acceptance.test.TransformTests], using SpringBootContextLoader
05-Mar-2019 19:01:48 2019-03-05 19:01:48.451  INFO   --- [           main] .b.t.c.SpringBootTestContextBootstrapper : Loaded default TestExecutionListener class names from location [META-INF/spring.factories]: [org.springframework.boot.test.mock.mockito.MockitoTestExecutionListener, org.springframework.boot.test.mock.mockito.ResetMocksTestExecutionListener, org.springframework.boot.test.autoconfigure.restdocs.RestDocsTestExecutionListener, org.springframework.boot.test.autoconfigure.web.client.MockRestServiceServerResetTestExecutionListener, org.springframework.boot.test.autoconfigure.web.servlet.MockMvcPrintOnlyOnFailureTestExecutionListener, org.springframework.boot.test.autoconfigure.web.servlet.WebDriverTestExecutionListener, org.springframework.test.context.web.ServletTestExecutionListener, org.springframework.test.context.support.DirtiesContextBeforeModesTestExecutionListener, org.springframework.test.context.support.DependencyInjectionTestExecutionListener, org.springframework.test.context.support.DirtiesContextTestExecutionListener, org.springframework.test.context.transaction.TransactionalTestExecutionListener, org.springframework.test.context.jdbc.SqlScriptsTestExecutionListener]
05-Mar-2019 19:01:48 2019-03-05 19:01:48.454  INFO   --- [           main] .b.t.c.SpringBootTestContextBootstrapper : Using TestExecutionListeners: [org.springframework.test.context.web.ServletTestExecutionListener@52af26ee, org.springframework.test.context.support.DirtiesContextBeforeModesTestExecutionListener@6fd83fc1, org.springframework.boot.test.autoconfigure.SpringBootDependencyInjectionTestExecutionListener@4f2b503c, org.springframework.test.context.support.DirtiesContextTestExecutionListener@bae7dc0, org.springframework.test.context.transaction.TransactionalTestExecutionListener@209da20d, org.springframework.test.context.jdbc.SqlScriptsTestExecutionListener@e15b7e8, org.springframework.boot.test.autoconfigure.web.servlet.MockMvcPrintOnlyOnFailureTestExecutionListener@1b2abca6, org.springframework.boot.test.autoconfigure.web.client.MockRestServiceServerResetTestExecutionListener@6392827e, org.springframework.boot.test.mock.mockito.ResetMocksTestExecutionListener@2ed2d9cb, org.springframework.boot.test.autoconfigure.web.servlet.WebDriverTestExecutionListener@d5b810e, org.springframework.boot.test.autoconfigure.restdocs.RestDocsTestExecutionListener@43dac38f, org.springframework.boot.test.mock.mockito.MockitoTestExecutionListener@342c38f8]
05-Mar-2019 19:01:48 2019-03-05 19:01:48.471  INFO   --- [           main] .b.t.c.SpringBootTestContextBootstrapper : Neither @ContextConfiguration nor @ContextHierarchy found for test class [org.springframework.cloud.dataflow.acceptance.test.NamedChannelTests], using SpringBootContextLoader
05-Mar-2019 19:01:48 2019-03-05 19:01:48.498  INFO   --- [           main] .b.t.c.SpringBootTestContextBootstrapper : Loaded default TestExecutionListener class names from location [META-INF/spring.factories]: [org.springframework.boot.test.mock.mockito.MockitoTestExecutionListener, org.springframework.boot.test.mock.mockito.ResetMocksTestExecutionListener, org.springframework.boot.test.autoconfigure.restdocs.RestDocsTestExecutionListener, org.springframework.boot.test.autoconfigure.web.client.MockRestServiceServerResetTestExecutionListener, org.springframework.boot.test.autoconfigure.web.servlet.MockMvcPrintOnlyOnFailureTestExecutionListener, org.springframework.boot.test.autoconfigure.web.servlet.WebDriverTestExecutionListener, org.springframework.test.context.web.ServletTestExecutionListener, org.springframework.test.context.support.DirtiesContextBeforeModesTestExecutionListener, org.springframework.test.context.support.DependencyInjectionTestExecutionListener, org.springframework.test.context.support.DirtiesContextTestExecutionListener, org.springframework.test.context.transaction.TransactionalTestExecutionListener, org.springframework.test.context.jdbc.SqlScriptsTestExecutionListener]
05-Mar-2019 19:01:48 2019-03-05 19:01:48.500  INFO   --- [           main] .b.t.c.SpringBootTestContextBootstrapper : Using TestExecutionListeners: [org.springframework.test.context.web.ServletTestExecutionListener@231f98ef, org.springframework.test.context.support.DirtiesContextBeforeModesTestExecutionListener@7c137fd5, org.springframework.boot.test.autoconfigure.SpringBootDependencyInjectionTestExecutionListener@183ec003, org.springframework.test.context.support.DirtiesContextTestExecutionListener@7d9d0818, org.springframework.test.context.transaction.TransactionalTestExecutionListener@221a3fa4, org.springframework.test.context.jdbc.SqlScriptsTestExecutionListener@451001e5, org.springframework.boot.test.autoconfigure.web.servlet.MockMvcPrintOnlyOnFailureTestExecutionListener@2b40ff9c, org.springframework.boot.test.autoconfigure.web.client.MockRestServiceServerResetTestExecutionListener@3e08ff24, org.springframework.boot.test.mock.mockito.ResetMocksTestExecutionListener@4d1c005e, org.springframework.boot.test.autoconfigure.web.servlet.WebDriverTestExecutionListener@8462f31, org.springframework.boot.test.autoconfigure.restdocs.RestDocsTestExecutionListener@24569dba, org.springframework.boot.test.mock.mockito.MockitoTestExecutionListener@5ddeb7cb]
05-Mar-2019 19:01:48 Running org.springframework.cloud.dataflow.acceptance.test.AnalyticsTests
05-Mar-2019 19:01:48 2019-03-05 19:01:48.525  INFO   --- [           main] .b.t.c.SpringBootTestContextBootstrapper : Neither @ContextConfiguration nor @ContextHierarchy found for test class [org.springframework.cloud.dataflow.acceptance.test.AnalyticsTests], using SpringBootContextLoader
05-Mar-2019 19:01:48 2019-03-05 19:01:48.531  INFO   --- [           main] .b.t.c.SpringBootTestContextBootstrapper : Loaded default TestExecutionListener class names from location [META-INF/spring.factories]: [org.springframework.boot.test.mock.mockito.MockitoTestExecutionListener, org.springframework.boot.test.mock.mockito.ResetMocksTestExecutionListener, org.springframework.boot.test.autoconfigure.restdocs.RestDocsTestExecutionListener, org.springframework.boot.test.autoconfigure.web.client.MockRestServiceServerResetTestExecutionListener, org.springframework.boot.test.autoconfigure.web.servlet.MockMvcPrintOnlyOnFailureTestExecutionListener, org.springframework.boot.test.autoconfigure.web.servlet.WebDriverTestExecutionListener, org.springframework.test.context.web.ServletTestExecutionListener, org.springframework.test.context.support.DirtiesContextBeforeModesTestExecutionListener, org.springframework.test.context.support.DependencyInjectionTestExecutionListener, org.springframework.test.context.support.DirtiesContextTestExecutionListener, org.springframework.test.context.transaction.TransactionalTestExecutionListener, org.springframework.test.context.jdbc.SqlScriptsTestExecutionListener]
05-Mar-2019 19:01:48 2019-03-05 19:01:48.543  INFO   --- [           main] .b.t.c.SpringBootTestContextBootstrapper : Using TestExecutionListeners: [org.springframework.test.context.web.ServletTestExecutionListener@4149c063, org.springframework.test.context.support.DirtiesContextBeforeModesTestExecutionListener@9cb8225, org.springframework.boot.test.autoconfigure.SpringBootDependencyInjectionTestExecutionListener@76b07f29, org.springframework.test.context.support.DirtiesContextTestExecutionListener@38af9828, org.springframework.test.context.transaction.TransactionalTestExecutionListener@376a0d86, org.springframework.test.context.jdbc.SqlScriptsTestExecutionListener@62656be4, org.springframework.boot.test.autoconfigure.web.servlet.MockMvcPrintOnlyOnFailureTestExecutionListener@17d919b6, org.springframework.boot.test.autoconfigure.web.client.MockRestServiceServerResetTestExecutionListener@53f3bdbd, org.springframework.boot.test.mock.mockito.ResetMocksTestExecutionListener@34129c78, org.springframework.boot.test.autoconfigure.web.servlet.WebDriverTestExecutionListener@7d61eb55, org.springframework.boot.test.autoconfigure.restdocs.RestDocsTestExecutionListener@222a59e6, org.springframework.boot.test.mock.mockito.MockitoTestExecutionListener@6c7a164b]
05-Mar-2019 19:01:49 2019-03-05 19:01:49.169  INFO 7439 --- [           main] s.c.a.AnnotationConfigApplicationContext : Refreshing org.springframework.context.annotation.AnnotationConfigApplicationContext@54e7391d: startup date [Tue Mar 05 19:01:49 UTC 2019]; root of context hierarchy
05-Mar-2019 19:01:49 2019-03-05 19:01:49.403  INFO 7439 --- [           main] trationDelegate$BeanPostProcessorChecker : Bean 'configurationPropertiesRebinderAutoConfiguration' of type [class org.springframework.cloud.autoconfigure.ConfigurationPropertiesRebinderAutoConfiguration$$EnhancerBySpringCGLIB$$95ff43c0] is not eligible for getting processed by all BeanPostProcessors (for example: not eligible for auto-proxying)
05-Mar-2019 19:01:49
05-Mar-2019 19:01:49   .   ____          _            __ _ _
05-Mar-2019 19:01:49 /\\ / ___'_ __ _ _(_)_ __  __ _ \ \ \ \
05-Mar-2019 19:01:49 ( ( )\___ | '_ | '_| | '_ \/ _` | \ \ \ \
05-Mar-2019 19:01:49 \\/  ___)| |_)| | | | | || (_| |  ) ) ) )
05-Mar-2019 19:01:49   '  |____| .__|_| |_|_| |_\__, | / / / /
05-Mar-2019 19:01:49 =========|_|==============|___/=/_/_/_/
05-Mar-2019 19:01:49 :: Spring Boot ::        (v1.4.1.RELEASE)
05-Mar-2019 19:01:49
05-Mar-2019 19:01:49 2019-03-05 19:01:49.717  INFO 7439 --- [           main] c.c.c.ConfigServicePropertySourceLocator : Fetching config from server at: http://localhost:8888
05-Mar-2019 19:01:49 2019-03-05 19:01:49.798  WARN 7439 --- [           main] c.c.c.ConfigServicePropertySourceLocator : Could not locate PropertySource: I/O error on GET request for "http://localhost:8888//blah": Connection refused (Connection refused); nested exception is java.net.ConnectException: Connection refused (Connection refused)
05-Mar-2019 19:01:49 2019-03-05 19:01:49.805  INFO 7439 --- [           main] o.s.c.d.acceptance.test.AnalyticsTests   : The following profiles are active: blah
05-Mar-2019 19:01:50 2019-03-05 19:01:50.031  INFO 7439 --- [           main] o.s.c.d.acceptance.test.AnalyticsTests   : Started AnalyticsTests in 1.423 seconds (JVM running for 2.125)
05-Mar-2019 19:01:50 2019-03-05 19:01:50.302  INFO 7439 --- [           main] junit.logTestName                        : Starting Test analyticsTest(org.springframework.cloud.dataflow.acceptance.test.AnalyticsTests)
05-Mar-2019 19:01:50 2019-03-05 19:01:50.307  INFO 7439 --- [           main] o.s.c.d.acceptance.test.AnalyticsTests   : Importing stream apps from uri resource: http://repo.spring.io/libs-release/org/springframework/cloud/stream/app/spring-cloud-stream-app-descriptor/Einstein.RELEASE/spring-cloud-stream-app-descriptor-Einstein.RELEASE.stream-apps-kafka-maven
05-Mar-2019 19:01:51 2019-03-05 19:01:51.339  INFO 7439 --- [           main] junit.logTestName                        : Finished Test analyticsTest(org.springframework.cloud.dataflow.acceptance.test.AnalyticsTests)
05-Mar-2019 19:01:51 2019-03-05 19:01:51.346  INFO 7439 --- [           main] o.s.c.d.acceptance.test.AnalyticsTests   : Destroy all streams
05-Mar-2019 19:01:51 Tests run: 1, Failures: 0, Errors: 0, Skipped: 1, Time elapsed: 2.846 sec - in org.springframework.cloud.dataflow.acceptance.test.AnalyticsTests
05-Mar-2019 19:01:51 Running org.springframework.cloud.dataflow.acceptance.test.WoodChuckTests
05-Mar-2019 19:01:51 2019-03-05 19:01:51.366  INFO 7439 --- [           main] .b.t.c.SpringBootTestContextBootstrapper : Neither @ContextConfiguration nor @ContextHierarchy found for test class [org.springframework.cloud.dataflow.acceptance.test.WoodChuckTests], using SpringBootContextLoader
05-Mar-2019 19:01:51 2019-03-05 19:01:51.387  INFO 7439 --- [           main] .b.t.c.SpringBootTestContextBootstrapper : Loaded default TestExecutionListener class names from location [META-INF/spring.factories]: [org.springframework.boot.test.mock.mockito.MockitoTestExecutionListener, org.springframework.boot.test.mock.mockito.ResetMocksTestExecutionListener, org.springframework.boot.test.autoconfigure.restdocs.RestDocsTestExecutionListener, org.springframework.boot.test.autoconfigure.web.client.MockRestServiceServerResetTestExecutionListener, org.springframework.boot.test.autoconfigure.web.servlet.MockMvcPrintOnlyOnFailureTestExecutionListener, org.springframework.boot.test.autoconfigure.web.servlet.WebDriverTestExecutionListener, org.springframework.test.context.web.ServletTestExecutionListener, org.springframework.test.context.support.DirtiesContextBeforeModesTestExecutionListener, org.springframework.test.context.support.DependencyInjectionTestExecutionListener, org.springframework.test.context.support.DirtiesContextTestExecutionListener, org.springframework.test.context.transaction.TransactionalTestExecutionListener, org.springframework.test.context.jdbc.SqlScriptsTestExecutionListener]
05-Mar-2019 19:01:51 2019-03-05 19:01:51.390  INFO 7439 --- [           main] .b.t.c.SpringBootTestContextBootstrapper : Using TestExecutionListeners: [org.springframework.test.context.web.ServletTestExecutionListener@5634d0f4, org.springframework.test.context.support.DirtiesContextBeforeModesTestExecutionListener@252a8aae, org.springframework.boot.test.autoconfigure.SpringBootDependencyInjectionTestExecutionListener@3d4e405e, org.springframework.test.context.support.DirtiesContextTestExecutionListener@54e2fe, org.springframework.test.context.transaction.TransactionalTestExecutionListener@70972170, org.springframework.test.context.jdbc.SqlScriptsTestExecutionListener@119aa36, org.springframework.boot.test.autoconfigure.web.servlet.MockMvcPrintOnlyOnFailureTestExecutionListener@4e1a46fb, org.springframework.boot.test.autoconfigure.web.client.MockRestServiceServerResetTestExecutionListener@69fe0ed4, org.springframework.boot.test.mock.mockito.ResetMocksTestExecutionListener@20ab3e3a, org.springframework.boot.test.autoconfigure.web.servlet.WebDriverTestExecutionListener@6caf7803, org.springframework.boot.test.autoconfigure.restdocs.RestDocsTestExecutionListener@709ed6f3, org.springframework.boot.test.mock.mockito.MockitoTestExecutionListener@698fee9a]
05-Mar-2019 19:01:51 2019-03-05 19:01:51.477  INFO 7439 --- [           main] junit.logTestName                        : Starting Test testPartitioning(org.springframework.cloud.dataflow.acceptance.test.WoodChuckTests)
05-Mar-2019 19:01:51 2019-03-05 19:01:51.487  INFO 7439 --- [           main] o.s.c.d.acceptance.test.WoodChuckTests   : Creating stream 'WOODCHUCK-TEST'
05-Mar-2019 19:01:51 2019-03-05 19:01:51.596  INFO 7439 --- [           main] o.s.c.d.acceptance.test.WoodChuckTests   : Deploying stream 'WOODCHUCK-TEST' with properties: {app.*.spring.cloud.streamapp.security.enabled=false, app.log.logging.pattern.level=WOODCHUCK-${INSTANCE_INDEX:${CF_INSTANCE_INDEX:${spring.cloud.stream.instanceIndex:0}}} %5p, app.*.logging.file=${PID}-test.log, app.splitter.producer.partitionKeyExpression=payload, app.*.endpoints.logfile.sensitive=false, app.log.spring.cloud.stream.kafka.bindings.input.consumer.autoRebalanceEnabled=false, app.*.management.endpoints.web.exposure.include=*, deployer.log.count=2}
05-Mar-2019 19:02:01 2019-03-05 19:02:01.374  INFO 7439 --- [           main] o.s.c.d.acceptance.test.WoodChuckTests   : Checking: Stream=WOODCHUCK-TEST, status = deploying, status description = The stream is being deployed.
05-Mar-2019 19:02:01 2019-03-05 19:02:01.374  INFO 7439 --- [           main] o.s.c.d.acceptance.test.WoodChuckTests   : Sleeping to check status of Stream=WOODCHUCK-TEST
05-Mar-2019 19:02:11 2019-03-05 19:02:11.489  INFO 7439 --- [           main] o.s.c.d.acceptance.test.WoodChuckTests   : Checking: Stream=WOODCHUCK-TEST, status = deploying, status description = The stream is being deployed.
05-Mar-2019 19:02:11 2019-03-05 19:02:11.489  INFO 7439 --- [           main] o.s.c.d.acceptance.test.WoodChuckTests   : Sleeping to check status of Stream=WOODCHUCK-TEST
05-Mar-2019 19:02:21 2019-03-05 19:02:21.782  INFO 7439 --- [           main] o.s.c.d.acceptance.test.WoodChuckTests   : Checking: Stream=WOODCHUCK-TEST, status = deploying, status description = The stream is being deployed.
05-Mar-2019 19:02:21 2019-03-05 19:02:21.783  INFO 7439 --- [           main] o.s.c.d.acceptance.test.WoodChuckTests   : Sleeping to check status of Stream=WOODCHUCK-TEST
05-Mar-2019 19:02:31 2019-03-05 19:02:31.834  INFO 7439 --- [           main] o.s.c.d.acceptance.test.WoodChuckTests   : Checking: Stream=WOODCHUCK-TEST, status = deployed, status description = The stream has been successfully deployed
05-Mar-2019 19:02:31 2019-03-05 19:02:31.897  INFO 7439 --- [           main] o.s.c.d.acceptance.test.WoodChuckTests   : Sleeping to check status of Stream=WOODCHUCK-TEST
05-Mar-2019 19:02:41 2019-03-05 19:02:41.897  INFO 7439 --- [           main] o.s.c.d.acceptance.test.WoodChuckTests   : Stream 'WOODCHUCK-TEST' started with status: deployed
05-Mar-2019 19:02:41 2019-03-05 19:02:41.898  INFO 7439 --- [           main] o.s.c.d.acceptance.test.WoodChuckTests   : App 'log' has instances: {WOODCHUCK-TEST.log-v1-0=http://10.194.6.19:40165, WOODCHUCK-TEST.log-v1-1=http://10.194.6.19:27136}
05-Mar-2019 19:02:41 2019-03-05 19:02:41.898  INFO 7439 --- [           main] o.s.c.d.acceptance.test.WoodChuckTests   : App 'http' has instances: {WOODCHUCK-TEST.http-v1-0=http://10.194.6.19:41349}
05-Mar-2019 19:02:41 2019-03-05 19:02:41.898  INFO 7439 --- [           main] o.s.c.d.acceptance.test.WoodChuckTests   : App 'splitter' has instances: {WOODCHUCK-TEST.splitter-v1-0=http://10.194.6.19:39194}
05-Mar-2019 19:02:41 2019-03-05 19:02:41.898  INFO 7439 --- [           main] o.s.c.d.acceptance.test.WoodChuckTests   : Looking for 'Started HttpSource' in logfile for http
05-Mar-2019 19:02:51 2019-03-05 19:02:51.899  INFO 7439 --- [           main] o.s.c.d.acceptance.test.WoodChuckTests   : Requesting log for app WOODCHUCK-TEST.http-v1-0
05-Mar-2019 19:02:52 2019-03-05 19:02:52.035  INFO 7439 --- [           main] o.s.c.d.acceptance.test.WoodChuckTests   : Retrieved logfile from 'http://10.194.6.19:41349/actuator/logfile
05-Mar-2019 19:02:52 2019-03-05 19:02:52.040  INFO 7439 --- [           main] o.s.c.d.acceptance.test.WoodChuckTests   : Matched all 'Started HttpSource' in logfile for app http (source WOODCHUCK-TEST.http-v1-0)
05-Mar-2019 19:02:52 2019-03-05 19:02:52.040  INFO 7439 --- [           main] o.s.c.d.acceptance.test.WoodChuckTests   : Looking for 'Started SplitterProcessor' in logfile for splitter
05-Mar-2019 19:03:02 2019-03-05 19:03:02.040  INFO 7439 --- [           main] o.s.c.d.acceptance.test.WoodChuckTests   : Requesting log for app WOODCHUCK-TEST.splitter-v1-0
05-Mar-2019 19:03:02 2019-03-05 19:03:02.343  INFO 7439 --- [           main] o.s.c.d.acceptance.test.WoodChuckTests   : Retrieved logfile from 'http://10.194.6.19:39194/actuator/logfile
05-Mar-2019 19:03:02 2019-03-05 19:03:02.343  INFO 7439 --- [           main] o.s.c.d.acceptance.test.WoodChuckTests   : Matched all 'Started SplitterProcessor' in logfile for app splitter (source WOODCHUCK-TEST.splitter-v1-0)
05-Mar-2019 19:03:02 2019-03-05 19:03:02.343  INFO 7439 --- [           main] o.s.c.d.acceptance.test.WoodChuckTests   : Looking for 'Started LogSink' in logfile for log
05-Mar-2019 19:03:12 2019-03-05 19:03:12.344  INFO 7439 --- [           main] o.s.c.d.acceptance.test.WoodChuckTests   : Requesting log for app WOODCHUCK-TEST.log-v1-0
05-Mar-2019 19:03:12 2019-03-05 19:03:12.487  INFO 7439 --- [           main] o.s.c.d.acceptance.test.WoodChuckTests   : Retrieved logfile from 'http://10.194.6.19:40165/actuator/logfile
05-Mar-2019 19:03:12 2019-03-05 19:03:12.487  INFO 7439 --- [           main] o.s.c.d.acceptance.test.WoodChuckTests   : Requesting log for app WOODCHUCK-TEST.log-v1-1
05-Mar-2019 19:03:12 2019-03-05 19:03:12.745  INFO 7439 --- [           main] o.s.c.d.acceptance.test.WoodChuckTests   : Retrieved logfile from 'http://10.194.6.19:27136/actuator/logfile
05-Mar-2019 19:03:12 2019-03-05 19:03:12.745  INFO 7439 --- [           main] o.s.c.d.acceptance.test.WoodChuckTests   : Matched all 'Started LogSink' in logfile for app log (source WOODCHUCK-TEST.log-v1-0)
05-Mar-2019 19:03:12 2019-03-05 19:03:12.907  INFO 7439 --- [           main] o.s.c.d.acceptance.test.WoodChuckTests   : Looking for 'WOODCHUCK-0,How,chuck' in logfile for log
05-Mar-2019 19:03:22 2019-03-05 19:03:22.907  INFO 7439 --- [           main] o.s.c.d.acceptance.test.WoodChuckTests   : Requesting log for app WOODCHUCK-TEST.log-v1-0
05-Mar-2019 19:03:22 2019-03-05 19:03:22.918  INFO 7439 --- [           main] o.s.c.d.acceptance.test.WoodChuckTests   : Retrieved logfile from 'http://10.194.6.19:40165/actuator/logfile
05-Mar-2019 19:03:22 2019-03-05 19:03:22.918  INFO 7439 --- [           main] o.s.c.d.acceptance.test.WoodChuckTests   : Requesting log for app WOODCHUCK-TEST.log-v1-1
05-Mar-2019 19:03:22 2019-03-05 19:03:22.926  INFO 7439 --- [           main] o.s.c.d.acceptance.test.WoodChuckTests   : Retrieved logfile from 'http://10.194.6.19:27136/actuator/logfile
05-Mar-2019 19:03:22 2019-03-05 19:03:22.927  INFO 7439 --- [           main] o.s.c.d.acceptance.test.WoodChuckTests   : Matched all 'WOODCHUCK-0,How,chuck' in logfile for app log (source WOODCHUCK-TEST.log-v1-0)
05-Mar-2019 19:03:22 2019-03-05 19:03:22.927  INFO 7439 --- [           main] o.s.c.d.acceptance.test.WoodChuckTests   : Looking for 'WOODCHUCK-1,much,wood,would,if,a,woodchuck,could' in logfile for log
05-Mar-2019 19:03:32 2019-03-05 19:03:32.927  INFO 7439 --- [           main] o.s.c.d.acceptance.test.WoodChuckTests   : Requesting log for app WOODCHUCK-TEST.log-v1-0
05-Mar-2019 19:03:32 2019-03-05 19:03:32.935  INFO 7439 --- [           main] o.s.c.d.acceptance.test.WoodChuckTests   : Retrieved logfile from 'http://10.194.6.19:40165/actuator/logfile
05-Mar-2019 19:03:32 2019-03-05 19:03:32.935  INFO 7439 --- [           main] o.s.c.d.acceptance.test.WoodChuckTests   : Requesting log for app WOODCHUCK-TEST.log-v1-1
05-Mar-2019 19:03:32 2019-03-05 19:03:32.943  INFO 7439 --- [           main] o.s.c.d.acceptance.test.WoodChuckTests   : Retrieved logfile from 'http://10.194.6.19:27136/actuator/logfile
05-Mar-2019 19:03:32 2019-03-05 19:03:32.944  INFO 7439 --- [           main] o.s.c.d.acceptance.test.WoodChuckTests   : Matched all 'WOODCHUCK-1,much,wood,would,if,a,woodchuck,could' in logfile for app log (source WOODCHUCK-TEST.log-v1-1)
05-Mar-2019 19:03:32 2019-03-05 19:03:32.945  INFO 7439 --- [           main] junit.logTestName                        : Test testPartitioning(org.springframework.cloud.dataflow.acceptance.test.WoodChuckTests) Succeeded
05-Mar-2019 19:03:32 2019-03-05 19:03:32.945  INFO 7439 --- [           main] junit.logTestName                        : Finished Test testPartitioning(org.springframework.cloud.dataflow.acceptance.test.WoodChuckTests)
05-Mar-2019 19:03:32 2019-03-05 19:03:32.945  INFO 7439 --- [           main] o.s.c.d.acceptance.test.WoodChuckTests   : Destroy all streams
05-Mar-2019 19:03:33 Tests run: 1, Failures: 0, Errors: 0, Skipped: 0, Time elapsed: 102.159 sec - in org.springframework.cloud.dataflow.acceptance.test.WoodChuckTests
05-Mar-2019 19:03:33 Running org.springframework.cloud.dataflow.acceptance.test.HttpSourceTests
05-Mar-2019 19:03:33 2019-03-05 19:03:33.573  INFO 7439 --- [           main] .b.t.c.SpringBootTestContextBootstrapper : Neither @ContextConfiguration nor @ContextHierarchy found for test class [org.springframework.cloud.dataflow.acceptance.test.HttpSourceTests], using SpringBootContextLoader
05-Mar-2019 19:03:33 2019-03-05 19:03:33.586  INFO 7439 --- [           main] .b.t.c.SpringBootTestContextBootstrapper : Loaded default TestExecutionListener class names from location [META-INF/spring.factories]: [org.springframework.boot.test.mock.mockito.MockitoTestExecutionListener, org.springframework.boot.test.mock.mockito.ResetMocksTestExecutionListener, org.springframework.boot.test.autoconfigure.restdocs.RestDocsTestExecutionListener, org.springframework.boot.test.autoconfigure.web.client.MockRestServiceServerResetTestExecutionListener, org.springframework.boot.test.autoconfigure.web.servlet.MockMvcPrintOnlyOnFailureTestExecutionListener, org.springframework.boot.test.autoconfigure.web.servlet.WebDriverTestExecutionListener, org.springframework.test.context.web.ServletTestExecutionListener, org.springframework.test.context.support.DirtiesContextBeforeModesTestExecutionListener, org.springframework.test.context.support.DependencyInjectionTestExecutionListener, org.springframework.test.context.support.DirtiesContextTestExecutionListener, org.springframework.test.context.transaction.TransactionalTestExecutionListener, org.springframework.test.context.jdbc.SqlScriptsTestExecutionListener]
05-Mar-2019 19:03:33 2019-03-05 19:03:33.589  INFO 7439 --- [           main] .b.t.c.SpringBootTestContextBootstrapper : Using TestExecutionListeners: [org.springframework.test.context.web.ServletTestExecutionListener@5de6cf3a, org.springframework.test.context.support.DirtiesContextBeforeModesTestExecutionListener@4cc36c19, org.springframework.boot.test.autoconfigure.SpringBootDependencyInjectionTestExecutionListener@5a3a1bf9, org.springframework.test.context.support.DirtiesContextTestExecutionListener@2100d047, org.springframework.test.context.transaction.TransactionalTestExecutionListener@4af45442, org.springframework.test.context.jdbc.SqlScriptsTestExecutionListener@1d805aa1, org.springframework.boot.test.autoconfigure.web.servlet.MockMvcPrintOnlyOnFailureTestExecutionListener@176f7f3b, org.springframework.boot.test.autoconfigure.web.client.MockRestServiceServerResetTestExecutionListener@30ca0779, org.springframework.boot.test.mock.mockito.ResetMocksTestExecutionListener@58740366, org.springframework.boot.test.autoconfigure.web.servlet.WebDriverTestExecutionListener@47be0f9b, org.springframework.boot.test.autoconfigure.restdocs.RestDocsTestExecutionListener@2bc426f0, org.springframework.boot.test.mock.mockito.MockitoTestExecutionListener@4bd51d3e]
05-Mar-2019 19:03:33 2019-03-05 19:03:33.701  INFO 7439 --- [           main] junit.logTestName                        : Starting Test httpSourceTests(org.springframework.cloud.dataflow.acceptance.test.HttpSourceTests)
05-Mar-2019 19:03:33 2019-03-05 19:03:33.702  INFO 7439 --- [           main] o.s.c.d.acceptance.test.HttpSourceTests  : Creating stream 'HTTP-TEST'
05-Mar-2019 19:03:33 2019-03-05 19:03:33.736  INFO 7439 --- [           main] o.s.c.d.acceptance.test.HttpSourceTests  : Deploying stream 'HTTP-TEST' with properties: {app.*.spring.cloud.streamapp.security.enabled=false, app.*.logging.file=${PID}-test.log, app.*.endpoints.logfile.sensitive=false, app.*.management.endpoints.web.exposure.include=*}
05-Mar-2019 19:03:39 2019-03-05 19:03:39.281  INFO 7439 --- [           main] o.s.c.d.acceptance.test.HttpSourceTests  : Checking: Stream=HTTP-TEST, status = deploying, status description = The stream is being deployed.
05-Mar-2019 19:03:39 2019-03-05 19:03:39.282  INFO 7439 --- [           main] o.s.c.d.acceptance.test.HttpSourceTests  : Sleeping to check status of Stream=HTTP-TEST
05-Mar-2019 19:03:49 2019-03-05 19:03:49.332  INFO 7439 --- [           main] o.s.c.d.acceptance.test.HttpSourceTests  : Checking: Stream=HTTP-TEST, status = deploying, status description = The stream is being deployed.
05-Mar-2019 19:03:49 2019-03-05 19:03:49.332  INFO 7439 --- [           main] o.s.c.d.acceptance.test.HttpSourceTests  : Sleeping to check status of Stream=HTTP-TEST
05-Mar-2019 19:03:59 2019-03-05 19:03:59.390  INFO 7439 --- [           main] o.s.c.d.acceptance.test.HttpSourceTests  : Checking: Stream=HTTP-TEST, status = deployed, status description = The stream has been successfully deployed
05-Mar-2019 19:03:59 2019-03-05 19:03:59.463  INFO 7439 --- [           main] o.s.c.d.acceptance.test.HttpSourceTests  : Sleeping to check status of Stream=HTTP-TEST
05-Mar-2019 19:04:09 2019-03-05 19:04:09.464  INFO 7439 --- [           main] o.s.c.d.acceptance.test.HttpSourceTests  : Stream 'HTTP-TEST' started with status: deployed
05-Mar-2019 19:04:09 2019-03-05 19:04:09.464  INFO 7439 --- [           main] o.s.c.d.acceptance.test.HttpSourceTests  : App 'log' has instances: {HTTP-TEST.log-v1-0=http://10.194.6.19:24672}
05-Mar-2019 19:04:09 2019-03-05 19:04:09.464  INFO 7439 --- [           main] o.s.c.d.acceptance.test.HttpSourceTests  : App 'http' has instances: {HTTP-TEST.http-v1-0=http://10.194.6.19:39073}
05-Mar-2019 19:04:09 2019-03-05 19:04:09.471  INFO 7439 --- [           main] o.s.c.d.acceptance.test.HttpSourceTests  : Looking for 'Started HttpSource' in logfile for http
05-Mar-2019 19:04:19 2019-03-05 19:04:19.472  INFO 7439 --- [           main] o.s.c.d.acceptance.test.HttpSourceTests  : Requesting log for app HTTP-TEST.http-v1-0
05-Mar-2019 19:04:19 2019-03-05 19:04:19.639  INFO 7439 --- [           main] o.s.c.d.acceptance.test.HttpSourceTests  : Retrieved logfile from 'http://10.194.6.19:39073/actuator/logfile
05-Mar-2019 19:04:19 2019-03-05 19:04:19.640  INFO 7439 --- [           main] o.s.c.d.acceptance.test.HttpSourceTests  : Matched all 'Started HttpSource' in logfile for app http (source HTTP-TEST.http-v1-0)
05-Mar-2019 19:04:19 2019-03-05 19:04:19.640  INFO 7439 --- [           main] o.s.c.d.acceptance.test.HttpSourceTests  : Looking for 'Started LogSink' in logfile for log
05-Mar-2019 19:04:29 2019-03-05 19:04:29.640  INFO 7439 --- [           main] o.s.c.d.acceptance.test.HttpSourceTests  : Requesting log for app HTTP-TEST.log-v1-0
05-Mar-2019 19:04:29 2019-03-05 19:04:29.785  INFO 7439 --- [           main] o.s.c.d.acceptance.test.HttpSourceTests  : Retrieved logfile from 'http://10.194.6.19:24672/actuator/logfile
05-Mar-2019 19:04:29 2019-03-05 19:04:29.785  INFO 7439 --- [           main] o.s.c.d.acceptance.test.HttpSourceTests  : Matched all 'Started LogSink' in logfile for app log (source HTTP-TEST.log-v1-0)
05-Mar-2019 19:04:29 2019-03-05 19:04:29.967  INFO 7439 --- [           main] o.s.c.d.acceptance.test.HttpSourceTests  : Looking for '6bca60ce-b4c6-4cc8-815a-4560898888f2' in logfile for log
05-Mar-2019 19:04:39 2019-03-05 19:04:39.967  INFO 7439 --- [           main] o.s.c.d.acceptance.test.HttpSourceTests  : Requesting log for app HTTP-TEST.log-v1-0
05-Mar-2019 19:04:39 2019-03-05 19:04:39.978  INFO 7439 --- [           main] o.s.c.d.acceptance.test.HttpSourceTests  : Retrieved logfile from 'http://10.194.6.19:24672/actuator/logfile
05-Mar-2019 19:04:39 2019-03-05 19:04:39.978  INFO 7439 --- [           main] o.s.c.d.acceptance.test.HttpSourceTests  : Matched all '6bca60ce-b4c6-4cc8-815a-4560898888f2' in logfile for app log (source HTTP-TEST.log-v1-0)
05-Mar-2019 19:04:39 2019-03-05 19:04:39.979  INFO 7439 --- [           main] junit.logTestName                        : Test httpSourceTests(org.springframework.cloud.dataflow.acceptance.test.HttpSourceTests) Succeeded
05-Mar-2019 19:04:39 2019-03-05 19:04:39.979  INFO 7439 --- [           main] junit.logTestName                        : Finished Test httpSourceTests(org.springframework.cloud.dataflow.acceptance.test.HttpSourceTests)
05-Mar-2019 19:04:39 2019-03-05 19:04:39.980  INFO 7439 --- [           main] o.s.c.d.acceptance.test.HttpSourceTests  : Destroy all streams
05-Mar-2019 19:04:40 Tests run: 1, Failures: 0, Errors: 0, Skipped: 0, Time elapsed: 66.77 sec - in org.springframework.cloud.dataflow.acceptance.test.HttpSourceTests
05-Mar-2019 19:04:40 Running org.springframework.cloud.dataflow.acceptance.test.TimestampTaskTests
05-Mar-2019 19:04:40 2019-03-05 19:04:40.357  INFO 7439 --- [           main] o.s.c.support.GenericApplicationContext  : Refreshing org.springframework.context.support.GenericApplicationContext@69923ac3: startup date [Tue Mar 05 19:04:40 UTC 2019]; root of context hierarchy
05-Mar-2019 19:04:40 2019-03-05 19:04:40.534  INFO 7439 --- [           main] junit.logTestName                        : Starting Test timeStampTests(org.springframework.cloud.dataflow.acceptance.test.TimestampTaskTests)
05-Mar-2019 19:04:40 2019-03-05 19:04:40.535  INFO 7439 --- [           main] o.s.c.d.a.test.AbstractTaskTests         : Importing task apps from uri resource: http://repo.spring.io/libs-release/org/springframework/cloud/task/app/spring-cloud-task-app-descriptor/Dearborn.SR1/spring-cloud-task-app-descriptor-Dearborn.SR1.task-apps-maven
05-Mar-2019 19:04:40 2019-03-05 19:04:40.685  INFO 7439 --- [           main] o.s.c.d.a.test.AbstractTaskTests         : Done importing task apps.
05-Mar-2019 19:04:51 2019-03-05 19:04:51.567  INFO 7439 --- [           main] junit.logTestName                        : Test timeStampTests(org.springframework.cloud.dataflow.acceptance.test.TimestampTaskTests) Succeeded
05-Mar-2019 19:04:51 2019-03-05 19:04:51.567  INFO 7439 --- [           main] junit.logTestName                        : Finished Test timeStampTests(org.springframework.cloud.dataflow.acceptance.test.TimestampTaskTests)
05-Mar-2019 19:04:51 2019-03-05 19:04:51.640  INFO 7439 --- [           main] junit.logTestName                        : Starting Test timeStampTestsMultipleLaunch(org.springframework.cloud.dataflow.acceptance.test.TimestampTaskTests)
05-Mar-2019 19:05:12 2019-03-05 19:05:12.018  INFO 7439 --- [           main] junit.logTestName                        : Test timeStampTestsMultipleLaunch(org.springframework.cloud.dataflow.acceptance.test.TimestampTaskTests) Succeeded
05-Mar-2019 19:05:12 2019-03-05 19:05:12.019  INFO 7439 --- [           main] junit.logTestName                        : Finished Test timeStampTestsMultipleLaunch(org.springframework.cloud.dataflow.acceptance.test.TimestampTaskTests)
05-Mar-2019 19:05:12 Tests run: 2, Failures: 0, Errors: 0, Skipped: 0, Time elapsed: 31.675 sec - in org.springframework.cloud.dataflow.acceptance.test.TimestampTaskTests
05-Mar-2019 19:05:12 Running org.springframework.cloud.dataflow.acceptance.test.TickTockTests
05-Mar-2019 19:05:12 2019-03-05 19:05:12.022  INFO 7439 --- [           main] .b.t.c.SpringBootTestContextBootstrapper : Neither @ContextConfiguration nor @ContextHierarchy found for test class [org.springframework.cloud.dataflow.acceptance.test.TickTockTests], using SpringBootContextLoader
05-Mar-2019 19:05:12 2019-03-05 19:05:12.034  INFO 7439 --- [           main] .b.t.c.SpringBootTestContextBootstrapper : Loaded default TestExecutionListener class names from location [META-INF/spring.factories]: [org.springframework.boot.test.mock.mockito.MockitoTestExecutionListener, org.springframework.boot.test.mock.mockito.ResetMocksTestExecutionListener, org.springframework.boot.test.autoconfigure.restdocs.RestDocsTestExecutionListener, org.springframework.boot.test.autoconfigure.web.client.MockRestServiceServerResetTestExecutionListener, org.springframework.boot.test.autoconfigure.web.servlet.MockMvcPrintOnlyOnFailureTestExecutionListener, org.springframework.boot.test.autoconfigure.web.servlet.WebDriverTestExecutionListener, org.springframework.test.context.web.ServletTestExecutionListener, org.springframework.test.context.support.DirtiesContextBeforeModesTestExecutionListener, org.springframework.test.context.support.DependencyInjectionTestExecutionListener, org.springframework.test.context.support.DirtiesContextTestExecutionListener, org.springframework.test.context.transaction.TransactionalTestExecutionListener, org.springframework.test.context.jdbc.SqlScriptsTestExecutionListener]
05-Mar-2019 19:05:12 2019-03-05 19:05:12.036  INFO 7439 --- [           main] .b.t.c.SpringBootTestContextBootstrapper : Using TestExecutionListeners: [org.springframework.test.context.web.ServletTestExecutionListener@557a84fe, org.springframework.test.context.support.DirtiesContextBeforeModesTestExecutionListener@6deee370, org.springframework.boot.test.autoconfigure.SpringBootDependencyInjectionTestExecutionListener@49c17ba4, org.springframework.test.context.support.DirtiesContextTestExecutionListener@43e065f2, org.springframework.test.context.transaction.TransactionalTestExecutionListener@423c5404, org.springframework.test.context.jdbc.SqlScriptsTestExecutionListener@5853ca50, org.springframework.boot.test.autoconfigure.web.servlet.MockMvcPrintOnlyOnFailureTestExecutionListener@1a0d96a5, org.springframework.boot.test.autoconfigure.web.client.MockRestServiceServerResetTestExecutionListener@5a02bfe3, org.springframework.boot.test.mock.mockito.ResetMocksTestExecutionListener@7a3e5cd3, org.springframework.boot.test.autoconfigure.web.servlet.WebDriverTestExecutionListener@3c79088e, org.springframework.boot.test.autoconfigure.restdocs.RestDocsTestExecutionListener@4a37191a, org.springframework.boot.test.mock.mockito.MockitoTestExecutionListener@5854a18]
05-Mar-2019 19:05:12 2019-03-05 19:05:12.101  INFO 7439 --- [           main] junit.logTestName                        : Starting Test tickTockUpdateRollbackTests(org.springframework.cloud.dataflow.acceptance.test.TickTockTests)
05-Mar-2019 19:05:12 2019-03-05 19:05:12.125  INFO 7439 --- [           main] o.s.c.d.acceptance.test.TickTockTests    : Creating stream 'TICKTOCK'
05-Mar-2019 19:05:12 2019-03-05 19:05:12.150  INFO 7439 --- [           main] o.s.c.d.acceptance.test.TickTockTests    : Deploying stream 'TICKTOCK' with properties: {app.*.spring.cloud.streamapp.security.enabled=false, app.*.logging.file=${PID}-test.log, app.*.endpoints.logfile.sensitive=false, app.log.log.expression='TICKTOCK - TIMESTAMP: '.concat(payload), app.*.management.endpoints.web.exposure.include=*}
05-Mar-2019 19:05:19 2019-03-05 19:05:19.796  INFO 7439 --- [           main] o.s.c.d.acceptance.test.TickTockTests    : Checking: Stream=TICKTOCK, status = deploying, status description = The stream is being deployed.
05-Mar-2019 19:05:19 2019-03-05 19:05:19.796  INFO 7439 --- [           main] o.s.c.d.acceptance.test.TickTockTests    : Sleeping to check status of Stream=TICKTOCK
05-Mar-2019 19:05:29 2019-03-05 19:05:29.851  INFO 7439 --- [           main] o.s.c.d.acceptance.test.TickTockTests    : Checking: Stream=TICKTOCK, status = deploying, status description = The stream is being deployed.
05-Mar-2019 19:05:29 2019-03-05 19:05:29.851  INFO 7439 --- [           main] o.s.c.d.acceptance.test.TickTockTests    : Sleeping to check status of Stream=TICKTOCK
05-Mar-2019 19:05:39 2019-03-05 19:05:39.894  INFO 7439 --- [           main] o.s.c.d.acceptance.test.TickTockTests    : Checking: Stream=TICKTOCK, status = deployed, status description = The stream has been successfully deployed
05-Mar-2019 19:05:39 2019-03-05 19:05:39.931  INFO 7439 --- [           main] o.s.c.d.acceptance.test.TickTockTests    : Sleeping to check status of Stream=TICKTOCK
05-Mar-2019 19:05:49 2019-03-05 19:05:49.932  INFO 7439 --- [           main] o.s.c.d.acceptance.test.TickTockTests    : Stream 'TICKTOCK' started with status: deployed
05-Mar-2019 19:05:49 2019-03-05 19:05:49.932  INFO 7439 --- [           main] o.s.c.d.acceptance.test.TickTockTests    : App 'log' has instances: {TICKTOCK.log-v1-0=http://10.194.6.19:44581}
05-Mar-2019 19:05:49 2019-03-05 19:05:49.932  INFO 7439 --- [           main] o.s.c.d.acceptance.test.TickTockTests    : App 'time' has instances: {TICKTOCK.time-v1-0=http://10.194.6.19:31923}
05-Mar-2019 19:05:49 2019-03-05 19:05:49.932  INFO 7439 --- [           main] o.s.c.d.acceptance.test.TickTockTests    : Looking for 'Started TimeSource' in logfile for time
05-Mar-2019 19:05:59 2019-03-05 19:05:59.932  INFO 7439 --- [           main] o.s.c.d.acceptance.test.TickTockTests    : Requesting log for app TICKTOCK.time-v1-0
05-Mar-2019 19:06:00 2019-03-05 19:06:00.068  INFO 7439 --- [           main] o.s.c.d.acceptance.test.TickTockTests    : Retrieved logfile from 'http://10.194.6.19:31923/actuator/logfile
05-Mar-2019 19:06:00 2019-03-05 19:06:00.068  INFO 7439 --- [           main] o.s.c.d.acceptance.test.TickTockTests    : Matched all 'Started TimeSource' in logfile for app time (source TICKTOCK.time-v1-0)
05-Mar-2019 19:06:00 2019-03-05 19:06:00.068  INFO 7439 --- [           main] o.s.c.d.acceptance.test.TickTockTests    : Looking for 'Started LogSink' in logfile for log
05-Mar-2019 19:06:10 2019-03-05 19:06:10.069  INFO 7439 --- [           main] o.s.c.d.acceptance.test.TickTockTests    : Requesting log for app TICKTOCK.log-v1-0
05-Mar-2019 19:06:10 2019-03-05 19:06:10.219  INFO 7439 --- [           main] o.s.c.d.acceptance.test.TickTockTests    : Retrieved logfile from 'http://10.194.6.19:44581/actuator/logfile
05-Mar-2019 19:06:10 2019-03-05 19:06:10.220  INFO 7439 --- [           main] o.s.c.d.acceptance.test.TickTockTests    : Matched all 'Started LogSink' in logfile for app log (source TICKTOCK.log-v1-0)
05-Mar-2019 19:06:10 2019-03-05 19:06:10.220  INFO 7439 --- [           main] o.s.c.d.acceptance.test.TickTockTests    : Looking for 'TICKTOCK - TIMESTAMP:' in logfile for log
05-Mar-2019 19:06:20 2019-03-05 19:06:20.220  INFO 7439 --- [           main] o.s.c.d.acceptance.test.TickTockTests    : Requesting log for app TICKTOCK.log-v1-0
05-Mar-2019 19:06:20 2019-03-05 19:06:20.233  INFO 7439 --- [           main] o.s.c.d.acceptance.test.TickTockTests    : Retrieved logfile from 'http://10.194.6.19:44581/actuator/logfile
05-Mar-2019 19:06:20 2019-03-05 19:06:20.233  INFO 7439 --- [           main] o.s.c.d.acceptance.test.TickTockTests    : Matched all 'TICKTOCK - TIMESTAMP:' in logfile for app log (source TICKTOCK.log-v1-0)
05-Mar-2019 19:06:20 2019-03-05 19:06:20.234  INFO 7439 --- [           main] o.s.c.d.acceptance.test.TickTockTests    : Updating stream 'TICKTOCK'
05-Mar-2019 19:06:20 2019-03-05 19:06:20.869  INFO 7439 --- [           main] o.s.c.d.acceptance.test.TickTockTests    : Checking: Stream=TICKTOCK, status = deploying, status description = The stream is being deployed.
05-Mar-2019 19:06:20 2019-03-05 19:06:20.869  INFO 7439 --- [           main] o.s.c.d.acceptance.test.TickTockTests    : Sleeping to check status of Stream=TICKTOCK
05-Mar-2019 19:06:30 2019-03-05 19:06:30.905  INFO 7439 --- [           main] o.s.c.d.acceptance.test.TickTockTests    : Checking: Stream=TICKTOCK, status = deployed, status description = The stream has been successfully deployed
05-Mar-2019 19:06:30 2019-03-05 19:06:30.944  INFO 7439 --- [           main] o.s.c.d.acceptance.test.TickTockTests    : Sleeping to check status of Stream=TICKTOCK
05-Mar-2019 19:06:40 2019-03-05 19:06:40.944  INFO 7439 --- [           main] o.s.c.d.acceptance.test.TickTockTests    : Stream 'TICKTOCK' started with status: deployed
05-Mar-2019 19:06:40 2019-03-05 19:06:40.945  INFO 7439 --- [           main] o.s.c.d.acceptance.test.TickTockTests    : App 'log' has instances: {TICKTOCK.log-v1-0=http://10.194.6.19:44581, TICKTOCK.log-v2-0=http://10.194.6.19:57157}
05-Mar-2019 19:06:40 2019-03-05 19:06:40.945  INFO 7439 --- [           main] o.s.c.d.acceptance.test.TickTockTests    : App 'time' has instances: {TICKTOCK.time-v1-0=http://10.194.6.19:31923}
05-Mar-2019 19:06:40 2019-03-05 19:06:40.945  INFO 7439 --- [           main] o.s.c.d.acceptance.test.TickTockTests    : Looking for 'Started LogSink' in logfile for log
05-Mar-2019 19:06:50 2019-03-05 19:06:50.945  INFO 7439 --- [           main] o.s.c.d.acceptance.test.TickTockTests    : Requesting log for app TICKTOCK.log-v1-0
05-Mar-2019 19:06:50 2019-03-05 19:06:50.946  WARN 7439 --- [           main] o.s.c.d.acceptance.test.TickTockTests    : Error while trying to access logfile from 'http://10.194.6.19:44581/logfile' due to : org.springframework.web.client.ResourceAccessException: I/O error on GET request for "http://10.194.6.19:44581/logfile": Connection refused (Connection refused); nested exception is java.net.ConnectException: Connection refused (Connection refused)
05-Mar-2019 19:06:50 2019-03-05 19:06:50.947  INFO 7439 --- [           main] o.s.c.d.acceptance.test.TickTockTests    : Requesting log for app TICKTOCK.log-v2-0
05-Mar-2019 19:06:51 2019-03-05 19:06:51.087  INFO 7439 --- [           main] o.s.c.d.acceptance.test.TickTockTests    : Retrieved logfile from 'http://10.194.6.19:57157/actuator/logfile
05-Mar-2019 19:06:51 2019-03-05 19:06:51.087  INFO 7439 --- [           main] o.s.c.d.acceptance.test.TickTockTests    : Matched all 'Started LogSink' in logfile for app log (source TICKTOCK.log-v2-0)
05-Mar-2019 19:06:51 2019-03-05 19:06:51.087  INFO 7439 --- [           main] o.s.c.d.acceptance.test.TickTockTests    : Looking for 'TICKTOCK Updated - TIMESTAMP:' in logfile for log
05-Mar-2019 19:07:01 2019-03-05 19:07:01.087  INFO 7439 --- [           main] o.s.c.d.acceptance.test.TickTockTests    : Requesting log for app TICKTOCK.log-v1-0
05-Mar-2019 19:07:01 2019-03-05 19:07:01.089  WARN 7439 --- [           main] o.s.c.d.acceptance.test.TickTockTests    : Error while trying to access logfile from 'http://10.194.6.19:44581/logfile' due to : org.springframework.web.client.ResourceAccessException: I/O error on GET request for "http://10.194.6.19:44581/logfile": Connection refused (Connection refused); nested exception is java.net.ConnectException: Connection refused (Connection refused)
05-Mar-2019 19:07:01 2019-03-05 19:07:01.089  INFO 7439 --- [           main] o.s.c.d.acceptance.test.TickTockTests    : Requesting log for app TICKTOCK.log-v2-0
05-Mar-2019 19:07:01 2019-03-05 19:07:01.105  INFO 7439 --- [           main] o.s.c.d.acceptance.test.TickTockTests    : Retrieved logfile from 'http://10.194.6.19:57157/actuator/logfile
05-Mar-2019 19:07:01 2019-03-05 19:07:01.105  INFO 7439 --- [           main] o.s.c.d.acceptance.test.TickTockTests    : Matched all 'TICKTOCK Updated - TIMESTAMP:' in logfile for app log (source TICKTOCK.log-v2-0)
05-Mar-2019 19:07:01 2019-03-05 19:07:01.105  INFO 7439 --- [           main] o.s.c.d.acceptance.test.TickTockTests    : Rolling back the stream 'TICKTOCK' to the version 0
05-Mar-2019 19:07:01 2019-03-05 19:07:01.424  INFO 7439 --- [           main] o.s.c.d.acceptance.test.TickTockTests    : Checking: Stream=TICKTOCK, status = deploying, status description = The stream is being deployed.
05-Mar-2019 19:07:01 2019-03-05 19:07:01.425  INFO 7439 --- [           main] o.s.c.d.acceptance.test.TickTockTests    : Sleeping to check status of Stream=TICKTOCK
05-Mar-2019 19:07:11 2019-03-05 19:07:11.481  INFO 7439 --- [           main] o.s.c.d.acceptance.test.TickTockTests    : Checking: Stream=TICKTOCK, status = deployed, status description = The stream has been successfully deployed
05-Mar-2019 19:07:11 2019-03-05 19:07:11.507  INFO 7439 --- [           main] o.s.c.d.acceptance.test.TickTockTests    : Sleeping to check status of Stream=TICKTOCK
05-Mar-2019 19:07:21 2019-03-05 19:07:21.507  INFO 7439 --- [           main] o.s.c.d.acceptance.test.TickTockTests    : Stream 'TICKTOCK' started with status: deployed
05-Mar-2019 19:07:21 2019-03-05 19:07:21.507  INFO 7439 --- [           main] o.s.c.d.acceptance.test.TickTockTests    : App 'log' has instances: {TICKTOCK.log-v1-0=http://10.194.6.19:44581, TICKTOCK.log-v3-0=http://10.194.6.19:41350, TICKTOCK.log-v2-0=http://10.194.6.19:57157}
05-Mar-2019 19:07:21 2019-03-05 19:07:21.507  INFO 7439 --- [           main] o.s.c.d.acceptance.test.TickTockTests    : App 'time' has instances: {TICKTOCK.time-v1-0=http://10.194.6.19:31923}
05-Mar-2019 19:07:21 2019-03-05 19:07:21.507  INFO 7439 --- [           main] o.s.c.d.acceptance.test.TickTockTests    : Looking for 'TICKTOCK - TIMESTAMP:' in logfile for log
05-Mar-2019 19:07:31 2019-03-05 19:07:31.508  INFO 7439 --- [           main] o.s.c.d.acceptance.test.TickTockTests    : Requesting log for app TICKTOCK.log-v1-0
05-Mar-2019 19:07:31 2019-03-05 19:07:31.509  WARN 7439 --- [           main] o.s.c.d.acceptance.test.TickTockTests    : Error while trying to access logfile from 'http://10.194.6.19:44581/logfile' due to : org.springframework.web.client.ResourceAccessException: I/O error on GET request for "http://10.194.6.19:44581/logfile": Connection refused (Connection refused); nested exception is java.net.ConnectException: Connection refused (Connection refused)
05-Mar-2019 19:07:31 2019-03-05 19:07:31.509  INFO 7439 --- [           main] o.s.c.d.acceptance.test.TickTockTests    : Requesting log for app TICKTOCK.log-v3-0
05-Mar-2019 19:07:31 2019-03-05 19:07:31.648  INFO 7439 --- [           main] o.s.c.d.acceptance.test.TickTockTests    : Retrieved logfile from 'http://10.194.6.19:41350/actuator/logfile
05-Mar-2019 19:07:31 2019-03-05 19:07:31.648  INFO 7439 --- [           main] o.s.c.d.acceptance.test.TickTockTests    : Requesting log for app TICKTOCK.log-v2-0
05-Mar-2019 19:07:31 2019-03-05 19:07:31.649  WARN 7439 --- [           main] o.s.c.d.acceptance.test.TickTockTests    : Error while trying to access logfile from 'http://10.194.6.19:57157/logfile' due to : org.springframework.web.client.ResourceAccessException: I/O error on GET request for "http://10.194.6.19:57157/logfile": Connection refused (Connection refused); nested exception is java.net.ConnectException: Connection refused (Connection refused)
05-Mar-2019 19:07:31 2019-03-05 19:07:31.650  INFO 7439 --- [           main] o.s.c.d.acceptance.test.TickTockTests    : Matched all 'TICKTOCK - TIMESTAMP:' in logfile for app log (source TICKTOCK.log-v3-0)
05-Mar-2019 19:07:31 2019-03-05 19:07:31.651  INFO 7439 --- [           main] junit.logTestName                        : Test tickTockUpdateRollbackTests(org.springframework.cloud.dataflow.acceptance.test.TickTockTests) Succeeded
05-Mar-2019 19:07:31 2019-03-05 19:07:31.651  INFO 7439 --- [           main] junit.logTestName                        : Finished Test tickTockUpdateRollbackTests(org.springframework.cloud.dataflow.acceptance.test.TickTockTests)
05-Mar-2019 19:07:31 2019-03-05 19:07:31.651  INFO 7439 --- [           main] o.s.c.d.acceptance.test.TickTockTests    : Destroy all streams
05-Mar-2019 19:07:31 2019-03-05 19:07:31.954  INFO 7439 --- [           main] junit.logTestName                        : Starting Test tickTockTests(org.springframework.cloud.dataflow.acceptance.test.TickTockTests)
05-Mar-2019 19:07:31 2019-03-05 19:07:31.955  INFO 7439 --- [           main] o.s.c.d.acceptance.test.TickTockTests    : Creating stream 'TICKTOCK'
05-Mar-2019 19:07:32 2019-03-05 19:07:32.019  INFO 7439 --- [           main] o.s.c.d.acceptance.test.TickTockTests    : Deploying stream 'TICKTOCK' with properties: {app.*.spring.cloud.streamapp.security.enabled=false, app.*.logging.file=${PID}-test.log, app.*.endpoints.logfile.sensitive=false, app.log.log.expression='TICKTOCK - TIMESTAMP: '.concat(payload), app.*.management.endpoints.web.exposure.include=*}
05-Mar-2019 19:07:32 2019-03-05 19:07:32.531  INFO 7439 --- [           main] o.s.c.d.acceptance.test.TickTockTests    : Checking: Stream=TICKTOCK, status = deploying, status description = The stream is being deployed.
05-Mar-2019 19:07:32 2019-03-05 19:07:32.531  INFO 7439 --- [           main] o.s.c.d.acceptance.test.TickTockTests    : Sleeping to check status of Stream=TICKTOCK
05-Mar-2019 19:07:42 2019-03-05 19:07:42.585  INFO 7439 --- [           main] o.s.c.d.acceptance.test.TickTockTests    : Checking: Stream=TICKTOCK, status = deploying, status description = The stream is being deployed.
05-Mar-2019 19:07:42 2019-03-05 19:07:42.585  INFO 7439 --- [           main] o.s.c.d.acceptance.test.TickTockTests    : Sleeping to check status of Stream=TICKTOCK
05-Mar-2019 19:07:52 2019-03-05 19:07:52.623  INFO 7439 --- [           main] o.s.c.d.acceptance.test.TickTockTests    : Checking: Stream=TICKTOCK, status = deployed, status description = The stream has been successfully deployed
05-Mar-2019 19:07:52 2019-03-05 19:07:52.667  INFO 7439 --- [           main] o.s.c.d.acceptance.test.TickTockTests    : Sleeping to check status of Stream=TICKTOCK
05-Mar-2019 19:08:02 2019-03-05 19:08:02.668  INFO 7439 --- [           main] o.s.c.d.acceptance.test.TickTockTests    : Stream 'TICKTOCK' started with status: deployed
05-Mar-2019 19:08:02 2019-03-05 19:08:02.668  INFO 7439 --- [           main] o.s.c.d.acceptance.test.TickTockTests    : App 'log' has instances: {TICKTOCK.log-v4-0=http://10.194.6.19:21560}
05-Mar-2019 19:08:02 2019-03-05 19:08:02.668  INFO 7439 --- [           main] o.s.c.d.acceptance.test.TickTockTests    : App 'time' has instances: {TICKTOCK.time-v4-0=http://10.194.6.19:30245}
05-Mar-2019 19:08:02 2019-03-05 19:08:02.668  INFO 7439 --- [           main] o.s.c.d.acceptance.test.TickTockTests    : Looking for 'Started TimeSource' in logfile for time
05-Mar-2019 19:08:12 2019-03-05 19:08:12.669  INFO 7439 --- [           main] o.s.c.d.acceptance.test.TickTockTests    : Requesting log for app TICKTOCK.time-v4-0
05-Mar-2019 19:08:12 2019-03-05 19:08:12.815  INFO 7439 --- [           main] o.s.c.d.acceptance.test.TickTockTests    : Retrieved logfile from 'http://10.194.6.19:30245/actuator/logfile
05-Mar-2019 19:08:12 2019-03-05 19:08:12.815  INFO 7439 --- [           main] o.s.c.d.acceptance.test.TickTockTests    : Matched all 'Started TimeSource' in logfile for app time (source TICKTOCK.time-v4-0)
05-Mar-2019 19:08:12 2019-03-05 19:08:12.815  INFO 7439 --- [           main] o.s.c.d.acceptance.test.TickTockTests    : Looking for 'Started LogSink' in logfile for log
05-Mar-2019 19:08:22 2019-03-05 19:08:22.815  INFO 7439 --- [           main] o.s.c.d.acceptance.test.TickTockTests    : Requesting log for app TICKTOCK.log-v4-0
05-Mar-2019 19:08:22 2019-03-05 19:08:22.989  INFO 7439 --- [           main] o.s.c.d.acceptance.test.TickTockTests    : Retrieved logfile from 'http://10.194.6.19:21560/actuator/logfile
05-Mar-2019 19:08:22 2019-03-05 19:08:22.989  INFO 7439 --- [           main] o.s.c.d.acceptance.test.TickTockTests    : Matched all 'Started LogSink' in logfile for app log (source TICKTOCK.log-v4-0)
05-Mar-2019 19:08:22 2019-03-05 19:08:22.989  INFO 7439 --- [           main] o.s.c.d.acceptance.test.TickTockTests    : Looking for 'TICKTOCK - TIMESTAMP:' in logfile for log
05-Mar-2019 19:08:32 2019-03-05 19:08:32.989  INFO 7439 --- [           main] o.s.c.d.acceptance.test.TickTockTests    : Requesting log for app TICKTOCK.log-v4-0
05-Mar-2019 19:08:32 2019-03-05 19:08:32.998  INFO 7439 --- [           main] o.s.c.d.acceptance.test.TickTockTests    : Retrieved logfile from 'http://10.194.6.19:21560/actuator/logfile
05-Mar-2019 19:08:32 2019-03-05 19:08:32.998  INFO 7439 --- [           main] o.s.c.d.acceptance.test.TickTockTests    : Matched all 'TICKTOCK - TIMESTAMP:' in logfile for app log (source TICKTOCK.log-v4-0)
05-Mar-2019 19:08:33 2019-03-05 19:08:33.001  INFO 7439 --- [           main] junit.logTestName                        : Test tickTockTests(org.springframework.cloud.dataflow.acceptance.test.TickTockTests) Succeeded
05-Mar-2019 19:08:33 2019-03-05 19:08:33.001  INFO 7439 --- [           main] junit.logTestName                        : Finished Test tickTockTests(org.springframework.cloud.dataflow.acceptance.test.TickTockTests)
05-Mar-2019 19:08:33 2019-03-05 19:08:33.002  INFO 7439 --- [           main] o.s.c.d.acceptance.test.TickTockTests    : Destroy all streams
05-Mar-2019 19:08:33 Tests run: 3, Failures: 0, Errors: 0, Skipped: 1, Time elapsed: 201.396 sec - in org.springframework.cloud.dataflow.acceptance.test.TickTockTests
05-Mar-2019 19:08:33 Running org.springframework.cloud.dataflow.acceptance.test.TransformTests
05-Mar-2019 19:08:33 2019-03-05 19:08:33.418  INFO 7439 --- [           main] .b.t.c.SpringBootTestContextBootstrapper : Neither @ContextConfiguration nor @ContextHierarchy found for test class [org.springframework.cloud.dataflow.acceptance.test.TransformTests], using SpringBootContextLoader
05-Mar-2019 19:08:33 2019-03-05 19:08:33.424  INFO 7439 --- [           main] .b.t.c.SpringBootTestContextBootstrapper : Loaded default TestExecutionListener class names from location [META-INF/spring.factories]: [org.springframework.boot.test.mock.mockito.MockitoTestExecutionListener, org.springframework.boot.test.mock.mockito.ResetMocksTestExecutionListener, org.springframework.boot.test.autoconfigure.restdocs.RestDocsTestExecutionListener, org.springframework.boot.test.autoconfigure.web.client.MockRestServiceServerResetTestExecutionListener, org.springframework.boot.test.autoconfigure.web.servlet.MockMvcPrintOnlyOnFailureTestExecutionListener, org.springframework.boot.test.autoconfigure.web.servlet.WebDriverTestExecutionListener, org.springframework.test.context.web.ServletTestExecutionListener, org.springframework.test.context.support.DirtiesContextBeforeModesTestExecutionListener, org.springframework.test.context.support.DependencyInjectionTestExecutionListener, org.springframework.test.context.support.DirtiesContextTestExecutionListener, org.springframework.test.context.transaction.TransactionalTestExecutionListener, org.springframework.test.context.jdbc.SqlScriptsTestExecutionListener]
05-Mar-2019 19:08:33 2019-03-05 19:08:33.436  INFO 7439 --- [           main] .b.t.c.SpringBootTestContextBootstrapper : Using TestExecutionListeners: [org.springframework.test.context.web.ServletTestExecutionListener@4d3c6593, org.springframework.test.context.support.DirtiesContextBeforeModesTestExecutionListener@7426a448, org.springframework.boot.test.autoconfigure.SpringBootDependencyInjectionTestExecutionListener@516462cc, org.springframework.test.context.support.DirtiesContextTestExecutionListener@3456558, org.springframework.test.context.transaction.TransactionalTestExecutionListener@2dfb885e, org.springframework.test.context.jdbc.SqlScriptsTestExecutionListener@6cbe7d4d, org.springframework.boot.test.autoconfigure.web.servlet.MockMvcPrintOnlyOnFailureTestExecutionListener@1e3e1014, org.springframework.boot.test.autoconfigure.web.client.MockRestServiceServerResetTestExecutionListener@3679d92e, org.springframework.boot.test.mock.mockito.ResetMocksTestExecutionListener@47b11ec7, org.springframework.boot.test.autoconfigure.web.servlet.WebDriverTestExecutionListener@58fa5769, org.springframework.boot.test.autoconfigure.restdocs.RestDocsTestExecutionListener@36aa52d2, org.springframework.boot.test.mock.mockito.MockitoTestExecutionListener@4ee25d80]
05-Mar-2019 19:08:33 2019-03-05 19:08:33.567  INFO 7439 --- [           main] junit.logTestName                        : Starting Test transformTests(org.springframework.cloud.dataflow.acceptance.test.TransformTests)
05-Mar-2019 19:08:33 2019-03-05 19:08:33.568  INFO 7439 --- [           main] o.s.c.d.acceptance.test.TransformTests   : Creating stream 'TRANSFORM-TEST'
05-Mar-2019 19:08:33 2019-03-05 19:08:33.592  INFO 7439 --- [           main] o.s.c.d.acceptance.test.TransformTests   : Deploying stream 'TRANSFORM-TEST' with properties: {app.*.spring.cloud.streamapp.security.enabled=false, app.*.logging.file=${PID}-test.log, app.*.endpoints.logfile.sensitive=false, app.*.management.endpoints.web.exposure.include=*}
05-Mar-2019 19:08:36 2019-03-05 19:08:36.790  INFO 7439 --- [           main] o.s.c.d.acceptance.test.TransformTests   : Checking: Stream=TRANSFORM-TEST, status = deploying, status description = The stream is being deployed.
05-Mar-2019 19:08:36 2019-03-05 19:08:36.791  INFO 7439 --- [           main] o.s.c.d.acceptance.test.TransformTests   : Sleeping to check status of Stream=TRANSFORM-TEST
05-Mar-2019 19:08:46 2019-03-05 19:08:46.844  INFO 7439 --- [           main] o.s.c.d.acceptance.test.TransformTests   : Checking: Stream=TRANSFORM-TEST, status = deploying, status description = The stream is being deployed.
05-Mar-2019 19:08:46 2019-03-05 19:08:46.845  INFO 7439 --- [           main] o.s.c.d.acceptance.test.TransformTests   : Sleeping to check status of Stream=TRANSFORM-TEST
05-Mar-2019 19:08:56 2019-03-05 19:08:56.906  INFO 7439 --- [           main] o.s.c.d.acceptance.test.TransformTests   : Checking: Stream=TRANSFORM-TEST, status = deployed, status description = The stream has been successfully deployed
05-Mar-2019 19:08:56 2019-03-05 19:08:56.939  INFO 7439 --- [           main] o.s.c.d.acceptance.test.TransformTests   : Sleeping to check status of Stream=TRANSFORM-TEST
05-Mar-2019 19:09:06 2019-03-05 19:09:06.940  INFO 7439 --- [           main] o.s.c.d.acceptance.test.TransformTests   : Stream 'TRANSFORM-TEST' started with status: deployed
05-Mar-2019 19:09:06 2019-03-05 19:09:06.940  INFO 7439 --- [           main] o.s.c.d.acceptance.test.TransformTests   : App 'transform' has instances: {TRANSFORM-TEST.transform-v1-0=http://10.194.6.19:25721}
05-Mar-2019 19:09:06 2019-03-05 19:09:06.940  INFO 7439 --- [           main] o.s.c.d.acceptance.test.TransformTests   : App 'log' has instances: {TRANSFORM-TEST.log-v1-0=http://10.194.6.19:24277}
05-Mar-2019 19:09:06 2019-03-05 19:09:06.940  INFO 7439 --- [           main] o.s.c.d.acceptance.test.TransformTests   : App 'http' has instances: {TRANSFORM-TEST.http-v1-0=http://10.194.6.19:30370}
05-Mar-2019 19:09:06 2019-03-05 19:09:06.940  INFO 7439 --- [           main] o.s.c.d.acceptance.test.TransformTests   : Looking for 'Started HttpSource' in logfile for http
05-Mar-2019 19:09:16 2019-03-05 19:09:16.940  INFO 7439 --- [           main] o.s.c.d.acceptance.test.TransformTests   : Requesting log for app TRANSFORM-TEST.http-v1-0
05-Mar-2019 19:09:17 2019-03-05 19:09:17.087  INFO 7439 --- [           main] o.s.c.d.acceptance.test.TransformTests   : Retrieved logfile from 'http://10.194.6.19:30370/actuator/logfile
05-Mar-2019 19:09:17 2019-03-05 19:09:17.087  INFO 7439 --- [           main] o.s.c.d.acceptance.test.TransformTests   : Matched all 'Started HttpSource' in logfile for app http (source TRANSFORM-TEST.http-v1-0)
05-Mar-2019 19:09:17 2019-03-05 19:09:17.187  INFO 7439 --- [           main] o.s.c.d.acceptance.test.TransformTests   : Looking for 'Started LogSink' in logfile for log
05-Mar-2019 19:09:27 2019-03-05 19:09:27.188  INFO 7439 --- [           main] o.s.c.d.acceptance.test.TransformTests   : Requesting log for app TRANSFORM-TEST.log-v1-0
05-Mar-2019 19:09:27 2019-03-05 19:09:27.358  INFO 7439 --- [           main] o.s.c.d.acceptance.test.TransformTests   : Retrieved logfile from 'http://10.194.6.19:24277/actuator/logfile
05-Mar-2019 19:09:27 2019-03-05 19:09:27.358  INFO 7439 --- [           main] o.s.c.d.acceptance.test.TransformTests   : Matched all 'Started LogSink' in logfile for app log (source TRANSFORM-TEST.log-v1-0)
05-Mar-2019 19:09:27 2019-03-05 19:09:27.358  INFO 7439 --- [           main] o.s.c.d.acceptance.test.TransformTests   : Looking for 'ABCDEFG' in logfile for log
05-Mar-2019 19:09:37 2019-03-05 19:09:37.358  INFO 7439 --- [           main] o.s.c.d.acceptance.test.TransformTests   : Requesting log for app TRANSFORM-TEST.log-v1-0
05-Mar-2019 19:09:37 2019-03-05 19:09:37.367  INFO 7439 --- [           main] o.s.c.d.acceptance.test.TransformTests   : Retrieved logfile from 'http://10.194.6.19:24277/actuator/logfile
05-Mar-2019 19:09:37 2019-03-05 19:09:37.368  INFO 7439 --- [           main] o.s.c.d.acceptance.test.TransformTests   : Matched all 'ABCDEFG' in logfile for app log (source TRANSFORM-TEST.log-v1-0)
05-Mar-2019 19:09:37 2019-03-05 19:09:37.369  INFO 7439 --- [           main] junit.logTestName                        : Test transformTests(org.springframework.cloud.dataflow.acceptance.test.TransformTests) Succeeded
05-Mar-2019 19:09:37 2019-03-05 19:09:37.369  INFO 7439 --- [           main] junit.logTestName                        : Finished Test transformTests(org.springframework.cloud.dataflow.acceptance.test.TransformTests)
05-Mar-2019 19:09:37 2019-03-05 19:09:37.370  INFO 7439 --- [           main] o.s.c.d.acceptance.test.TransformTests   : Destroy all streams
05-Mar-2019 19:09:38 Tests run: 1, Failures: 0, Errors: 0, Skipped: 0, Time elapsed: 64.638 sec - in org.springframework.cloud.dataflow.acceptance.test.TransformTests
05-Mar-2019 19:09:38 Running org.springframework.cloud.dataflow.acceptance.test.SchedulerTests
05-Mar-2019 19:09:38 2019-03-05 19:09:38.221  INFO 7439 --- [           main] s.c.a.AnnotationConfigApplicationContext : Refreshing org.springframework.context.annotation.AnnotationConfigApplicationContext@3c9c6245: startup date [Tue Mar 05 19:09:38 UTC 2019]; root of context hierarchy
05-Mar-2019 19:09:38 2019-03-05 19:09:38.254  INFO 7439 --- [           main] trationDelegate$BeanPostProcessorChecker : Bean 'configurationPropertiesRebinderAutoConfiguration' of type [class org.springframework.cloud.autoconfigure.ConfigurationPropertiesRebinderAutoConfiguration$$EnhancerBySpringCGLIB$$95ff43c0] is not eligible for getting processed by all BeanPostProcessors (for example: not eligible for auto-proxying)
05-Mar-2019 19:09:38
05-Mar-2019 19:09:38   .   ____          _            __ _ _
05-Mar-2019 19:09:38 /\\ / ___'_ __ _ _(_)_ __  __ _ \ \ \ \
05-Mar-2019 19:09:38 ( ( )\___ | '_ | '_| | '_ \/ _` | \ \ \ \
05-Mar-2019 19:09:38 \\/  ___)| |_)| | | | | || (_| |  ) ) ) )
05-Mar-2019 19:09:38   '  |____| .__|_| |_|_| |_\__, | / / / /
05-Mar-2019 19:09:38 =========|_|==============|___/=/_/_/_/
05-Mar-2019 19:09:38 :: Spring Boot ::        (v1.4.1.RELEASE)
05-Mar-2019 19:09:38
05-Mar-2019 19:09:38 2019-03-05 19:09:38.425  INFO 7439 --- [           main] c.c.c.ConfigServicePropertySourceLocator : Fetching config from server at: http://localhost:8888
05-Mar-2019 19:09:38 2019-03-05 19:09:38.430  WARN 7439 --- [           main] c.c.c.ConfigServicePropertySourceLocator : Could not locate PropertySource: I/O error on GET request for "http://localhost:8888//blah": Connection refused (Connection refused); nested exception is java.net.ConnectException: Connection refused (Connection refused)
05-Mar-2019 19:09:38 2019-03-05 19:09:38.431  INFO 7439 --- [           main] o.a.maven.surefire.booter.ForkedBooter   : The following profiles are active: blah
05-Mar-2019 19:09:38 2019-03-05 19:09:38.432  INFO 7439 --- [           main] s.c.a.AnnotationConfigApplicationContext : Refreshing org.springframework.context.annotation.AnnotationConfigApplicationContext@1727e03a: startup date [Tue Mar 05 19:09:38 UTC 2019]; parent: org.springframework.context.annotation.AnnotationConfigApplicationContext@3c9c6245
05-Mar-2019 19:09:38 2019-03-05 19:09:38.516  INFO 7439 --- [           main] o.a.maven.surefire.booter.ForkedBooter   : Started ForkedBooter in 0.455 seconds (JVM running for 470.61)
05-Mar-2019 19:09:38 2019-03-05 19:09:38.517  INFO 7439 --- [           main] s.c.a.AnnotationConfigApplicationContext : Closing org.springframework.context.annotation.AnnotationConfigApplicationContext@1727e03a: startup date [Tue Mar 05 19:09:38 UTC 2019]; parent: org.springframework.context.annotation.AnnotationConfigApplicationContext@3c9c6245
05-Mar-2019 19:09:38 2019-03-05 19:09:38.519 ERROR 7439 --- [           main] o.s.c.d.a.test.util.SchedulerRule        : SCHEDULER IS NOT AVAILABLE, SKIPPING TESTS
05-Mar-2019 19:09:38
05-Mar-2019 19:09:38 java.lang.IllegalArgumentException: no SchedulerOperations bean is available.  Skipping test.
05-Mar-2019 19:09:38         at org.springframework.util.Assert.notNull(Assert.java:115)
05-Mar-2019 19:09:38         at org.springframework.cloud.dataflow.acceptance.test.util.SchedulerRule.obtainResource(SchedulerRule.java:57)
05-Mar-2019 19:09:38         at org.springframework.cloud.scheduler.spi.junit.AbstractExternalResourceTestSupport.apply(AbstractExternalResourceTestSupport.java:58)
05-Mar-2019 19:09:38         at org.junit.rules.RunRules.applyAll(RunRules.java:26)
05-Mar-2019 19:09:38         at org.junit.rules.RunRules.<init>(RunRules.java:15)
05-Mar-2019 19:09:38         at org.junit.runners.ParentRunner.withClassRules(ParentRunner.java:245)
05-Mar-2019 19:09:38         at org.junit.runners.ParentRunner.classBlock(ParentRunner.java:194)
05-Mar-2019 19:09:38         at org.junit.runners.ParentRunner.run(ParentRunner.java:362)
05-Mar-2019 19:09:38         at org.springframework.test.context.junit4.SpringJUnit4ClassRunner.run(SpringJUnit4ClassRunner.java:191)
05-Mar-2019 19:09:38         at org.apache.maven.surefire.junit4.JUnit4Provider.execute(JUnit4Provider.java:283)
05-Mar-2019 19:09:38         at org.apache.maven.surefire.junit4.JUnit4Provider.executeWithRerun(JUnit4Provider.java:173)
05-Mar-2019 19:09:38         at org.apache.maven.surefire.junit4.JUnit4Provider.executeTestSet(JUnit4Provider.java:153)
05-Mar-2019 19:09:38         at org.apache.maven.surefire.junit4.JUnit4Provider.invoke(JUnit4Provider.java:128)
05-Mar-2019 19:09:38         at org.apache.maven.surefire.booter.ForkedBooter.invokeProviderInSameClassLoader(ForkedBooter.java:203)
05-Mar-2019 19:09:38         at org.apache.maven.surefire.booter.ForkedBooter.runSuitesInProcess(ForkedBooter.java:155)
05-Mar-2019 19:09:38         at org.apache.maven.surefire.booter.ForkedBooter.main(ForkedBooter.java:103)
05-Mar-2019 19:09:38
05-Mar-2019 19:09:38 Tests run: 1, Failures: 0, Errors: 0, Skipped: 1, Time elapsed: 0.463 sec - in org.springframework.cloud.dataflow.acceptance.test.SchedulerTests
05-Mar-2019 19:09:38 Running org.springframework.cloud.dataflow.acceptance.test.NamedChannelTests
05-Mar-2019 19:09:38 2019-03-05 19:09:38.523  INFO 7439 --- [           main] .b.t.c.SpringBootTestContextBootstrapper : Neither @ContextConfiguration nor @ContextHierarchy found for test class [org.springframework.cloud.dataflow.acceptance.test.NamedChannelTests], using SpringBootContextLoader
05-Mar-2019 19:09:38 2019-03-05 19:09:38.529  INFO 7439 --- [           main] .b.t.c.SpringBootTestContextBootstrapper : Loaded default TestExecutionListener class names from location [META-INF/spring.factories]: [org.springframework.boot.test.mock.mockito.MockitoTestExecutionListener, org.springframework.boot.test.mock.mockito.ResetMocksTestExecutionListener, org.springframework.boot.test.autoconfigure.restdocs.RestDocsTestExecutionListener, org.springframework.boot.test.autoconfigure.web.client.MockRestServiceServerResetTestExecutionListener, org.springframework.boot.test.autoconfigure.web.servlet.MockMvcPrintOnlyOnFailureTestExecutionListener, org.springframework.boot.test.autoconfigure.web.servlet.WebDriverTestExecutionListener, org.springframework.test.context.web.ServletTestExecutionListener, org.springframework.test.context.support.DirtiesContextBeforeModesTestExecutionListener, org.springframework.test.context.support.DependencyInjectionTestExecutionListener, org.springframework.test.context.support.DirtiesContextTestExecutionListener, org.springframework.test.context.transaction.TransactionalTestExecutionListener, org.springframework.test.context.jdbc.SqlScriptsTestExecutionListener]
05-Mar-2019 19:09:38 2019-03-05 19:09:38.531  INFO 7439 --- [           main] .b.t.c.SpringBootTestContextBootstrapper : Using TestExecutionListeners: [org.springframework.test.context.web.ServletTestExecutionListener@60ed12e8, org.springframework.test.context.support.DirtiesContextBeforeModesTestExecutionListener@24c8d8be, org.springframework.boot.test.autoconfigure.SpringBootDependencyInjectionTestExecutionListener@3290b1a6, org.springframework.test.context.support.DirtiesContextTestExecutionListener@6fcd31c3, org.springframework.test.context.transaction.TransactionalTestExecutionListener@67bf0480, org.springframework.test.context.jdbc.SqlScriptsTestExecutionListener@5503de1, org.springframework.boot.test.autoconfigure.web.servlet.MockMvcPrintOnlyOnFailureTestExecutionListener@32faa16c, org.springframework.boot.test.autoconfigure.web.client.MockRestServiceServerResetTestExecutionListener@343fddd9, org.springframework.boot.test.mock.mockito.ResetMocksTestExecutionListener@2bbb44da, org.springframework.boot.test.autoconfigure.web.servlet.WebDriverTestExecutionListener@2f80cb79, org.springframework.boot.test.autoconfigure.restdocs.RestDocsTestExecutionListener@4816ee24, org.springframework.boot.test.mock.mockito.MockitoTestExecutionListener@20d33ea]
05-Mar-2019 19:09:38 2019-03-05 19:09:38.594  INFO 7439 --- [           main] junit.logTestName                        : Starting Test testDestination(org.springframework.cloud.dataflow.acceptance.test.NamedChannelTests)
05-Mar-2019 19:09:38 2019-03-05 19:09:38.596  INFO 7439 --- [           main] o.s.c.d.a.test.NamedChannelTests         : Creating stream 'LOG-DESTINATION-SINK'
05-Mar-2019 19:09:38 2019-03-05 19:09:38.623  INFO 7439 --- [           main] o.s.c.d.a.test.NamedChannelTests         : Deploying stream 'LOG-DESTINATION-SINK' with properties: {app.*.spring.cloud.streamapp.security.enabled=false, app.*.logging.file=${PID}-test.log, app.*.endpoints.logfile.sensitive=false, app.*.management.endpoints.web.exposure.include=*}
05-Mar-2019 19:09:38 2019-03-05 19:09:38.910  INFO 7439 --- [           main] o.s.c.d.a.test.NamedChannelTests         : Checking: Stream=LOG-DESTINATION-SINK, status = deploying, status description = The stream is being deployed.
05-Mar-2019 19:09:38 2019-03-05 19:09:38.911  INFO 7439 --- [           main] o.s.c.d.a.test.NamedChannelTests         : Sleeping to check status of Stream=LOG-DESTINATION-SINK
05-Mar-2019 19:09:48 2019-03-05 19:09:48.938  INFO 7439 --- [           main] o.s.c.d.a.test.NamedChannelTests         : Checking: Stream=LOG-DESTINATION-SINK, status = deployed, status description = The stream has been successfully deployed
05-Mar-2019 19:09:48 2019-03-05 19:09:48.972  INFO 7439 --- [           main] o.s.c.d.a.test.NamedChannelTests         : Sleeping to check status of Stream=LOG-DESTINATION-SINK
05-Mar-2019 19:09:58 2019-03-05 19:09:58.973  INFO 7439 --- [           main] o.s.c.d.a.test.NamedChannelTests         : Stream 'LOG-DESTINATION-SINK' started with status: deployed
05-Mar-2019 19:09:58 2019-03-05 19:09:58.973  INFO 7439 --- [           main] o.s.c.d.a.test.NamedChannelTests         : App 'log' has instances: {LOG-DESTINATION-SINK.log-v1-0=http://10.194.6.19:53406}
05-Mar-2019 19:09:58 2019-03-05 19:09:58.973  INFO 7439 --- [           main] o.s.c.d.a.test.NamedChannelTests         : Looking for 'Started LogSink' in logfile for log
05-Mar-2019 19:10:08 2019-03-05 19:10:08.973  INFO 7439 --- [           main] o.s.c.d.a.test.NamedChannelTests         : Requesting log for app LOG-DESTINATION-SINK.log-v1-0
05-Mar-2019 19:10:09 2019-03-05 19:10:09.112  INFO 7439 --- [           main] o.s.c.d.a.test.NamedChannelTests         : Retrieved logfile from 'http://10.194.6.19:53406/actuator/logfile
05-Mar-2019 19:10:09 2019-03-05 19:10:09.113  INFO 7439 --- [           main] o.s.c.d.a.test.NamedChannelTests         : Matched all 'Started LogSink' in logfile for app log (source LOG-DESTINATION-SINK.log-v1-0)
05-Mar-2019 19:10:09 2019-03-05 19:10:09.114  INFO 7439 --- [           main] o.s.c.d.a.test.NamedChannelTests         : Creating stream 'HTTP-DESTINATION-SOURCE'
05-Mar-2019 19:10:09 2019-03-05 19:10:09.154  INFO 7439 --- [           main] o.s.c.d.a.test.NamedChannelTests         : Deploying stream 'HTTP-DESTINATION-SOURCE' with properties: {app.*.spring.cloud.streamapp.security.enabled=false, app.*.logging.file=${PID}-test.log, app.*.endpoints.logfile.sensitive=false, app.*.management.endpoints.web.exposure.include=*}
05-Mar-2019 19:10:09 2019-03-05 19:10:09.448  INFO 7439 --- [           main] o.s.c.d.a.test.NamedChannelTests         : Checking: Stream=HTTP-DESTINATION-SOURCE, status = deploying, status description = The stream is being deployed.
05-Mar-2019 19:10:09 2019-03-05 19:10:09.448  INFO 7439 --- [           main] o.s.c.d.a.test.NamedChannelTests         : Sleeping to check status of Stream=HTTP-DESTINATION-SOURCE
05-Mar-2019 19:10:19 2019-03-05 19:10:19.493  INFO 7439 --- [           main] o.s.c.d.a.test.NamedChannelTests         : Checking: Stream=HTTP-DESTINATION-SOURCE, status = deployed, status description = The stream has been successfully deployed
05-Mar-2019 19:10:19 2019-03-05 19:10:19.541  INFO 7439 --- [           main] o.s.c.d.a.test.NamedChannelTests         : Sleeping to check status of Stream=HTTP-DESTINATION-SOURCE
05-Mar-2019 19:10:29 2019-03-05 19:10:29.541  INFO 7439 --- [           main] o.s.c.d.a.test.NamedChannelTests         : Stream 'HTTP-DESTINATION-SOURCE' started with status: deployed
05-Mar-2019 19:10:29 2019-03-05 19:10:29.542  INFO 7439 --- [           main] o.s.c.d.a.test.NamedChannelTests         : App 'http' has instances: {HTTP-DESTINATION-SOURCE.http-v1-0=http://10.194.6.19:22614}
05-Mar-2019 19:10:29 2019-03-05 19:10:29.543  INFO 7439 --- [           main] o.s.c.d.a.test.NamedChannelTests         : Looking for 'Started HttpSource' in logfile for http
05-Mar-2019 19:10:39 2019-03-05 19:10:39.543  INFO 7439 --- [           main] o.s.c.d.a.test.NamedChannelTests         : Requesting log for app HTTP-DESTINATION-SOURCE.http-v1-0
05-Mar-2019 19:10:39 2019-03-05 19:10:39.680  INFO 7439 --- [           main] o.s.c.d.a.test.NamedChannelTests         : Retrieved logfile from 'http://10.194.6.19:22614/actuator/logfile
05-Mar-2019 19:10:39 2019-03-05 19:10:39.680  INFO 7439 --- [           main] o.s.c.d.a.test.NamedChannelTests         : Matched all 'Started HttpSource' in logfile for app http (source HTTP-DESTINATION-SOURCE.http-v1-0)
05-Mar-2019 19:10:39 2019-03-05 19:10:39.782  INFO 7439 --- [           main] o.s.c.d.a.test.NamedChannelTests         : Looking for 'abcdefg' in logfile for log
05-Mar-2019 19:10:49 2019-03-05 19:10:49.783  INFO 7439 --- [           main] o.s.c.d.a.test.NamedChannelTests         : Requesting log for app LOG-DESTINATION-SINK.log-v1-0
05-Mar-2019 19:10:49 2019-03-05 19:10:49.791  INFO 7439 --- [           main] o.s.c.d.a.test.NamedChannelTests         : Retrieved logfile from 'http://10.194.6.19:53406/actuator/logfile
05-Mar-2019 19:10:49 2019-03-05 19:10:49.791  INFO 7439 --- [           main] o.s.c.d.a.test.NamedChannelTests         : Matched all 'abcdefg' in logfile for app log (source LOG-DESTINATION-SINK.log-v1-0)
05-Mar-2019 19:10:49 2019-03-05 19:10:49.793  INFO 7439 --- [           main] junit.logTestName                        : Test testDestination(org.springframework.cloud.dataflow.acceptance.test.NamedChannelTests) Succeeded
05-Mar-2019 19:10:49 2019-03-05 19:10:49.794  INFO 7439 --- [           main] junit.logTestName                        : Finished Test testDestination(org.springframework.cloud.dataflow.acceptance.test.NamedChannelTests)
05-Mar-2019 19:10:49 2019-03-05 19:10:49.794  INFO 7439 --- [           main] o.s.c.d.a.test.NamedChannelTests         : Destroy all streams
05-Mar-2019 19:10:50 2019-03-05 19:10:50.537  INFO 7439 --- [           main] junit.logTestName                        : Starting Test testTap(org.springframework.cloud.dataflow.acceptance.test.NamedChannelTests)
05-Mar-2019 19:10:50 2019-03-05 19:10:50.538  INFO 7439 --- [           main] o.s.c.d.a.test.NamedChannelTests         : Creating stream 'TAPHTTP'
05-Mar-2019 19:10:50 2019-03-05 19:10:50.563  INFO 7439 --- [           main] o.s.c.d.a.test.NamedChannelTests         : Deploying stream 'TAPHTTP' with properties: {app.*.spring.cloud.streamapp.security.enabled=false, app.*.logging.file=${PID}-test.log, app.*.endpoints.logfile.sensitive=false, app.*.management.endpoints.web.exposure.include=*}
05-Mar-2019 19:10:51 2019-03-05 19:10:51.015  INFO 7439 --- [           main] o.s.c.d.a.test.NamedChannelTests         : Checking: Stream=TAPHTTP, status = deploying, status description = The stream is being deployed.
05-Mar-2019 19:10:51 2019-03-05 19:10:51.015  INFO 7439 --- [           main] o.s.c.d.a.test.NamedChannelTests         : Sleeping to check status of Stream=TAPHTTP
05-Mar-2019 19:11:01 2019-03-05 19:11:01.064  INFO 7439 --- [           main] o.s.c.d.a.test.NamedChannelTests         : Checking: Stream=TAPHTTP, status = deploying, status description = The stream is being deployed.
05-Mar-2019 19:11:01 2019-03-05 19:11:01.065  INFO 7439 --- [           main] o.s.c.d.a.test.NamedChannelTests         : Sleeping to check status of Stream=TAPHTTP
05-Mar-2019 19:11:11 2019-03-05 19:11:11.105  INFO 7439 --- [           main] o.s.c.d.a.test.NamedChannelTests         : Checking: Stream=TAPHTTP, status = deployed, status description = The stream has been successfully deployed
05-Mar-2019 19:11:11 2019-03-05 19:11:11.146  INFO 7439 --- [           main] o.s.c.d.a.test.NamedChannelTests         : Sleeping to check status of Stream=TAPHTTP
05-Mar-2019 19:11:21 2019-03-05 19:11:21.147  INFO 7439 --- [           main] o.s.c.d.a.test.NamedChannelTests         : Stream 'TAPHTTP' started with status: deployed
05-Mar-2019 19:11:21 2019-03-05 19:11:21.147  INFO 7439 --- [           main] o.s.c.d.a.test.NamedChannelTests         : App 'log' has instances: {TAPHTTP.log-v1-0=http://10.194.6.19:53107}
05-Mar-2019 19:11:21 2019-03-05 19:11:21.147  INFO 7439 --- [           main] o.s.c.d.a.test.NamedChannelTests         : App 'http' has instances: {TAPHTTP.http-v1-0=http://10.194.6.19:42381}
05-Mar-2019 19:11:21 2019-03-05 19:11:21.147  INFO 7439 --- [           main] o.s.c.d.a.test.NamedChannelTests         : Looking for 'Started HttpSource' in logfile for http
05-Mar-2019 19:11:31 2019-03-05 19:11:31.147  INFO 7439 --- [           main] o.s.c.d.a.test.NamedChannelTests         : Requesting log for app TAPHTTP.http-v1-0
05-Mar-2019 19:11:31 2019-03-05 19:11:31.336  INFO 7439 --- [           main] o.s.c.d.a.test.NamedChannelTests         : Retrieved logfile from 'http://10.194.6.19:42381/actuator/logfile
05-Mar-2019 19:11:31 2019-03-05 19:11:31.336  INFO 7439 --- [           main] o.s.c.d.a.test.NamedChannelTests         : Matched all 'Started HttpSource' in logfile for app http (source TAPHTTP.http-v1-0)
05-Mar-2019 19:11:31 2019-03-05 19:11:31.336  INFO 7439 --- [           main] o.s.c.d.a.test.NamedChannelTests         : Looking for 'Started LogSink' in logfile for log
05-Mar-2019 19:11:41 2019-03-05 19:11:41.337  INFO 7439 --- [           main] o.s.c.d.a.test.NamedChannelTests         : Requesting log for app TAPHTTP.log-v1-0
05-Mar-2019 19:11:41 2019-03-05 19:11:41.514  INFO 7439 --- [           main] o.s.c.d.a.test.NamedChannelTests         : Retrieved logfile from 'http://10.194.6.19:53107/actuator/logfile
05-Mar-2019 19:11:41 2019-03-05 19:11:41.515  INFO 7439 --- [           main] o.s.c.d.a.test.NamedChannelTests         : Matched all 'Started LogSink' in logfile for app log (source TAPHTTP.log-v1-0)
05-Mar-2019 19:11:41 2019-03-05 19:11:41.515  INFO 7439 --- [           main] o.s.c.d.a.test.NamedChannelTests         : Creating stream 'TAPSTREAM'
05-Mar-2019 19:11:41 2019-03-05 19:11:41.550  INFO 7439 --- [           main] o.s.c.d.a.test.NamedChannelTests         : Deploying stream 'TAPSTREAM' with properties: {app.*.spring.cloud.streamapp.security.enabled=false, app.*.logging.file=${PID}-test.log, app.*.endpoints.logfile.sensitive=false, app.*.management.endpoints.web.exposure.include=*}
05-Mar-2019 19:11:41 2019-03-05 19:11:41.852  INFO 7439 --- [           main] o.s.c.d.a.test.NamedChannelTests         : Checking: Stream=TAPSTREAM, status = deploying, status description = The stream is being deployed.
05-Mar-2019 19:11:41 2019-03-05 19:11:41.852  INFO 7439 --- [           main] o.s.c.d.a.test.NamedChannelTests         : Sleeping to check status of Stream=TAPSTREAM
05-Mar-2019 19:11:51 2019-03-05 19:11:51.921  INFO 7439 --- [           main] o.s.c.d.a.test.NamedChannelTests         : Checking: Stream=TAPSTREAM, status = deployed, status description = The stream has been successfully deployed
05-Mar-2019 19:11:51 2019-03-05 19:11:51.962  INFO 7439 --- [           main] o.s.c.d.a.test.NamedChannelTests         : Sleeping to check status of Stream=TAPSTREAM
05-Mar-2019 19:12:01 2019-03-05 19:12:01.962  INFO 7439 --- [           main] o.s.c.d.a.test.NamedChannelTests         : Stream 'TAPSTREAM' started with status: deployed
05-Mar-2019 19:12:01 2019-03-05 19:12:01.962  INFO 7439 --- [           main] o.s.c.d.a.test.NamedChannelTests         : App 'log' has instances: {TAPSTREAM.log-v1-0=http://10.194.6.19:49282}
05-Mar-2019 19:12:01 2019-03-05 19:12:01.962  INFO 7439 --- [           main] o.s.c.d.a.test.NamedChannelTests         : Looking for 'Started LogSink' in logfile for log
05-Mar-2019 19:12:11 2019-03-05 19:12:11.962  INFO 7439 --- [           main] o.s.c.d.a.test.NamedChannelTests         : Requesting log for app TAPSTREAM.log-v1-0
05-Mar-2019 19:12:12 2019-03-05 19:12:12.112  INFO 7439 --- [           main] o.s.c.d.a.test.NamedChannelTests         : Retrieved logfile from 'http://10.194.6.19:49282/actuator/logfile
05-Mar-2019 19:12:12 2019-03-05 19:12:12.112  INFO 7439 --- [           main] o.s.c.d.a.test.NamedChannelTests         : Matched all 'Started LogSink' in logfile for app log (source TAPSTREAM.log-v1-0)
05-Mar-2019 19:12:12 2019-03-05 19:12:12.231  INFO 7439 --- [           main] o.s.c.d.a.test.NamedChannelTests         : Looking for 'abcdefg' in logfile for log
05-Mar-2019 19:12:22 2019-03-05 19:12:22.231  INFO 7439 --- [           main] o.s.c.d.a.test.NamedChannelTests         : Requesting log for app TAPSTREAM.log-v1-0
05-Mar-2019 19:12:22 2019-03-05 19:12:22.239  INFO 7439 --- [           main] o.s.c.d.a.test.NamedChannelTests         : Retrieved logfile from 'http://10.194.6.19:49282/actuator/logfile
05-Mar-2019 19:12:22 2019-03-05 19:12:22.239  INFO 7439 --- [           main] o.s.c.d.a.test.NamedChannelTests         : Matched all 'abcdefg' in logfile for app log (source TAPSTREAM.log-v1-0)
05-Mar-2019 19:12:22 2019-03-05 19:12:22.240  INFO 7439 --- [           main] junit.logTestName                        : Test testTap(org.springframework.cloud.dataflow.acceptance.test.NamedChannelTests) Succeeded
05-Mar-2019 19:12:22 2019-03-05 19:12:22.240  INFO 7439 --- [           main] junit.logTestName                        : Finished Test testTap(org.springframework.cloud.dataflow.acceptance.test.NamedChannelTests)
05-Mar-2019 19:12:22 2019-03-05 19:12:22.240  INFO 7439 --- [           main] o.s.c.d.a.test.NamedChannelTests         : Destroy all streams
05-Mar-2019 19:12:22 2019-03-05 19:12:22.965  INFO 7439 --- [           main] junit.logTestName                        : Starting Test manyToOneTest(org.springframework.cloud.dataflow.acceptance.test.NamedChannelTests)
05-Mar-2019 19:12:22 2019-03-05 19:12:22.966  INFO 7439 --- [           main] o.s.c.d.a.test.NamedChannelTests         : Creating stream 'MANY-TO-ONE'
05-Mar-2019 19:12:22 2019-03-05 19:12:22.993  INFO 7439 --- [           main] o.s.c.d.a.test.NamedChannelTests         : Deploying stream 'MANY-TO-ONE' with properties: {app.*.spring.cloud.streamapp.security.enabled=false, app.*.logging.file=${PID}-test.log, app.*.endpoints.logfile.sensitive=false, app.*.management.endpoints.web.exposure.include=*}
05-Mar-2019 19:12:23 2019-03-05 19:12:23.315  INFO 7439 --- [           main] o.s.c.d.a.test.NamedChannelTests         : Checking: Stream=MANY-TO-ONE, status = deploying, status description = The stream is being deployed.
05-Mar-2019 19:12:23 2019-03-05 19:12:23.315  INFO 7439 --- [           main] o.s.c.d.a.test.NamedChannelTests         : Sleeping to check status of Stream=MANY-TO-ONE
05-Mar-2019 19:12:33 2019-03-05 19:12:33.353  INFO 7439 --- [           main] o.s.c.d.a.test.NamedChannelTests         : Checking: Stream=MANY-TO-ONE, status = deployed, status description = The stream has been successfully deployed
05-Mar-2019 19:12:33 2019-03-05 19:12:33.392  INFO 7439 --- [           main] o.s.c.d.a.test.NamedChannelTests         : Sleeping to check status of Stream=MANY-TO-ONE
05-Mar-2019 19:12:43 2019-03-05 19:12:43.393  INFO 7439 --- [           main] o.s.c.d.a.test.NamedChannelTests         : Stream 'MANY-TO-ONE' started with status: deployed
05-Mar-2019 19:12:43 2019-03-05 19:12:43.394  INFO 7439 --- [           main] o.s.c.d.a.test.NamedChannelTests         : App 'log' has instances: {MANY-TO-ONE.log-v1-0=http://10.194.6.19:38154}
05-Mar-2019 19:12:43 2019-03-05 19:12:43.394  INFO 7439 --- [           main] o.s.c.d.a.test.NamedChannelTests         : Looking for 'Started LogSink' in logfile for log
05-Mar-2019 19:12:53 2019-03-05 19:12:53.394  INFO 7439 --- [           main] o.s.c.d.a.test.NamedChannelTests         : Requesting log for app MANY-TO-ONE.log-v1-0
05-Mar-2019 19:12:53 2019-03-05 19:12:53.540  INFO 7439 --- [           main] o.s.c.d.a.test.NamedChannelTests         : Retrieved logfile from 'http://10.194.6.19:38154/actuator/logfile
05-Mar-2019 19:12:53 2019-03-05 19:12:53.540  INFO 7439 --- [           main] o.s.c.d.a.test.NamedChannelTests         : Matched all 'Started LogSink' in logfile for app log (source MANY-TO-ONE.log-v1-0)
05-Mar-2019 19:12:53 2019-03-05 19:12:53.541  INFO 7439 --- [           main] o.s.c.d.a.test.NamedChannelTests         : Creating stream 'HTTP-SOURCE-1'
05-Mar-2019 19:12:53 2019-03-05 19:12:53.563  INFO 7439 --- [           main] o.s.c.d.a.test.NamedChannelTests         : Deploying stream 'HTTP-SOURCE-1' with properties: {app.*.spring.cloud.streamapp.security.enabled=false, app.*.logging.file=${PID}-test.log, app.*.endpoints.logfile.sensitive=false, app.*.management.endpoints.web.exposure.include=*}
05-Mar-2019 19:12:53 2019-03-05 19:12:53.866  INFO 7439 --- [           main] o.s.c.d.a.test.NamedChannelTests         : Checking: Stream=HTTP-SOURCE-1, status = deploying, status description = The stream is being deployed.
05-Mar-2019 19:12:53 2019-03-05 19:12:53.866  INFO 7439 --- [           main] o.s.c.d.a.test.NamedChannelTests         : Sleeping to check status of Stream=HTTP-SOURCE-1
05-Mar-2019 19:13:03 2019-03-05 19:13:03.914  INFO 7439 --- [           main] o.s.c.d.a.test.NamedChannelTests         : Checking: Stream=HTTP-SOURCE-1, status = deployed, status description = The stream has been successfully deployed
05-Mar-2019 19:13:03 2019-03-05 19:13:03.943  INFO 7439 --- [           main] o.s.c.d.a.test.NamedChannelTests         : Sleeping to check status of Stream=HTTP-SOURCE-1
05-Mar-2019 19:13:13 2019-03-05 19:13:13.944  INFO 7439 --- [           main] o.s.c.d.a.test.NamedChannelTests         : Stream 'HTTP-SOURCE-1' started with status: deployed
05-Mar-2019 19:13:13 2019-03-05 19:13:13.944  INFO 7439 --- [           main] o.s.c.d.a.test.NamedChannelTests         : App 'http' has instances: {HTTP-SOURCE-1.http-v1-0=http://10.194.6.19:34802}
05-Mar-2019 19:13:13 2019-03-05 19:13:13.944  INFO 7439 --- [           main] o.s.c.d.a.test.NamedChannelTests         : Looking for 'Started HttpSource' in logfile for http
05-Mar-2019 19:13:23 2019-03-05 19:13:23.944  INFO 7439 --- [           main] o.s.c.d.a.test.NamedChannelTests         : Requesting log for app HTTP-SOURCE-1.http-v1-0
05-Mar-2019 19:13:24 2019-03-05 19:13:24.124  INFO 7439 --- [           main] o.s.c.d.a.test.NamedChannelTests         : Retrieved logfile from 'http://10.194.6.19:34802/actuator/logfile
05-Mar-2019 19:13:24 2019-03-05 19:13:24.124  INFO 7439 --- [           main] o.s.c.d.a.test.NamedChannelTests         : Matched all 'Started HttpSource' in logfile for app http (source HTTP-SOURCE-1.http-v1-0)
05-Mar-2019 19:13:24 2019-03-05 19:13:24.124  INFO 7439 --- [           main] o.s.c.d.a.test.NamedChannelTests         : Creating stream 'HTTP-SOURCE-2'
05-Mar-2019 19:13:24 2019-03-05 19:13:24.152  INFO 7439 --- [           main] o.s.c.d.a.test.NamedChannelTests         : Deploying stream 'HTTP-SOURCE-2' with properties: {app.*.spring.cloud.streamapp.security.enabled=false, app.*.logging.file=${PID}-test.log, app.*.endpoints.logfile.sensitive=false, app.*.management.endpoints.web.exposure.include=*}
05-Mar-2019 19:13:24 2019-03-05 19:13:24.537  INFO 7439 --- [           main] o.s.c.d.a.test.NamedChannelTests         : Checking: Stream=HTTP-SOURCE-2, status = deploying, status description = The stream is being deployed.
05-Mar-2019 19:13:24 2019-03-05 19:13:24.537  INFO 7439 --- [           main] o.s.c.d.a.test.NamedChannelTests         : Sleeping to check status of Stream=HTTP-SOURCE-2
05-Mar-2019 19:13:34 2019-03-05 19:13:34.620  INFO 7439 --- [           main] o.s.c.d.a.test.NamedChannelTests         : Checking: Stream=HTTP-SOURCE-2, status = deployed, status description = The stream has been successfully deployed
05-Mar-2019 19:13:34 2019-03-05 19:13:34.658  INFO 7439 --- [           main] o.s.c.d.a.test.NamedChannelTests         : Sleeping to check status of Stream=HTTP-SOURCE-2
05-Mar-2019 19:13:44 2019-03-05 19:13:44.658  INFO 7439 --- [           main] o.s.c.d.a.test.NamedChannelTests         : Stream 'HTTP-SOURCE-2' started with status: deployed
05-Mar-2019 19:13:44 2019-03-05 19:13:44.658  INFO 7439 --- [           main] o.s.c.d.a.test.NamedChannelTests         : App 'http' has instances: {HTTP-SOURCE-2.http-v1-0=http://10.194.6.19:38347}
05-Mar-2019 19:13:44 2019-03-05 19:13:44.659  INFO 7439 --- [           main] o.s.c.d.a.test.NamedChannelTests         : Looking for 'Started HttpSource' in logfile for http
05-Mar-2019 19:13:54 2019-03-05 19:13:54.659  INFO 7439 --- [           main] o.s.c.d.a.test.NamedChannelTests         : Requesting log for app HTTP-SOURCE-2.http-v1-0
05-Mar-2019 19:13:54 2019-03-05 19:13:54.793  INFO 7439 --- [           main] o.s.c.d.a.test.NamedChannelTests         : Retrieved logfile from 'http://10.194.6.19:38347/actuator/logfile
05-Mar-2019 19:13:54 2019-03-05 19:13:54.794  INFO 7439 --- [           main] o.s.c.d.a.test.NamedChannelTests         : Matched all 'Started HttpSource' in logfile for app http (source HTTP-SOURCE-2.http-v1-0)
05-Mar-2019 19:13:54 2019-03-05 19:13:54.913  INFO 7439 --- [           main] o.s.c.d.a.test.NamedChannelTests         : Looking for 'abcdefg' in logfile for log
05-Mar-2019 19:14:04 2019-03-05 19:14:04.913  INFO 7439 --- [           main] o.s.c.d.a.test.NamedChannelTests         : Requesting log for app MANY-TO-ONE.log-v1-0
05-Mar-2019 19:14:04 2019-03-05 19:14:04.921  INFO 7439 --- [           main] o.s.c.d.a.test.NamedChannelTests         : Retrieved logfile from 'http://10.194.6.19:38154/actuator/logfile
05-Mar-2019 19:14:04 2019-03-05 19:14:04.921  INFO 7439 --- [           main] o.s.c.d.a.test.NamedChannelTests         : Matched all 'abcdefg' in logfile for app log (source MANY-TO-ONE.log-v1-0)
05-Mar-2019 19:14:05 2019-03-05 19:14:05.058  INFO 7439 --- [           main] o.s.c.d.a.test.NamedChannelTests         : Looking for 'hijklmn' in logfile for log
05-Mar-2019 19:14:15 2019-03-05 19:14:15.058  INFO 7439 --- [           main] o.s.c.d.a.test.NamedChannelTests         : Requesting log for app MANY-TO-ONE.log-v1-0
05-Mar-2019 19:14:15 2019-03-05 19:14:15.068  INFO 7439 --- [           main] o.s.c.d.a.test.NamedChannelTests         : Retrieved logfile from 'http://10.194.6.19:38154/actuator/logfile
05-Mar-2019 19:14:15 2019-03-05 19:14:15.068  INFO 7439 --- [           main] o.s.c.d.a.test.NamedChannelTests         : Matched all 'hijklmn' in logfile for app log (source MANY-TO-ONE.log-v1-0)
05-Mar-2019 19:14:15 2019-03-05 19:14:15.069  INFO 7439 --- [           main] junit.logTestName                        : Test manyToOneTest(org.springframework.cloud.dataflow.acceptance.test.NamedChannelTests) Succeeded
05-Mar-2019 19:14:15 2019-03-05 19:14:15.069  INFO 7439 --- [           main] junit.logTestName                        : Finished Test manyToOneTest(org.springframework.cloud.dataflow.acceptance.test.NamedChannelTests)
05-Mar-2019 19:14:15 2019-03-05 19:14:15.069  INFO 7439 --- [           main] o.s.c.d.a.test.NamedChannelTests         : Destroy all streams
05-Mar-2019 19:14:15 Tests run: 4, Failures: 0, Errors: 0, Skipped: 1, Time elapsed: 276.894 sec - in org.springframework.cloud.dataflow.acceptance.test.NamedChannelTests
05-Mar-2019 19:14:15 Running org.springframework.cloud.dataflow.acceptance.test.util.PlatformHelperTests
05-Mar-2019 19:14:15 Tests run: 3, Failures: 0, Errors: 0, Skipped: 0, Time elapsed: 0.122 sec - in org.springframework.cloud.dataflow.acceptance.test.util.PlatformHelperTests
05-Mar-2019 19:14:15 Running org.springframework.cloud.dataflow.acceptance.test.util.ApplicationTests
05-Mar-2019 19:14:15 Tests run: 2, Failures: 0, Errors: 0, Skipped: 0, Time elapsed: 0.001 sec - in org.springframework.cloud.dataflow.acceptance.test.util.ApplicationTests
05-Mar-2019 19:14:15 2019-03-05 19:14:15.560  INFO 7439 --- [       Thread-6] o.s.c.support.GenericApplicationContext  : Closing org.springframework.context.support.GenericApplicationContext@69923ac3: startup date [Tue Mar 05 19:04:40 UTC 2019]; root of context hierarchy
05-Mar-2019 19:14:15
05-Mar-2019 19:14:15 Results :
05-Mar-2019 19:14:15
05-Mar-2019 19:14:15 Tests run: 19, Failures: 0, Errors: 0, Skipped: 4
05-Mar-2019 19:14:15
05-Mar-2019 19:14:15 [INFO]
05-Mar-2019 19:14:15 [INFO] >>> maven-surefire-report-plugin:3.0.0-M3:report (default-cli) > [surefire]test @ spring-cloud-dataflow-acceptance-tests >>>
05-Mar-2019 19:14:15 [INFO]
05-Mar-2019 19:14:15 [INFO] --- maven-checkstyle-plugin:2.17:check (checkstyle-validation) @ spring-cloud-dataflow-acceptance-tests ---
05-Mar-2019 19:14:15 [INFO]
05-Mar-2019 19:14:15 [INFO] --- maven-resources-plugin:2.6:resources (default-resources) @ spring-cloud-dataflow-acceptance-tests ---
05-Mar-2019 19:14:15 [INFO] Using 'UTF-8' encoding to copy filtered resources.
05-Mar-2019 19:14:15 [INFO] skip non existing resourceDirectory /opt/bamboo-home/xml-data/build-dir/SCDT-LOCAL20XSKIPPER20X-KAFKA/src/main/resources
05-Mar-2019 19:14:15 [INFO] skip non existing resourceDirectory /opt/bamboo-home/xml-data/build-dir/SCDT-LOCAL20XSKIPPER20X-KAFKA/src/main/resources
05-Mar-2019 19:14:15 [INFO]
05-Mar-2019 19:14:15 [INFO] --- maven-compiler-plugin:3.1:compile (default-compile) @ spring-cloud-dataflow-acceptance-tests ---
05-Mar-2019 19:14:15 [INFO] Nothing to compile - all classes are up to date
05-Mar-2019 19:14:15 [INFO]
05-Mar-2019 19:14:15 [INFO] --- maven-resources-plugin:2.6:testResources (default-testResources) @ spring-cloud-dataflow-acceptance-tests ---
05-Mar-2019 19:14:15 [INFO] Using 'UTF-8' encoding to copy filtered resources.
05-Mar-2019 19:14:15 [INFO] Copying 1 resource
05-Mar-2019 19:14:15 [INFO]
05-Mar-2019 19:14:15 [INFO] --- maven-compiler-plugin:3.1:testCompile (default-testCompile) @ spring-cloud-dataflow-acceptance-tests ---
05-Mar-2019 19:14:15 [INFO] Nothing to compile - all classes are up to date
05-Mar-2019 19:14:15 [INFO]
05-Mar-2019 19:14:15 [INFO] --- maven-surefire-plugin:2.18.1:test (default-test) @ spring-cloud-dataflow-acceptance-tests ---
05-Mar-2019 19:14:15 [INFO] Skipping execution of surefire because it has already been run for this configuration
05-Mar-2019 19:14:15 [INFO]
05-Mar-2019 19:14:15 [INFO] <<< maven-surefire-report-plugin:3.0.0-M3:report (default-cli) < [surefire]test @ spring-cloud-dataflow-acceptance-tests <<<
05-Mar-2019 19:14:15 [INFO]
05-Mar-2019 19:14:15 [INFO] --- maven-surefire-report-plugin:3.0.0-M3:report (default-cli) @ spring-cloud-dataflow-acceptance-tests ---
05-Mar-2019 19:14:15 [WARNING] Unable to locate Test Source XRef to link to - DISABLED
05-Mar-2019 19:14:16 [INFO] ------------------------------------------------------------------------
05-Mar-2019 19:14:16 [INFO] BUILD SUCCESS
05-Mar-2019 19:14:16 [INFO] ------------------------------------------------------------------------
05-Mar-2019 19:14:16 [INFO] Total time: 12:31 min
05-Mar-2019 19:14:16 [INFO] Finished at: 2019-03-05T19:14:16+00:00
05-Mar-2019 19:14:16 [INFO] Final Memory: 60M/462M
05-Mar-2019 19:14:16 [INFO] ------------------------------------------------------------------------
05-Mar-2019 19:14:16 Clean up, clean up, everybody everywhere; clean up clean up, everybody do your share!
05-Mar-2019 19:14:16 Killing process PID [7279]
05-Mar-2019 19:14:16 Killing process PID [7182]
05-Mar-2019 19:14:16 No stopped containers
05-Mar-2019 19:14:17 Stopping mysql_mysql_1 ...
05-Mar-2019 19:14:18
05-Mar-2019 19:14:18 Stopping mysql_mysql_1 ... done
05-Mar-2019 19:14:19 Removing mysql_mysql_1 ...
05-Mar-2019 19:14:19
05-Mar-2019 19:14:19 Removing mysql_mysql_1 ... done
05-Mar-2019 19:14:19 Going to remove mysql_mysql_1
05-Mar-2019 19:14:19 Stopping kafka_kafka_1 ...
05-Mar-2019 19:14:19 Stopping kafka_zookeeper_1 ...
05-Mar-2019 19:14:22
05-Mar-2019 19:14:22 Stopping kafka_kafka_1 ... done
05-Mar-2019 19:14:29
05-Mar-2019 19:14:29 Stopping kafka_zookeeper_1 ... done
05-Mar-2019 19:14:29 Removing kafka_kafka_1 ...
05-Mar-2019 19:14:29 Removing kafka_zookeeper_1 ...
05-Mar-2019 19:14:29
05-Mar-2019 19:14:29 Removing kafka_zookeeper_1 ... done
05-Mar-2019 19:14:29
05-Mar-2019 19:14:29 Removing kafka_kafka_1 ... done
05-Mar-2019 19:14:29 Going to remove kafka_kafka_1, kafka_zookeeper_1
05-Mar-2019 19:14:30
05-Mar-2019 19:14:30 Finished task 'Execute Acceptance Tests' with result: Success
05-Mar-2019 19:14:30 Starting task 'JUnit Parser' of type 'com.atlassian.bamboo.plugins.testresultparser:task.testresultparser.junit'
05-Mar-2019 19:14:30 Parsing test results under /opt/bamboo-home/xml-data/build-dir/SCDT-LOCAL20XSKIPPER20X-KAFKA...
05-Mar-2019 19:14:30 Finished task 'JUnit Parser' with result: Success
05-Mar-2019 19:14:30 Starting task 'clean up' of type 'com.atlassian.bamboo.plugins.scripttask:task.builder.script'
05-Mar-2019 19:14:30
Beginning to execute external process for build 'Spring Cloud Data Flow Acceptance Tests - Local + SCDF-2.0.0.BS + Skipper 2.0.0.BS - Run Data Flow Acceptance Tests for Kafka #44 (SCDT-LOCAL20XSKIPPER20X-KAFKA-44)'
... running command line:
/opt/bamboo-home/temp/SCDT-LOCAL20XSKIPPER20X-KAFKA-44-ScriptBuildTask-2654037492615574242.sh
... in: /opt/bamboo-home/xml-data/build-dir/SCDT-LOCAL20XSKIPPER20X-KAFKA
... using extra environment variables:
bamboo_planRepository_1_branch=master
bamboo_********_username_password=********
bamboo_signing_store_password=********
bamboo_capability_system_builder_ant_Ant_1_9=/opt/ant-1.9
bamboo_capability_system_builder_ant_Ant_1_8=/opt/ant-1.8
bamboo_planRepository_1_branchDisplayName=master
bamboo_repository_274694331_git_username=spring-buildmaster
bamboo_capability_system_jdk_OpenJDK_7u181=/opt/openjdk-7
bamboo_repository_revision_number=4d6bba78ca2b8629684e8fda0b50bfa8dd69649c
bamboo_capability_system_builder_node_Node_js_6=/usr/bin/node
bamboo_RIAK_BIN=/usr/sbin/riak
bamboo_buildKey=SCDT-LOCAL20XSKIPPER20X-KAFKA
bamboo_repository_274694331_branch_name=master
bamboo_bintray_password=********
bamboo_sonar_token_password=********
bamboo_shortJobName=Run Data Flow Acceptance Tests for Kafka
bamboo_capability_system_builder_gradle___gradlew=./gradlew
bamboo_buildResultsUrl=https://build.spring.io/browse/SCDT-LOCAL20XSKIPPER20X-KAFKA-44
bamboo_capability_system_builder_mvn3_Maven_3_3=/opt/maven-3.3
bamboo_capability_system_builder_mvn3_Maven_3_2=/opt/maven-3.2
bamboo_capability_system_builder_mvn3_Maven_3_1=/opt/maven-3.1
bamboo_planRepository_repositoryUrl=https://github.com/spring-cloud/spring-cloud-dataflow-acceptance-tests.git
bamboo_agentId=208568328
bamboo_capability_system_builder_mvn3_Maven_3_5=/opt/maven-3.5
bamboo_capability_system_builder_mvn3_Maven_3_0=/opt/maven-3.0
bamboo_planRepository_revision=4d6bba78ca2b8629684e8fda0b50bfa8dd69649c
bamboo_planRepository_previousRevision=4d6bba78ca2b8629684e8fda0b50bfa8dd69649c
bamboo_capability_remote_build=true
bamboo_repository_branch_name=master
bamboo_sonatype_token_password=********
bamboo_repository_274694331_name=Git
bamboo_scdf_acceptance_tests_password=********
bamboo_dependenciesDisabled=false
bamboo_repository_274694331_git_branch=master
bamboo_capability_Agent=bamboo-09.af.pivotal.io
bamboo_planRepository_branch=master
bamboo_planRepository_1_type=gitv2
bamboo_planRepository_branchName=master
bamboo_sonar_password=********
bamboo_hg_cache_directory=/opt/bamboo-home/xml-data/build-dir/_hg-repositories-cache
bamboo_planRepository_1_username=spring-buildmaster
bamboo_repository_274694331_git_repositoryUrl=https://github.com/spring-cloud/spring-cloud-dataflow-acceptance-tests.git
bamboo_planRepository_type=gitv2
bamboo_ManualBuildTriggerReason_userName=sabby
bamboo_git_cache_directory=/opt/bamboo-home/xml-data/build-dir/_git-repositories-cache
bamboo_artifactory_username=buildmaster
bamboo_tmp_directory=/opt/bamboo-home/temp
bamboo_planKey=SCDT-LOCAL20XSKIPPER20X
bamboo_planRepository_username=spring-buildmaster
bamboo_JDK8_HOME=/opt/jdk-8
bamboo_repository_274694331_previous_revision_number=4d6bba78ca2b8629684e8fda0b50bfa8dd69649c
bamboo_planRepository_1_branchName=master
bamboo_sonar_version=5.6.3
bamboo_capability_system_jdk_JDK_1_11=/opt/jdk-11
bamboo_resultsUrl=https://build.spring.io/browse/SCDT-LOCAL20XSKIPPER20X-KAFKA-44
bamboo_capability_system_jdk_JDK_1_10=/opt/jdk-10
bamboo_build_working_directory=/opt/bamboo-home/xml-data/build-dir/SCDT-LOCAL20XSKIPPER20X-KAFKA
bamboo_planRepository_1_name=Git
bamboo_capability_system_os=ubuntu1604
bamboo_nexusPush_stagingProfile=buildmaster
bamboo_shortPlanName=Local + SCDF-2.0.0.BS + Skipper 2.0.0.BS
bamboo_planRepository_name=Git
bamboo_buildNumber=44
bamboo_planName=Spring Cloud Data Flow Acceptance Tests - Local + SCDF-2.0.0.BS + Skipper 2.0.0.BS
bamboo_JDK7_HOME=/opt/jdk-7
bamboo_build_commandline_com_atlassian_bamboo_plugins_scripttask_task_builder_script_7=/opt/bamboo-home/temp/SCDT-LOCAL20XSKIPPER20X-KAFKA-44-ScriptBuildTask-3441985501033280333.sh
bamboo_shortPlanKey=LOCAL20XSKIPPER20X
bamboo_shortJobKey=KAFKA
bamboo_artifactory_password=********
bamboo_buildTimeStamp=2019-03-05T18:59:11.515Z
bamboo_repository_previous_revision_number=4d6bba78ca2b8629684e8fda0b50bfa8dd69649c
bamboo_sonar_username=buildmaster
bamboo_********_password=********
bamboo_repository_git_branch=master
bamboo_buildResultKey=SCDT-LOCAL20XSKIPPER20X-KAFKA-44
bamboo_nexusPush_close=true
bamboo_buildPlanName=Spring Cloud Data Flow Acceptance Tests - Local + SCDF-2.0.0.BS + Skipper 2.0.0.BS - Run Data Flow Acceptance Tests for Kafka
bamboo_repository_274694331_revision_number=4d6bba78ca2b8629684e8fda0b50bfa8dd69649c
bamboo_planRepository_1_revision=4d6bba78ca2b8629684e8fda0b50bfa8dd69649c
bamboo_repository_name=Git
bamboo_signing_key_password=********
bamboo_buildFailed=false
bamboo_capability_system_docker_executable=/usr/bin/docker
bamboo_capability_system_builder_groovy_Groovy_2_4=/opt/groovy-2.4
bamboo_capability_system_builder_command_Bash=/bin/bash
bamboo_jobFailed=false
bamboo_agentWorkingDirectory=/opt/bamboo-home/xml-data/build-dir
bamboo_capability_system_git_executable=/usr/bin/git
bamboo_repository_git_username=spring-buildmaster
bamboo_planRepository_1_previousRevision=4d6bba78ca2b8629684e8fda0b50bfa8dd69649c
bamboo_capability_os_family=unix
bamboo_planRepository_branchDisplayName=master
bamboo_capability_system_builder_maven_Artifactory_Maven_3_5=/opt/maven-3.5
bamboo_capability_system_builder_maven_Artifactory_Maven_3_3=/opt/maven-3.3
bamboo_capability_system_builder_maven_Artifactory_Maven_3_2=/opt/maven-3.2
bamboo_s3_properties=/home/bamboo/tools/s3.properties
bamboo_capability_system_builder_maven_Artifactory_Maven_3_1=/opt/maven-3.1
bamboo_capability_system_builder_maven_Artifactory_Maven_3_0=/opt/maven-3.0
bamboo_plan_storageTag=plan-274497908
bamboo_bintray_username_password=********
bamboo_repository_git_repositoryUrl=https://github.com/spring-cloud/spring-cloud-dataflow-acceptance-tests.git
bamboo_working_directory=/opt/bamboo-home/xml-data/build-dir/SCDT-LOCAL20XSKIPPER20X-KAFKA
bamboo_planRepository_1_repositoryUrl=https://github.com/spring-cloud/spring-cloud-dataflow-acceptance-tests.git
bamboo_capability_system_jdk_JDK_1_8=/opt/jdk-8
bamboo_capability_system_jdk_JDK_1_9=/opt/jdk-9
bamboo_capability_system_jdk_JDK_1_6=/opt/jdk-6
bamboo_sonatype_password=********
bamboo_capability_system_jdk_JDK_1_7=/opt/jdk-7
bamboo_sonar_ip=10.194.6.9
05-Mar-2019 19:14:30 CLEANING UP RESOURCES AFTER RUNNING TESTS
05-Mar-2019 19:14:30 Environment variable JAVA_HOME must be set
05-Mar-2019 19:14:30 FINISHED CLEANING UP RESOURCES
05-Mar-2019 19:14:30 Finished task 'clean up' with result: Success
05-Mar-2019 19:14:30 Running post build plugin 'Docker Container Cleanup'
05-Mar-2019 19:14:30 Running post build plugin 'NCover Results Collector'
05-Mar-2019 19:14:30 Running post build plugin 'Artifactory Release Management Staging'
05-Mar-2019 19:14:30 Running post build plugin 'Artifactory Build Info Copier'
05-Mar-2019 19:14:30 Running post build plugin 'Artifactory Gradle Properties Info Copier'
05-Mar-2019 19:14:30 Running post build plugin 'Clover Results Collector'
05-Mar-2019 19:14:30 Running post build plugin 'npm Cache Cleanup'
05-Mar-2019 19:14:30 Running post build plugin 'Artifact Copier'
05-Mar-2019 19:14:30 Publishing an artifact: Test Results
05-Mar-2019 19:14:30 Finished publishing of artifact Job artifact: [Test Results], pattern: [**/target/surefire-reports/**/*.*] in 45.53 ms
05-Mar-2019 19:14:30 Publishing an artifact: App and Server Logs
05-Mar-2019 19:14:30 Finished publishing of artifact Job artifact: [App and Server Logs], pattern: [**/*.log] anchored at: [local] in 43.51 ms
05-Mar-2019 19:14:30 Successfully removed working directory at '/opt/bamboo-home/xml-data/build-dir/SCDT-LOCAL20XSKIPPER20X-KAFKA'
05-Mar-2019 19:14:30 Finalising the build...
05-Mar-2019 19:14:30 Stopping timer.
05-Mar-2019 19:14:30 Build SCDT-LOCAL20XSKIPPER20X-KAFKA-44 completed.
05-Mar-2019 19:14:30 Running on server: post build plugin 'NCover Results Collector'
05-Mar-2019 19:14:30 Running on server: post build plugin 'Build Hanging Detection Configuration'
05-Mar-2019 19:14:30 Running on server: post build plugin 'Clover Delta Calculator'
05-Mar-2019 19:14:30 Running on server: post build plugin 'Maven Dependencies Postprocessor'
05-Mar-2019 19:14:30 All post build plugins have finished
05-Mar-2019 19:14:30 Generating build results summary...
05-Mar-2019 19:14:30 Saving build results to disk...
05-Mar-2019 19:14:30 Logging substituted variables...
05-Mar-2019 19:14:30 Indexing build results...
05-Mar-2019 19:14:30 Finished building SCDT-LOCAL20XSKIPPER20X-KAFKA-44.