Build: #51 failed

Job: Run Data Flow Acceptance Tests for Kafka failed

Stages & jobs

  1. Test Stage - Kafka

  2. Test Stage - Rabbit

Build log

The build generated 1,233 lines of output.The output is too long and has been truncated to the last 1,000 lines. Download or view full build log

19-Jun-2019 05:41:39 [INFO] Downloaded: https://repo.spring.io/release/org/springframework/boot/spring-boot-starter-security/1.4.1.RELEASE/spring-boot-starter-security-1.4.1.RELEASE.pom (2 KB at 9.6 KB/sec)
19-Jun-2019 05:41:39 [INFO] Downloading: https://repo.spring.io/libs-snapshot-local/org/springframework/boot/spring-boot-dependencies/1.5.2.RELEASE/spring-boot-dependencies-1.5.2.RELEASE.pom
19-Jun-2019 05:41:39 [INFO] Downloading: https://repo.spring.io/libs-milestone-local/org/springframework/boot/spring-boot-dependencies/1.5.2.RELEASE/spring-boot-dependencies-1.5.2.RELEASE.pom
19-Jun-2019 05:41:39 [INFO] Downloading: https://repo.spring.io/release/org/springframework/boot/spring-boot-dependencies/1.5.2.RELEASE/spring-boot-dependencies-1.5.2.RELEASE.pom
19-Jun-2019 05:41:40 [INFO] Downloaded: https://repo.spring.io/release/org/springframework/boot/spring-boot-dependencies/1.5.2.RELEASE/spring-boot-dependencies-1.5.2.RELEASE.pom (88 KB at 348.7 KB/sec)
19-Jun-2019 05:41:40 [INFO] Downloading: https://repo.spring.io/libs-snapshot-local/org/springframework/boot/spring-boot-dependencies/1.5.3.RELEASE/spring-boot-dependencies-1.5.3.RELEASE.pom
19-Jun-2019 05:41:40 [INFO] Downloading: https://repo.spring.io/libs-milestone-local/org/springframework/boot/spring-boot-dependencies/1.5.3.RELEASE/spring-boot-dependencies-1.5.3.RELEASE.pom
19-Jun-2019 05:41:40 [INFO] Downloading: https://repo.spring.io/release/org/springframework/boot/spring-boot-dependencies/1.5.3.RELEASE/spring-boot-dependencies-1.5.3.RELEASE.pom
19-Jun-2019 05:41:40 [INFO] Downloaded: https://repo.spring.io/release/org/springframework/boot/spring-boot-dependencies/1.5.3.RELEASE/spring-boot-dependencies-1.5.3.RELEASE.pom (88 KB at 306.9 KB/sec)
19-Jun-2019 05:41:40 [INFO] Downloading: https://repo.spring.io/libs-snapshot-local/org/springframework/boot/spring-boot-starter-parent/1.2.4.RELEASE/spring-boot-starter-parent-1.2.4.RELEASE.pom
19-Jun-2019 05:41:40 [INFO] Downloading: https://repo.spring.io/libs-milestone-local/org/springframework/boot/spring-boot-starter-parent/1.2.4.RELEASE/spring-boot-starter-parent-1.2.4.RELEASE.pom
19-Jun-2019 05:41:40 [INFO] Downloading: https://repo.spring.io/release/org/springframework/boot/spring-boot-starter-parent/1.2.4.RELEASE/spring-boot-starter-parent-1.2.4.RELEASE.pom
19-Jun-2019 05:41:41 [INFO] Downloaded: https://repo.spring.io/release/org/springframework/boot/spring-boot-starter-parent/1.2.4.RELEASE/spring-boot-starter-parent-1.2.4.RELEASE.pom (7 KB at 39.4 KB/sec)
19-Jun-2019 05:41:41 [INFO] Downloading: https://repo.spring.io/libs-snapshot-local/org/springframework/boot/spring-boot-dependencies/1.2.4.RELEASE/spring-boot-dependencies-1.2.4.RELEASE.pom
19-Jun-2019 05:41:41 [INFO] Downloading: https://repo.spring.io/libs-milestone-local/org/springframework/boot/spring-boot-dependencies/1.2.4.RELEASE/spring-boot-dependencies-1.2.4.RELEASE.pom
19-Jun-2019 05:41:41 [INFO] Downloading: https://repo.spring.io/release/org/springframework/boot/spring-boot-dependencies/1.2.4.RELEASE/spring-boot-dependencies-1.2.4.RELEASE.pom
19-Jun-2019 05:41:41 [INFO] Downloaded: https://repo.spring.io/release/org/springframework/boot/spring-boot-dependencies/1.2.4.RELEASE/spring-boot-dependencies-1.2.4.RELEASE.pom (55 KB at 301.8 KB/sec)
19-Jun-2019 05:41:41 [INFO] Downloading: https://repo.spring.io/libs-snapshot-local/org/springframework/boot/spring-boot-dependencies/1.5.10.RELEASE/spring-boot-dependencies-1.5.10.RELEASE.pom
19-Jun-2019 05:41:41 [INFO] Downloading: https://repo.spring.io/libs-milestone-local/org/springframework/boot/spring-boot-dependencies/1.5.10.RELEASE/spring-boot-dependencies-1.5.10.RELEASE.pom
19-Jun-2019 05:41:41 [INFO] Downloading: https://repo.spring.io/release/org/springframework/boot/spring-boot-dependencies/1.5.10.RELEASE/spring-boot-dependencies-1.5.10.RELEASE.pom
19-Jun-2019 05:41:42 [INFO] Downloaded: https://repo.spring.io/release/org/springframework/boot/spring-boot-dependencies/1.5.10.RELEASE/spring-boot-dependencies-1.5.10.RELEASE.pom (101 KB at 218.9 KB/sec)
19-Jun-2019 05:41:42 [INFO] Downloading: https://repo.spring.io/libs-snapshot-local/org/springframework/boot/spring-boot-starter-data-redis/1.4.1.RELEASE/spring-boot-starter-data-redis-1.4.1.RELEASE.pom
19-Jun-2019 05:41:42 [INFO] Downloading: https://repo.spring.io/libs-milestone-local/org/springframework/boot/spring-boot-starter-data-redis/1.4.1.RELEASE/spring-boot-starter-data-redis-1.4.1.RELEASE.pom
19-Jun-2019 05:41:42 [INFO] Downloading: https://repo.spring.io/release/org/springframework/boot/spring-boot-starter-data-redis/1.4.1.RELEASE/spring-boot-starter-data-redis-1.4.1.RELEASE.pom
19-Jun-2019 05:41:43 [INFO] Downloaded: https://repo.spring.io/release/org/springframework/boot/spring-boot-starter-data-redis/1.4.1.RELEASE/spring-boot-starter-data-redis-1.4.1.RELEASE.pom (2 KB at 2.9 KB/sec)
19-Jun-2019 05:41:43 [INFO] Downloading: https://repo.spring.io/libs-snapshot-local/org/springframework/cloud/spring-cloud-dataflow-rest-client/1.7.0.BUILD-SNAPSHOT/maven-metadata.xml
19-Jun-2019 05:41:43 [INFO] Downloaded: https://repo.spring.io/libs-snapshot-local/org/springframework/cloud/spring-cloud-dataflow-rest-client/1.7.0.BUILD-SNAPSHOT/maven-metadata.xml (2 KB at 7.9 KB/sec)
19-Jun-2019 05:41:43 [INFO] Downloading: https://repo.spring.io/libs-snapshot-local/org/springframework/cloud/spring-cloud-dataflow-rest-client/1.7.0.BUILD-SNAPSHOT/spring-cloud-dataflow-rest-client-1.7.0.BUILD-20181023.141453-130.pom
19-Jun-2019 05:41:43 [INFO] Downloaded: https://repo.spring.io/libs-snapshot-local/org/springframework/cloud/spring-cloud-dataflow-rest-client/1.7.0.BUILD-SNAPSHOT/spring-cloud-dataflow-rest-client-1.7.0.BUILD-20181023.141453-130.pom (2 KB at 2.9 KB/sec)
19-Jun-2019 05:41:43 [INFO] Downloading: https://repo.spring.io/libs-snapshot-local/org/springframework/cloud/spring-cloud-dataflow-parent/1.7.0.BUILD-SNAPSHOT/maven-metadata.xml
19-Jun-2019 05:41:44 [INFO] Downloaded: https://repo.spring.io/libs-snapshot-local/org/springframework/cloud/spring-cloud-dataflow-parent/1.7.0.BUILD-SNAPSHOT/maven-metadata.xml (646 B at 4.1 KB/sec)
19-Jun-2019 05:41:44 [INFO] Downloading: https://repo.spring.io/libs-snapshot-local/org/springframework/cloud/spring-cloud-dataflow-parent/1.7.0.BUILD-SNAPSHOT/spring-cloud-dataflow-parent-1.7.0.BUILD-20181023.141453-130.pom
19-Jun-2019 05:41:44 [INFO] Downloaded: https://repo.spring.io/libs-snapshot-local/org/springframework/cloud/spring-cloud-dataflow-parent/1.7.0.BUILD-SNAPSHOT/spring-cloud-dataflow-parent-1.7.0.BUILD-20181023.141453-130.pom (13 KB at 51.4 KB/sec)
19-Jun-2019 05:41:44 [INFO] Downloading: https://repo.spring.io/libs-snapshot-local/org/springframework/cloud/spring-cloud-task-dependencies/1.3.0.RELEASE/spring-cloud-task-dependencies-1.3.0.RELEASE.pom
19-Jun-2019 05:41:44 [INFO] Downloading: https://repo.spring.io/libs-milestone-local/org/springframework/cloud/spring-cloud-task-dependencies/1.3.0.RELEASE/spring-cloud-task-dependencies-1.3.0.RELEASE.pom
19-Jun-2019 05:41:44 [INFO] Downloading: https://repo.spring.io/release/org/springframework/cloud/spring-cloud-task-dependencies/1.3.0.RELEASE/spring-cloud-task-dependencies-1.3.0.RELEASE.pom
19-Jun-2019 05:41:44 [INFO] Downloaded: https://repo.spring.io/release/org/springframework/cloud/spring-cloud-task-dependencies/1.3.0.RELEASE/spring-cloud-task-dependencies-1.3.0.RELEASE.pom (2 KB at 4.8 KB/sec)
19-Jun-2019 05:41:44 [INFO] Downloading: https://repo.spring.io/libs-snapshot-local/org/springframework/cloud/spring-cloud-dependencies/Edgware.SR5/spring-cloud-dependencies-Edgware.SR5.pom
19-Jun-2019 05:41:44 [INFO] Downloading: https://repo.spring.io/libs-milestone-local/org/springframework/cloud/spring-cloud-dependencies/Edgware.SR5/spring-cloud-dependencies-Edgware.SR5.pom
19-Jun-2019 05:41:45 [INFO] Downloading: https://repo.spring.io/release/org/springframework/cloud/spring-cloud-dependencies/Edgware.SR5/spring-cloud-dependencies-Edgware.SR5.pom
19-Jun-2019 05:41:45 [INFO] Downloaded: https://repo.spring.io/release/org/springframework/cloud/spring-cloud-dependencies/Edgware.SR5/spring-cloud-dependencies-Edgware.SR5.pom (8 KB at 41.5 KB/sec)
19-Jun-2019 05:41:45 [INFO] Downloading: https://repo.spring.io/libs-snapshot-local/org/springframework/cloud/spring-cloud-dependencies-parent/1.3.11.RELEASE/spring-cloud-dependencies-parent-1.3.11.RELEASE.pom
19-Jun-2019 05:41:45 [INFO] Downloading: https://repo.spring.io/libs-milestone-local/org/springframework/cloud/spring-cloud-dependencies-parent/1.3.11.RELEASE/spring-cloud-dependencies-parent-1.3.11.RELEASE.pom
19-Jun-2019 05:41:45 [INFO] Downloading: https://repo.spring.io/release/org/springframework/cloud/spring-cloud-dependencies-parent/1.3.11.RELEASE/spring-cloud-dependencies-parent-1.3.11.RELEASE.pom
19-Jun-2019 05:41:45 [INFO] Downloaded: https://repo.spring.io/release/org/springframework/cloud/spring-cloud-dependencies-parent/1.3.11.RELEASE/spring-cloud-dependencies-parent-1.3.11.RELEASE.pom (7 KB at 37.3 KB/sec)
19-Jun-2019 05:41:45 [INFO] Downloading: https://repo.spring.io/libs-snapshot-local/org/springframework/cloud/spring-cloud-commons-dependencies/1.3.5.RELEASE/spring-cloud-commons-dependencies-1.3.5.RELEASE.pom
19-Jun-2019 05:41:45 [INFO] Downloading: https://repo.spring.io/libs-milestone-local/org/springframework/cloud/spring-cloud-commons-dependencies/1.3.5.RELEASE/spring-cloud-commons-dependencies-1.3.5.RELEASE.pom
19-Jun-2019 05:41:45 [INFO] Downloading: https://repo.spring.io/release/org/springframework/cloud/spring-cloud-commons-dependencies/1.3.5.RELEASE/spring-cloud-commons-dependencies-1.3.5.RELEASE.pom
19-Jun-2019 05:41:45 [INFO] Downloaded: https://repo.spring.io/release/org/springframework/cloud/spring-cloud-commons-dependencies/1.3.5.RELEASE/spring-cloud-commons-dependencies-1.3.5.RELEASE.pom (4 KB at 18.6 KB/sec)
19-Jun-2019 05:41:45 [INFO] Downloading: https://repo.spring.io/libs-snapshot-local/org/springframework/cloud/spring-cloud-netflix-dependencies/1.4.6.RELEASE/spring-cloud-netflix-dependencies-1.4.6.RELEASE.pom
19-Jun-2019 05:41:45 [INFO] Downloading: https://repo.spring.io/libs-milestone-local/org/springframework/cloud/spring-cloud-netflix-dependencies/1.4.6.RELEASE/spring-cloud-netflix-dependencies-1.4.6.RELEASE.pom
19-Jun-2019 05:41:46 [INFO] Downloading: https://repo.spring.io/release/org/springframework/cloud/spring-cloud-netflix-dependencies/1.4.6.RELEASE/spring-cloud-netflix-dependencies-1.4.6.RELEASE.pom
19-Jun-2019 05:41:46 [INFO] Downloaded: https://repo.spring.io/release/org/springframework/cloud/spring-cloud-netflix-dependencies/1.4.6.RELEASE/spring-cloud-netflix-dependencies-1.4.6.RELEASE.pom (20 KB at 110.9 KB/sec)
19-Jun-2019 05:41:46 [INFO] Downloading: https://repo.spring.io/libs-snapshot-local/org/springframework/cloud/spring-cloud-stream-dependencies/Ditmars.SR4/spring-cloud-stream-dependencies-Ditmars.SR4.pom
19-Jun-2019 05:41:46 [INFO] Downloading: https://repo.spring.io/libs-milestone-local/org/springframework/cloud/spring-cloud-stream-dependencies/Ditmars.SR4/spring-cloud-stream-dependencies-Ditmars.SR4.pom
19-Jun-2019 05:41:46 [INFO] Downloading: https://repo.spring.io/release/org/springframework/cloud/spring-cloud-stream-dependencies/Ditmars.SR4/spring-cloud-stream-dependencies-Ditmars.SR4.pom
19-Jun-2019 05:41:46 [INFO] Downloaded: https://repo.spring.io/release/org/springframework/cloud/spring-cloud-stream-dependencies/Ditmars.SR4/spring-cloud-stream-dependencies-Ditmars.SR4.pom (8 KB at 44.9 KB/sec)
19-Jun-2019 05:41:46 [INFO] Downloading: https://repo.spring.io/libs-snapshot-local/org/springframework/cloud/spring-cloud-dependencies-parent/1.3.9.RELEASE/spring-cloud-dependencies-parent-1.3.9.RELEASE.pom
19-Jun-2019 05:41:46 [INFO] Downloading: https://repo.spring.io/libs-milestone-local/org/springframework/cloud/spring-cloud-dependencies-parent/1.3.9.RELEASE/spring-cloud-dependencies-parent-1.3.9.RELEASE.pom
19-Jun-2019 05:41:46 [INFO] Downloading: https://repo.spring.io/release/org/springframework/cloud/spring-cloud-dependencies-parent/1.3.9.RELEASE/spring-cloud-dependencies-parent-1.3.9.RELEASE.pom
19-Jun-2019 05:41:46 [INFO] Downloaded: https://repo.spring.io/release/org/springframework/cloud/spring-cloud-dependencies-parent/1.3.9.RELEASE/spring-cloud-dependencies-parent-1.3.9.RELEASE.pom (7 KB at 35.4 KB/sec)
19-Jun-2019 05:41:46 [INFO] Downloading: https://repo.spring.io/libs-snapshot-local/org/springframework/cloud/spring-cloud-task-dependencies/1.2.3.RELEASE/spring-cloud-task-dependencies-1.2.3.RELEASE.pom
19-Jun-2019 05:41:47 [INFO] Downloading: https://repo.spring.io/libs-milestone-local/org/springframework/cloud/spring-cloud-task-dependencies/1.2.3.RELEASE/spring-cloud-task-dependencies-1.2.3.RELEASE.pom
19-Jun-2019 05:41:47 [INFO] Downloading: https://repo.spring.io/release/org/springframework/cloud/spring-cloud-task-dependencies/1.2.3.RELEASE/spring-cloud-task-dependencies-1.2.3.RELEASE.pom
19-Jun-2019 05:41:47 [INFO] Downloaded: https://repo.spring.io/release/org/springframework/cloud/spring-cloud-task-dependencies/1.2.3.RELEASE/spring-cloud-task-dependencies-1.2.3.RELEASE.pom (3 KB at 15.7 KB/sec)
19-Jun-2019 05:41:47 [INFO] Downloading: https://repo.spring.io/libs-snapshot-local/org/springframework/cloud/spring-cloud-config-dependencies/1.4.5.RELEASE/spring-cloud-config-dependencies-1.4.5.RELEASE.pom
19-Jun-2019 05:41:47 [INFO] Downloading: https://repo.spring.io/libs-milestone-local/org/springframework/cloud/spring-cloud-config-dependencies/1.4.5.RELEASE/spring-cloud-config-dependencies-1.4.5.RELEASE.pom
19-Jun-2019 05:41:47 [INFO] Downloading: https://repo.spring.io/release/org/springframework/cloud/spring-cloud-config-dependencies/1.4.5.RELEASE/spring-cloud-config-dependencies-1.4.5.RELEASE.pom
19-Jun-2019 05:41:47 [INFO] Downloaded: https://repo.spring.io/release/org/springframework/cloud/spring-cloud-config-dependencies/1.4.5.RELEASE/spring-cloud-config-dependencies-1.4.5.RELEASE.pom (4 KB at 18.3 KB/sec)
19-Jun-2019 05:41:47 [INFO] Downloading: https://repo.spring.io/libs-snapshot-local/org/springframework/cloud/spring-cloud-consul-dependencies/1.3.5.RELEASE/spring-cloud-consul-dependencies-1.3.5.RELEASE.pom
19-Jun-2019 05:41:47 [INFO] Downloading: https://repo.spring.io/libs-milestone-local/org/springframework/cloud/spring-cloud-consul-dependencies/1.3.5.RELEASE/spring-cloud-consul-dependencies-1.3.5.RELEASE.pom
19-Jun-2019 05:41:47 [INFO] Downloading: https://repo.spring.io/release/org/springframework/cloud/spring-cloud-consul-dependencies/1.3.5.RELEASE/spring-cloud-consul-dependencies-1.3.5.RELEASE.pom
19-Jun-2019 05:41:48 [INFO] Downloaded: https://repo.spring.io/release/org/springframework/cloud/spring-cloud-consul-dependencies/1.3.5.RELEASE/spring-cloud-consul-dependencies-1.3.5.RELEASE.pom (5 KB at 19.7 KB/sec)
19-Jun-2019 05:41:48 [INFO] Downloading: https://repo.spring.io/libs-snapshot-local/org/springframework/cloud/spring-cloud-sleuth-dependencies/1.3.5.RELEASE/spring-cloud-sleuth-dependencies-1.3.5.RELEASE.pom
19-Jun-2019 05:41:48 [INFO] Downloading: https://repo.spring.io/libs-milestone-local/org/springframework/cloud/spring-cloud-sleuth-dependencies/1.3.5.RELEASE/spring-cloud-sleuth-dependencies-1.3.5.RELEASE.pom
19-Jun-2019 05:41:48 [INFO] Downloading: https://repo.spring.io/release/org/springframework/cloud/spring-cloud-sleuth-dependencies/1.3.5.RELEASE/spring-cloud-sleuth-dependencies-1.3.5.RELEASE.pom
19-Jun-2019 05:41:48 [INFO] Downloaded: https://repo.spring.io/release/org/springframework/cloud/spring-cloud-sleuth-dependencies/1.3.5.RELEASE/spring-cloud-sleuth-dependencies-1.3.5.RELEASE.pom (7 KB at 35.7 KB/sec)
19-Jun-2019 05:41:48 [INFO] Downloading: https://repo.spring.io/libs-snapshot-local/org/springframework/cloud/spring-cloud-vault-dependencies/1.1.2.RELEASE/spring-cloud-vault-dependencies-1.1.2.RELEASE.pom
19-Jun-2019 05:41:48 [INFO] Downloading: https://repo.spring.io/libs-milestone-local/org/springframework/cloud/spring-cloud-vault-dependencies/1.1.2.RELEASE/spring-cloud-vault-dependencies-1.1.2.RELEASE.pom
19-Jun-2019 05:41:48 [INFO] Downloading: https://repo.spring.io/release/org/springframework/cloud/spring-cloud-vault-dependencies/1.1.2.RELEASE/spring-cloud-vault-dependencies-1.1.2.RELEASE.pom
19-Jun-2019 05:41:48 [INFO] Downloaded: https://repo.spring.io/release/org/springframework/cloud/spring-cloud-vault-dependencies/1.1.2.RELEASE/spring-cloud-vault-dependencies-1.1.2.RELEASE.pom (4 KB at 20.0 KB/sec)
19-Jun-2019 05:41:48 [INFO] Downloading: https://repo.spring.io/libs-snapshot-local/org/springframework/cloud/spring-cloud-zookeeper-dependencies/1.2.2.RELEASE/spring-cloud-zookeeper-dependencies-1.2.2.RELEASE.pom
19-Jun-2019 05:41:48 [INFO] Downloading: https://repo.spring.io/libs-milestone-local/org/springframework/cloud/spring-cloud-zookeeper-dependencies/1.2.2.RELEASE/spring-cloud-zookeeper-dependencies-1.2.2.RELEASE.pom
19-Jun-2019 05:41:48 [INFO] Downloading: https://repo.spring.io/release/org/springframework/cloud/spring-cloud-zookeeper-dependencies/1.2.2.RELEASE/spring-cloud-zookeeper-dependencies-1.2.2.RELEASE.pom
19-Jun-2019 05:41:49 [INFO] Downloaded: https://repo.spring.io/release/org/springframework/cloud/spring-cloud-zookeeper-dependencies/1.2.2.RELEASE/spring-cloud-zookeeper-dependencies-1.2.2.RELEASE.pom (6 KB at 29.2 KB/sec)
19-Jun-2019 05:41:49 [INFO] Downloading: https://repo.spring.io/libs-snapshot-local/org/springframework/cloud/spring-cloud-security-dependencies/1.2.3.RELEASE/spring-cloud-security-dependencies-1.2.3.RELEASE.pom
19-Jun-2019 05:41:49 [INFO] Downloading: https://repo.spring.io/libs-milestone-local/org/springframework/cloud/spring-cloud-security-dependencies/1.2.3.RELEASE/spring-cloud-security-dependencies-1.2.3.RELEASE.pom
19-Jun-2019 05:41:49 [INFO] Downloading: https://repo.spring.io/release/org/springframework/cloud/spring-cloud-security-dependencies/1.2.3.RELEASE/spring-cloud-security-dependencies-1.2.3.RELEASE.pom
19-Jun-2019 05:41:49 [INFO] Downloaded: https://repo.spring.io/release/org/springframework/cloud/spring-cloud-security-dependencies/1.2.3.RELEASE/spring-cloud-security-dependencies-1.2.3.RELEASE.pom (2 KB at 7.0 KB/sec)
19-Jun-2019 05:41:49 [INFO] Downloading: https://repo.spring.io/libs-snapshot-local/org/springframework/cloud/spring-cloud-cloudfoundry-dependencies/1.1.2.RELEASE/spring-cloud-cloudfoundry-dependencies-1.1.2.RELEASE.pom
19-Jun-2019 05:41:49 [INFO] Downloading: https://repo.spring.io/libs-milestone-local/org/springframework/cloud/spring-cloud-cloudfoundry-dependencies/1.1.2.RELEASE/spring-cloud-cloudfoundry-dependencies-1.1.2.RELEASE.pom
19-Jun-2019 05:41:49 [INFO] Downloading: https://repo.spring.io/release/org/springframework/cloud/spring-cloud-cloudfoundry-dependencies/1.1.2.RELEASE/spring-cloud-cloudfoundry-dependencies-1.1.2.RELEASE.pom
19-Jun-2019 05:41:49 [INFO] Downloaded: https://repo.spring.io/release/org/springframework/cloud/spring-cloud-cloudfoundry-dependencies/1.1.2.RELEASE/spring-cloud-cloudfoundry-dependencies-1.1.2.RELEASE.pom (2 KB at 8.0 KB/sec)
19-Jun-2019 05:41:49 [INFO] Downloading: https://repo.spring.io/libs-snapshot-local/org/springframework/cloud/spring-cloud-bus-dependencies/1.3.4.RELEASE/spring-cloud-bus-dependencies-1.3.4.RELEASE.pom
19-Jun-2019 05:41:49 [INFO] Downloading: https://repo.spring.io/libs-milestone-local/org/springframework/cloud/spring-cloud-bus-dependencies/1.3.4.RELEASE/spring-cloud-bus-dependencies-1.3.4.RELEASE.pom
19-Jun-2019 05:41:49 [INFO] Downloading: https://repo.spring.io/release/org/springframework/cloud/spring-cloud-bus-dependencies/1.3.4.RELEASE/spring-cloud-bus-dependencies-1.3.4.RELEASE.pom
19-Jun-2019 05:41:50 [INFO] Downloaded: https://repo.spring.io/release/org/springframework/cloud/spring-cloud-bus-dependencies/1.3.4.RELEASE/spring-cloud-bus-dependencies-1.3.4.RELEASE.pom (3 KB at 15.2 KB/sec)
19-Jun-2019 05:41:50 [INFO] Downloading: https://repo.spring.io/libs-snapshot-local/org/springframework/cloud/spring-cloud-contract-dependencies/1.2.6.RELEASE/spring-cloud-contract-dependencies-1.2.6.RELEASE.pom
19-Jun-2019 05:41:50 [INFO] Downloading: https://repo.spring.io/libs-milestone-local/org/springframework/cloud/spring-cloud-contract-dependencies/1.2.6.RELEASE/spring-cloud-contract-dependencies-1.2.6.RELEASE.pom
19-Jun-2019 05:41:50 [INFO] Downloading: https://repo.spring.io/release/org/springframework/cloud/spring-cloud-contract-dependencies/1.2.6.RELEASE/spring-cloud-contract-dependencies-1.2.6.RELEASE.pom
19-Jun-2019 05:41:50 [INFO] Downloaded: https://repo.spring.io/release/org/springframework/cloud/spring-cloud-contract-dependencies/1.2.6.RELEASE/spring-cloud-contract-dependencies-1.2.6.RELEASE.pom (7 KB at 38.2 KB/sec)
19-Jun-2019 05:41:50 [INFO] Downloading: https://repo.spring.io/libs-snapshot-local/org/springframework/cloud/spring-cloud-aws-dependencies/1.2.3.RELEASE/spring-cloud-aws-dependencies-1.2.3.RELEASE.pom
19-Jun-2019 05:41:50 [INFO] Downloading: https://repo.spring.io/libs-milestone-local/org/springframework/cloud/spring-cloud-aws-dependencies/1.2.3.RELEASE/spring-cloud-aws-dependencies-1.2.3.RELEASE.pom
19-Jun-2019 05:41:50 [INFO] Downloading: https://repo.spring.io/release/org/springframework/cloud/spring-cloud-aws-dependencies/1.2.3.RELEASE/spring-cloud-aws-dependencies-1.2.3.RELEASE.pom
19-Jun-2019 05:41:50 [INFO] Downloaded: https://repo.spring.io/release/org/springframework/cloud/spring-cloud-aws-dependencies/1.2.3.RELEASE/spring-cloud-aws-dependencies-1.2.3.RELEASE.pom (6 KB at 32.1 KB/sec)
19-Jun-2019 05:41:50 [INFO] Downloading: https://repo.spring.io/libs-snapshot-local/org/springframework/cloud/spring-cloud-gateway-dependencies/1.0.2.RELEASE/spring-cloud-gateway-dependencies-1.0.2.RELEASE.pom
19-Jun-2019 05:41:50 [INFO] Downloading: https://repo.spring.io/libs-milestone-local/org/springframework/cloud/spring-cloud-gateway-dependencies/1.0.2.RELEASE/spring-cloud-gateway-dependencies-1.0.2.RELEASE.pom
19-Jun-2019 05:41:51 [INFO] Downloading: https://repo.spring.io/release/org/springframework/cloud/spring-cloud-gateway-dependencies/1.0.2.RELEASE/spring-cloud-gateway-dependencies-1.0.2.RELEASE.pom
19-Jun-2019 05:41:51 [INFO] Downloaded: https://repo.spring.io/release/org/springframework/cloud/spring-cloud-gateway-dependencies/1.0.2.RELEASE/spring-cloud-gateway-dependencies-1.0.2.RELEASE.pom (2 KB at 5.3 KB/sec)
19-Jun-2019 05:41:51 [INFO] Downloading: https://repo.spring.io/libs-snapshot-local/org/springframework/cloud/spring-cloud-function-dependencies/1.0.1.RELEASE/spring-cloud-function-dependencies-1.0.1.RELEASE.pom
19-Jun-2019 05:41:51 [INFO] Downloading: https://repo.spring.io/libs-milestone-local/org/springframework/cloud/spring-cloud-function-dependencies/1.0.1.RELEASE/spring-cloud-function-dependencies-1.0.1.RELEASE.pom
19-Jun-2019 05:41:51 [INFO] Downloading: https://repo.spring.io/release/org/springframework/cloud/spring-cloud-function-dependencies/1.0.1.RELEASE/spring-cloud-function-dependencies-1.0.1.RELEASE.pom
19-Jun-2019 05:41:51 [INFO] Downloaded: https://repo.spring.io/release/org/springframework/cloud/spring-cloud-function-dependencies/1.0.1.RELEASE/spring-cloud-function-dependencies-1.0.1.RELEASE.pom (4 KB at 17.0 KB/sec)
19-Jun-2019 05:41:51 [INFO] Downloading: https://repo.spring.io/libs-snapshot-local/org/springframework/cloud/spring-cloud-dataflow-dependencies/1.7.0.BUILD-SNAPSHOT/maven-metadata.xml
19-Jun-2019 05:41:51 [INFO] Downloaded: https://repo.spring.io/libs-snapshot-local/org/springframework/cloud/spring-cloud-dataflow-dependencies/1.7.0.BUILD-SNAPSHOT/maven-metadata.xml (652 B at 4.0 KB/sec)
19-Jun-2019 05:41:51 [INFO] Downloading: https://repo.spring.io/libs-snapshot-local/org/springframework/cloud/spring-cloud-dataflow-dependencies/1.7.0.BUILD-SNAPSHOT/spring-cloud-dataflow-dependencies-1.7.0.BUILD-20181023.141453-130.pom
19-Jun-2019 05:41:52 [INFO] Downloaded: https://repo.spring.io/libs-snapshot-local/org/springframework/cloud/spring-cloud-dataflow-dependencies/1.7.0.BUILD-SNAPSHOT/spring-cloud-dataflow-dependencies-1.7.0.BUILD-20181023.141453-130.pom (6 KB at 21.1 KB/sec)
19-Jun-2019 05:41:52 [INFO] Downloading: https://repo.spring.io/libs-snapshot-local/org/springframework/analytics/spring-analytics/1.1.3.RELEASE/spring-analytics-1.1.3.RELEASE.pom
19-Jun-2019 05:41:52 [INFO] Downloading: https://repo.spring.io/libs-milestone-local/org/springframework/analytics/spring-analytics/1.1.3.RELEASE/spring-analytics-1.1.3.RELEASE.pom
19-Jun-2019 05:41:52 [INFO] Downloading: https://repo.spring.io/release/org/springframework/analytics/spring-analytics/1.1.3.RELEASE/spring-analytics-1.1.3.RELEASE.pom
19-Jun-2019 05:41:52 [INFO] Downloaded: https://repo.spring.io/release/org/springframework/analytics/spring-analytics/1.1.3.RELEASE/spring-analytics-1.1.3.RELEASE.pom (6 KB at 13.5 KB/sec)
19-Jun-2019 05:41:52 [INFO] Downloading: https://repo.spring.io/libs-snapshot-local/org/springframework/hateoas/spring-hateoas/0.20.0.RELEASE/spring-hateoas-0.20.0.RELEASE.pom
19-Jun-2019 05:41:52 [INFO] Downloading: https://repo.spring.io/libs-milestone-local/org/springframework/hateoas/spring-hateoas/0.20.0.RELEASE/spring-hateoas-0.20.0.RELEASE.pom
19-Jun-2019 05:41:52 [INFO] Downloading: https://repo.spring.io/release/org/springframework/hateoas/spring-hateoas/0.20.0.RELEASE/spring-hateoas-0.20.0.RELEASE.pom
19-Jun-2019 05:41:52 [INFO] Downloaded: https://repo.spring.io/release/org/springframework/hateoas/spring-hateoas/0.20.0.RELEASE/spring-hateoas-0.20.0.RELEASE.pom (0 B at 0.0 KB/sec)
19-Jun-2019 05:41:52 [INFO] Downloading: https://repo.spring.io/libs-snapshot-local/org/springframework/cloud/spring-cloud-skipper/1.1.0.RELEASE/spring-cloud-skipper-1.1.0.RELEASE.pom
19-Jun-2019 05:41:53 [INFO] Downloading: https://repo.spring.io/libs-milestone-local/org/springframework/cloud/spring-cloud-skipper/1.1.0.RELEASE/spring-cloud-skipper-1.1.0.RELEASE.pom
19-Jun-2019 05:41:53 [INFO] Downloading: https://repo.spring.io/release/org/springframework/cloud/spring-cloud-skipper/1.1.0.RELEASE/spring-cloud-skipper-1.1.0.RELEASE.pom
19-Jun-2019 05:41:53 [INFO] Downloaded: https://repo.spring.io/release/org/springframework/cloud/spring-cloud-skipper/1.1.0.RELEASE/spring-cloud-skipper-1.1.0.RELEASE.pom (3 KB at 10.5 KB/sec)
19-Jun-2019 05:41:53 [INFO] Downloading: https://repo.spring.io/libs-snapshot-local/org/springframework/cloud/spring-cloud-skipper-parent/1.1.0.RELEASE/spring-cloud-skipper-parent-1.1.0.RELEASE.pom
19-Jun-2019 05:41:53 [INFO] Downloading: https://repo.spring.io/libs-milestone-local/org/springframework/cloud/spring-cloud-skipper-parent/1.1.0.RELEASE/spring-cloud-skipper-parent-1.1.0.RELEASE.pom
19-Jun-2019 05:41:53 [INFO] Downloading: https://repo.spring.io/release/org/springframework/cloud/spring-cloud-skipper-parent/1.1.0.RELEASE/spring-cloud-skipper-parent-1.1.0.RELEASE.pom
19-Jun-2019 05:41:53 [INFO] Downloaded: https://repo.spring.io/release/org/springframework/cloud/spring-cloud-skipper-parent/1.1.0.RELEASE/spring-cloud-skipper-parent-1.1.0.RELEASE.pom (18 KB at 48.6 KB/sec)
19-Jun-2019 05:41:53 [INFO] Downloading: https://repo.spring.io/libs-snapshot-local/io/pivotal/spring/cloud/spring-cloud-services-dependencies/1.6.3.RELEASE/spring-cloud-services-dependencies-1.6.3.RELEASE.pom
19-Jun-2019 05:41:53 [INFO] Downloading: https://repo.spring.io/libs-milestone-local/io/pivotal/spring/cloud/spring-cloud-services-dependencies/1.6.3.RELEASE/spring-cloud-services-dependencies-1.6.3.RELEASE.pom
19-Jun-2019 05:41:54 [INFO] Downloading: https://repo.spring.io/release/io/pivotal/spring/cloud/spring-cloud-services-dependencies/1.6.3.RELEASE/spring-cloud-services-dependencies-1.6.3.RELEASE.pom
19-Jun-2019 05:41:54 [INFO] Downloaded: https://repo.spring.io/release/io/pivotal/spring/cloud/spring-cloud-services-dependencies/1.6.3.RELEASE/spring-cloud-services-dependencies-1.6.3.RELEASE.pom (4 KB at 12.4 KB/sec)
19-Jun-2019 05:41:54 [INFO] Downloading: https://repo.spring.io/libs-snapshot-local/com/fasterxml/jackson/dataformat/jackson-dataformat-yaml/2.8.3/jackson-dataformat-yaml-2.8.3.pom
19-Jun-2019 05:41:54 [INFO] Downloading: https://repo.spring.io/libs-milestone-local/com/fasterxml/jackson/dataformat/jackson-dataformat-yaml/2.8.3/jackson-dataformat-yaml-2.8.3.pom
19-Jun-2019 05:41:54 [INFO] Downloading: https://repo.spring.io/release/com/fasterxml/jackson/dataformat/jackson-dataformat-yaml/2.8.3/jackson-dataformat-yaml-2.8.3.pom
19-Jun-2019 05:41:54 [INFO] Downloading: https://repo.maven.apache.org/maven2/com/fasterxml/jackson/dataformat/jackson-dataformat-yaml/2.8.3/jackson-dataformat-yaml-2.8.3.pom
19-Jun-2019 05:41:54 [INFO] Downloaded: https://repo.maven.apache.org/maven2/com/fasterxml/jackson/dataformat/jackson-dataformat-yaml/2.8.3/jackson-dataformat-yaml-2.8.3.pom (7 KB at 80.2 KB/sec)
19-Jun-2019 05:41:54 [INFO] Downloading: https://repo.spring.io/libs-snapshot-local/org/zeroturnaround/zt-zip/1.11/zt-zip-1.11.pom
19-Jun-2019 05:41:54 [INFO] Downloading: https://repo.spring.io/libs-milestone-local/org/zeroturnaround/zt-zip/1.11/zt-zip-1.11.pom
19-Jun-2019 05:41:54 [INFO] Downloading: https://repo.spring.io/release/org/zeroturnaround/zt-zip/1.11/zt-zip-1.11.pom
19-Jun-2019 05:41:54 [INFO] Downloading: https://repo.maven.apache.org/maven2/org/zeroturnaround/zt-zip/1.11/zt-zip-1.11.pom
19-Jun-2019 05:41:54 [INFO] Downloaded: https://repo.maven.apache.org/maven2/org/zeroturnaround/zt-zip/1.11/zt-zip-1.11.pom (6 KB at 227.1 KB/sec)
19-Jun-2019 05:41:55 [INFO] Downloading: https://repo.spring.io/libs-snapshot-local/org/springframework/cloud/spring-cloud-dataflow-rest-resource/1.7.0.BUILD-SNAPSHOT/maven-metadata.xml
19-Jun-2019 05:41:55 [INFO] Downloaded: https://repo.spring.io/libs-snapshot-local/org/springframework/cloud/spring-cloud-dataflow-rest-resource/1.7.0.BUILD-SNAPSHOT/maven-metadata.xml (2 KB at 5.5 KB/sec)
19-Jun-2019 05:41:55 [INFO] Downloading: https://repo.spring.io/libs-snapshot-local/org/springframework/cloud/spring-cloud-dataflow-rest-resource/1.7.0.BUILD-SNAPSHOT/spring-cloud-dataflow-rest-resource-1.7.0.BUILD-20181023.141453-130.pom
19-Jun-2019 05:41:55 [INFO] Downloaded: https://repo.spring.io/libs-snapshot-local/org/springframework/cloud/spring-cloud-dataflow-rest-resource/1.7.0.BUILD-SNAPSHOT/spring-cloud-dataflow-rest-resource-1.7.0.BUILD-20181023.141453-130.pom (3 KB at 10.9 KB/sec)
19-Jun-2019 05:41:55 [INFO] Downloading: https://repo.spring.io/libs-snapshot-local/org/springframework/boot/spring-boot-configuration-metadata/1.4.1.RELEASE/spring-boot-configuration-metadata-1.4.1.RELEASE.pom
19-Jun-2019 05:41:55 [INFO] Downloading: https://repo.spring.io/libs-milestone-local/org/springframework/boot/spring-boot-configuration-metadata/1.4.1.RELEASE/spring-boot-configuration-metadata-1.4.1.RELEASE.pom
19-Jun-2019 05:41:55 [INFO] Downloading: https://repo.spring.io/release/org/springframework/boot/spring-boot-configuration-metadata/1.4.1.RELEASE/spring-boot-configuration-metadata-1.4.1.RELEASE.pom
19-Jun-2019 05:41:55 [INFO] Downloaded: https://repo.spring.io/release/org/springframework/boot/spring-boot-configuration-metadata/1.4.1.RELEASE/spring-boot-configuration-metadata-1.4.1.RELEASE.pom (2 KB at 4.5 KB/sec)
19-Jun-2019 05:41:55 [INFO] Downloading: https://repo.spring.io/libs-snapshot-local/org/springframework/cloud/spring-cloud-dataflow-core/1.7.0.BUILD-SNAPSHOT/maven-metadata.xml
19-Jun-2019 05:41:56 [INFO] Downloaded: https://repo.spring.io/libs-snapshot-local/org/springframework/cloud/spring-cloud-dataflow-core/1.7.0.BUILD-SNAPSHOT/maven-metadata.xml (2 KB at 5.9 KB/sec)
19-Jun-2019 05:41:56 [INFO] Downloading: https://repo.spring.io/libs-snapshot-local/org/springframework/cloud/spring-cloud-dataflow-core/1.7.0.BUILD-SNAPSHOT/spring-cloud-dataflow-core-1.7.0.BUILD-20181023.141453-130.pom
19-Jun-2019 05:41:56 [INFO] Downloaded: https://repo.spring.io/libs-snapshot-local/org/springframework/cloud/spring-cloud-dataflow-core/1.7.0.BUILD-SNAPSHOT/spring-cloud-dataflow-core-1.7.0.BUILD-20181023.141453-130.pom (2 KB at 4.5 KB/sec)
19-Jun-2019 05:41:56 [INFO] Downloading: https://repo.spring.io/libs-snapshot-local/org/springframework/cloud/spring-cloud-task-core/1.3.0.RELEASE/spring-cloud-task-core-1.3.0.RELEASE.pom
19-Jun-2019 05:41:56 [INFO] Downloading: https://repo.spring.io/libs-milestone-local/org/springframework/cloud/spring-cloud-task-core/1.3.0.RELEASE/spring-cloud-task-core-1.3.0.RELEASE.pom
19-Jun-2019 05:41:56 [INFO] Downloading: https://repo.spring.io/release/org/springframework/cloud/spring-cloud-task-core/1.3.0.RELEASE/spring-cloud-task-core-1.3.0.RELEASE.pom
19-Jun-2019 05:41:56 [INFO] Downloaded: https://repo.spring.io/release/org/springframework/cloud/spring-cloud-task-core/1.3.0.RELEASE/spring-cloud-task-core-1.3.0.RELEASE.pom (3 KB at 8.8 KB/sec)
19-Jun-2019 05:41:56 [INFO] Downloading: https://repo.spring.io/libs-snapshot-local/org/springframework/cloud/spring-cloud-task-parent/1.3.0.RELEASE/spring-cloud-task-parent-1.3.0.RELEASE.pom
19-Jun-2019 05:41:56 [INFO] Downloading: https://repo.spring.io/libs-milestone-local/org/springframework/cloud/spring-cloud-task-parent/1.3.0.RELEASE/spring-cloud-task-parent-1.3.0.RELEASE.pom
19-Jun-2019 05:41:57 [INFO] Downloading: https://repo.spring.io/release/org/springframework/cloud/spring-cloud-task-parent/1.3.0.RELEASE/spring-cloud-task-parent-1.3.0.RELEASE.pom
19-Jun-2019 05:41:57 [INFO] Downloaded: https://repo.spring.io/release/org/springframework/cloud/spring-cloud-task-parent/1.3.0.RELEASE/spring-cloud-task-parent-1.3.0.RELEASE.pom (9 KB at 22.5 KB/sec)
19-Jun-2019 05:41:57 [INFO] Downloading: https://repo.spring.io/libs-snapshot-local/org/springframework/cloud/spring-cloud-deployer-resource-support/1.2.1.RELEASE/spring-cloud-deployer-resource-support-1.2.1.RELEASE.pom
19-Jun-2019 05:41:57 [INFO] Downloading: https://repo.spring.io/libs-milestone-local/org/springframework/cloud/spring-cloud-deployer-resource-support/1.2.1.RELEASE/spring-cloud-deployer-resource-support-1.2.1.RELEASE.pom
19-Jun-2019 05:41:57 [INFO] Downloading: https://repo.spring.io/release/org/springframework/cloud/spring-cloud-deployer-resource-support/1.2.1.RELEASE/spring-cloud-deployer-resource-support-1.2.1.RELEASE.pom
19-Jun-2019 05:41:57 [INFO] Downloaded: https://repo.spring.io/release/org/springframework/cloud/spring-cloud-deployer-resource-support/1.2.1.RELEASE/spring-cloud-deployer-resource-support-1.2.1.RELEASE.pom (2 KB at 5.3 KB/sec)
19-Jun-2019 05:41:57 [INFO] Downloading: https://repo.spring.io/libs-snapshot-local/org/springframework/cloud/spring-cloud-deployer-parent/1.2.1.RELEASE/spring-cloud-deployer-parent-1.2.1.RELEASE.pom
19-Jun-2019 05:41:57 [INFO] Downloading: https://repo.spring.io/libs-milestone-local/org/springframework/cloud/spring-cloud-deployer-parent/1.2.1.RELEASE/spring-cloud-deployer-parent-1.2.1.RELEASE.pom
19-Jun-2019 05:41:57 [INFO] Downloading: https://repo.spring.io/release/org/springframework/cloud/spring-cloud-deployer-parent/1.2.1.RELEASE/spring-cloud-deployer-parent-1.2.1.RELEASE.pom
19-Jun-2019 05:41:58 [INFO] Downloaded: https://repo.spring.io/release/org/springframework/cloud/spring-cloud-deployer-parent/1.2.1.RELEASE/spring-cloud-deployer-parent-1.2.1.RELEASE.pom (2 KB at 3.6 KB/sec)
19-Jun-2019 05:41:58 [INFO] Downloading: https://repo.spring.io/libs-snapshot-local/com/fasterxml/jackson/datatype/jackson-datatype-jsr310/2.8.3/jackson-datatype-jsr310-2.8.3.pom
19-Jun-2019 05:41:58 [INFO] Downloading: https://repo.spring.io/libs-milestone-local/com/fasterxml/jackson/datatype/jackson-datatype-jsr310/2.8.3/jackson-datatype-jsr310-2.8.3.pom
19-Jun-2019 05:41:58 [INFO] Downloading: https://repo.spring.io/release/com/fasterxml/jackson/datatype/jackson-datatype-jsr310/2.8.3/jackson-datatype-jsr310-2.8.3.pom
19-Jun-2019 05:41:58 [INFO] Downloading: https://repo.maven.apache.org/maven2/com/fasterxml/jackson/datatype/jackson-datatype-jsr310/2.8.3/jackson-datatype-jsr310-2.8.3.pom
19-Jun-2019 05:41:58 [INFO] Downloaded: https://repo.maven.apache.org/maven2/com/fasterxml/jackson/datatype/jackson-datatype-jsr310/2.8.3/jackson-datatype-jsr310-2.8.3.pom (6 KB at 212.1 KB/sec)
19-Jun-2019 05:41:58 [INFO] Downloading: https://repo.spring.io/libs-snapshot-local/org/springframework/cloud/stream/app/app-starters-test-support/1.3.3.RELEASE/app-starters-test-support-1.3.3.RELEASE.jar
19-Jun-2019 05:41:58 [INFO] Downloading: https://repo.spring.io/libs-snapshot-local/org/springframework/cloud/spring-cloud-stream-test-support-internal/1.3.1.RELEASE/spring-cloud-stream-test-support-internal-1.3.1.RELEASE.jar
19-Jun-2019 05:41:58 [INFO] Downloading: https://repo.spring.io/libs-snapshot-local/org/springframework/cloud/spring-cloud-stream/1.3.1.RELEASE/spring-cloud-stream-1.3.1.RELEASE.jar
19-Jun-2019 05:41:58 [INFO] Downloading: https://repo.spring.io/libs-snapshot-local/org/springframework/cloud/spring-cloud-stream-metrics/1.3.1.RELEASE/spring-cloud-stream-metrics-1.3.1.RELEASE.jar
19-Jun-2019 05:41:58 [INFO] Downloading: https://repo.spring.io/libs-snapshot-local/org/springframework/integration/spring-integration-test/4.3.2.RELEASE/spring-integration-test-4.3.2.RELEASE.jar
19-Jun-2019 05:41:58 [INFO] Downloading: https://repo.spring.io/libs-snapshot-local/org/springframework/integration/spring-integration-xml/4.3.2.RELEASE/spring-integration-xml-4.3.2.RELEASE.jar
19-Jun-2019 05:41:58 [INFO] Downloading: https://repo.spring.io/libs-snapshot-local/org/springframework/spring-oxm/4.3.3.RELEASE/spring-oxm-4.3.3.RELEASE.jar
19-Jun-2019 05:41:58 [INFO] Downloading: https://repo.spring.io/libs-snapshot-local/org/springframework/ws/spring-xml/2.3.0.RELEASE/spring-xml-2.3.0.RELEASE.jar
19-Jun-2019 05:41:58 [INFO] Downloading: https://repo.spring.io/libs-snapshot-local/org/springframework/boot/spring-boot-starter-security/1.4.1.RELEASE/spring-boot-starter-security-1.4.1.RELEASE.jar
19-Jun-2019 05:41:58 [INFO] Downloading: https://repo.spring.io/libs-snapshot-local/org/springframework/security/spring-security-config/4.1.3.RELEASE/spring-security-config-4.1.3.RELEASE.jar
19-Jun-2019 05:41:59 [INFO] Downloading: https://repo.spring.io/libs-snapshot-local/org/springframework/security/spring-security-core/4.1.3.RELEASE/spring-security-core-4.1.3.RELEASE.jar
19-Jun-2019 05:41:59 [INFO] Downloading: https://repo.spring.io/libs-snapshot-local/org/springframework/security/spring-security-web/4.1.3.RELEASE/spring-security-web-4.1.3.RELEASE.jar
19-Jun-2019 05:41:59 [INFO] Downloading: https://repo.spring.io/libs-snapshot-local/io/pivotal/spring/cloud/spring-cloud-services-starter-config-client/1.5.0.RELEASE/spring-cloud-services-starter-config-client-1.5.0.RELEASE.jar
19-Jun-2019 05:41:59 [INFO] Downloading: https://repo.spring.io/libs-snapshot-local/org/springframework/cloud/spring-cloud-config-client/1.3.1.RELEASE/spring-cloud-config-client-1.3.1.RELEASE.jar
19-Jun-2019 05:41:59 [INFO] Downloading: https://repo.spring.io/libs-snapshot-local/org/springframework/cloud/spring-cloud-commons/1.2.2.RELEASE/spring-cloud-commons-1.2.2.RELEASE.jar
19-Jun-2019 05:41:59 [INFO] Downloading: https://repo.spring.io/libs-snapshot-local/org/springframework/security/spring-security-crypto/4.1.3.RELEASE/spring-security-crypto-4.1.3.RELEASE.jar
19-Jun-2019 05:41:59 [INFO] Downloading: https://repo.spring.io/libs-snapshot-local/org/springframework/cloud/spring-cloud-context/1.2.2.RELEASE/spring-cloud-context-1.2.2.RELEASE.jar
19-Jun-2019 05:41:59 [INFO] Downloading: https://repo.spring.io/libs-snapshot-local/org/springframework/security/oauth/spring-security-oauth2/2.0.11.RELEASE/spring-security-oauth2-2.0.11.RELEASE.jar
19-Jun-2019 05:41:59 [INFO] Downloading: https://repo.spring.io/libs-snapshot-local/io/pivotal/spring/cloud/spring-cloud-services-cloudfoundry-connector/1.5.0.RELEASE/spring-cloud-services-cloudfoundry-connector-1.5.0.RELEASE.jar
19-Jun-2019 05:41:59 [INFO] Downloading: https://repo.spring.io/libs-snapshot-local/io/pivotal/spring/cloud/spring-cloud-services-connector-core/1.5.0.RELEASE/spring-cloud-services-connector-core-1.5.0.RELEASE.jar
19-Jun-2019 05:41:59 [INFO] Downloading: https://repo.spring.io/libs-snapshot-local/org/springframework/cloud/spring-cloud-core/1.2.3.RELEASE/spring-cloud-core-1.2.3.RELEASE.jar
19-Jun-2019 05:41:59 [INFO] Downloading: https://repo.spring.io/libs-snapshot-local/org/springframework/cloud/spring-cloud-cloudfoundry-connector/1.2.3.RELEASE/spring-cloud-cloudfoundry-connector-1.2.3.RELEASE.jar
19-Jun-2019 05:41:59 [INFO] Downloading: https://repo.spring.io/libs-snapshot-local/io/pivotal/spring/cloud/spring-cloud-services-spring-connector/1.5.0.RELEASE/spring-cloud-services-spring-connector-1.5.0.RELEASE.jar
19-Jun-2019 05:41:59 [INFO] Downloading: https://repo.spring.io/libs-snapshot-local/org/projectlombok/lombok/1.16.10/lombok-1.16.10.jar
19-Jun-2019 05:41:59 [INFO] Downloading: https://repo.spring.io/libs-snapshot-local/org/springframework/cloud/spring-cloud-spring-service-connector/1.2.3.RELEASE/spring-cloud-spring-service-connector-1.2.3.RELEASE.jar
19-Jun-2019 05:41:59 [INFO] Downloading: https://repo.spring.io/libs-snapshot-local/io/pivotal/spring/cloud/cloudfoundry-certificate-truster/1.0.1.RELEASE/cloudfoundry-certificate-truster-1.0.1.RELEASE.jar
19-Jun-2019 05:41:59 [INFO] Downloading: https://repo.spring.io/libs-snapshot-local/io/micrometer/micrometer-spring-legacy/1.0.3/micrometer-spring-legacy-1.0.3.jar
19-Jun-2019 05:41:59 [INFO] Downloading: https://repo.spring.io/libs-snapshot-local/io/micrometer/micrometer-core/1.0.3/micrometer-core-1.0.3.jar
19-Jun-2019 05:41:59 [INFO] Downloading: https://repo.spring.io/libs-snapshot-local/org/springframework/boot/spring-boot-starter-data-redis/1.4.1.RELEASE/spring-boot-starter-data-redis-1.4.1.RELEASE.jar
19-Jun-2019 05:41:59 [INFO] Downloading: https://repo.spring.io/libs-snapshot-local/org/springframework/data/spring-data-redis/1.7.3.RELEASE/spring-data-redis-1.7.3.RELEASE.jar
19-Jun-2019 05:41:59 [INFO] Downloading: https://repo.spring.io/libs-snapshot-local/org/springframework/data/spring-data-keyvalue/1.1.3.RELEASE/spring-data-keyvalue-1.1.3.RELEASE.jar
19-Jun-2019 05:41:59 [INFO] Downloading: https://repo.spring.io/libs-snapshot-local/org/springframework/spring-context-support/4.3.3.RELEASE/spring-context-support-4.3.3.RELEASE.jar
19-Jun-2019 05:41:59 [INFO] Downloading: https://repo.spring.io/libs-snapshot-local/redis/clients/jedis/2.8.1/jedis-2.8.1.jar
19-Jun-2019 05:41:59 [INFO] Downloading: https://repo.spring.io/libs-snapshot-local/org/apache/commons/commons-pool2/2.4.2/commons-pool2-2.4.2.jar
19-Jun-2019 05:41:59 [INFO] Downloading: https://repo.spring.io/libs-snapshot-local/org/springframework/spring-web/4.3.4.RELEASE/spring-web-4.3.4.RELEASE.jar
19-Jun-2019 05:41:59 [INFO] Downloading: https://repo.spring.io/libs-snapshot-local/org/springframework/cloud/spring-cloud-dataflow-rest-client/1.7.0.BUILD-SNAPSHOT/spring-cloud-dataflow-rest-client-1.7.0.BUILD-20181023.141453-130.jar
19-Jun-2019 05:41:59 [INFO] Downloading: https://repo.spring.io/libs-snapshot-local/org/springframework/analytics/spring-analytics/1.1.3.RELEASE/spring-analytics-1.1.3.RELEASE.jar
19-Jun-2019 05:41:59 [INFO] Downloading: https://repo.spring.io/libs-snapshot-local/org/springframework/hateoas/spring-hateoas/0.20.0.RELEASE/spring-hateoas-0.20.0.RELEASE.jar
19-Jun-2019 05:41:59 [INFO] Downloading: https://repo.spring.io/libs-snapshot-local/org/springframework/cloud/spring-cloud-skipper/1.1.0.RELEASE/spring-cloud-skipper-1.1.0.RELEASE.jar
19-Jun-2019 05:41:59 [INFO] Downloading: https://repo.spring.io/libs-snapshot-local/com/fasterxml/jackson/dataformat/jackson-dataformat-yaml/2.8.3/jackson-dataformat-yaml-2.8.3.jar
19-Jun-2019 05:41:59 [INFO] Downloading: https://repo.spring.io/libs-snapshot-local/org/zeroturnaround/zt-zip/1.11/zt-zip-1.11.jar
19-Jun-2019 05:41:59 [INFO] Downloading: https://repo.spring.io/libs-snapshot-local/org/springframework/cloud/spring-cloud-dataflow-rest-resource/1.7.0.BUILD-SNAPSHOT/spring-cloud-dataflow-rest-resource-1.7.0.BUILD-20181023.141453-130.jar
19-Jun-2019 05:41:59 [INFO] Downloading: https://repo.spring.io/libs-snapshot-local/org/springframework/boot/spring-boot-configuration-metadata/1.4.1.RELEASE/spring-boot-configuration-metadata-1.4.1.RELEASE.jar
19-Jun-2019 05:41:59 [INFO] Downloading: https://repo.spring.io/libs-snapshot-local/org/springframework/cloud/spring-cloud-task-core/1.3.0.RELEASE/spring-cloud-task-core-1.3.0.RELEASE.jar
19-Jun-2019 05:41:59 [INFO] Downloading: https://repo.spring.io/libs-snapshot-local/org/springframework/cloud/spring-cloud-deployer-resource-support/1.2.1.RELEASE/spring-cloud-deployer-resource-support-1.2.1.RELEASE.jar
19-Jun-2019 05:41:59 [INFO] Downloading: https://repo.spring.io/libs-snapshot-local/com/fasterxml/jackson/datatype/jackson-datatype-jsr310/2.8.3/jackson-datatype-jsr310-2.8.3.jar
19-Jun-2019 05:41:59 [INFO] Downloading: https://repo.spring.io/libs-snapshot-local/org/springframework/cloud/spring-cloud-dataflow-core/1.7.0.BUILD-SNAPSHOT/spring-cloud-dataflow-core-1.7.0.BUILD-20181023.141453-130.jar
19-Jun-2019 05:41:59 [INFO] Downloaded: https://repo.spring.io/libs-snapshot-local/org/springframework/cloud/spring-cloud-dataflow-rest-client/1.7.0.BUILD-SNAPSHOT/spring-cloud-dataflow-rest-client-1.7.0.BUILD-20181023.141453-130.jar (70 KB at 71.6 KB/sec)
19-Jun-2019 05:42:00 [INFO] Downloaded: https://repo.spring.io/libs-snapshot-local/org/springframework/cloud/spring-cloud-dataflow-rest-resource/1.7.0.BUILD-SNAPSHOT/spring-cloud-dataflow-rest-resource-1.7.0.BUILD-20181023.141453-130.jar (69 KB at 59.0 KB/sec)
19-Jun-2019 05:42:00 [INFO] Downloaded: https://repo.spring.io/libs-snapshot-local/org/springframework/cloud/spring-cloud-dataflow-core/1.7.0.BUILD-SNAPSHOT/spring-cloud-dataflow-core-1.7.0.BUILD-20181023.141453-130.jar (112 KB at 95.1 KB/sec)
19-Jun-2019 05:42:00 [INFO] Downloading: https://repo.spring.io/libs-milestone-local/org/springframework/cloud/stream/app/app-starters-test-support/1.3.3.RELEASE/app-starters-test-support-1.3.3.RELEASE.jar
19-Jun-2019 05:42:00 [INFO] Downloading: https://repo.spring.io/libs-milestone-local/org/springframework/integration/spring-integration-test/4.3.2.RELEASE/spring-integration-test-4.3.2.RELEASE.jar
19-Jun-2019 05:42:00 [INFO] Downloading: https://repo.spring.io/libs-milestone-local/org/springframework/cloud/spring-cloud-stream-test-support-internal/1.3.1.RELEASE/spring-cloud-stream-test-support-internal-1.3.1.RELEASE.jar
19-Jun-2019 05:42:00 [INFO] Downloading: https://repo.spring.io/libs-milestone-local/org/springframework/cloud/spring-cloud-stream/1.3.1.RELEASE/spring-cloud-stream-1.3.1.RELEASE.jar
19-Jun-2019 05:42:00 [INFO] Downloading: https://repo.spring.io/libs-milestone-local/org/springframework/cloud/spring-cloud-stream-metrics/1.3.1.RELEASE/spring-cloud-stream-metrics-1.3.1.RELEASE.jar
19-Jun-2019 05:42:00 [INFO] Downloading: https://repo.spring.io/libs-milestone-local/org/springframework/integration/spring-integration-xml/4.3.2.RELEASE/spring-integration-xml-4.3.2.RELEASE.jar
19-Jun-2019 05:42:00 [INFO] Downloading: https://repo.spring.io/libs-milestone-local/org/springframework/spring-oxm/4.3.3.RELEASE/spring-oxm-4.3.3.RELEASE.jar
19-Jun-2019 05:42:00 [INFO] Downloading: https://repo.spring.io/libs-milestone-local/org/springframework/ws/spring-xml/2.3.0.RELEASE/spring-xml-2.3.0.RELEASE.jar
19-Jun-2019 05:42:00 [INFO] Downloading: https://repo.spring.io/libs-milestone-local/org/springframework/boot/spring-boot-starter-security/1.4.1.RELEASE/spring-boot-starter-security-1.4.1.RELEASE.jar
19-Jun-2019 05:42:00 [INFO] Downloading: https://repo.spring.io/libs-milestone-local/org/springframework/security/spring-security-config/4.1.3.RELEASE/spring-security-config-4.1.3.RELEASE.jar
19-Jun-2019 05:42:00 [INFO] Downloading: https://repo.spring.io/libs-milestone-local/org/springframework/security/spring-security-core/4.1.3.RELEASE/spring-security-core-4.1.3.RELEASE.jar
19-Jun-2019 05:42:00 [INFO] Downloading: https://repo.spring.io/libs-milestone-local/org/springframework/security/spring-security-web/4.1.3.RELEASE/spring-security-web-4.1.3.RELEASE.jar
19-Jun-2019 05:42:00 [INFO] Downloading: https://repo.spring.io/libs-milestone-local/io/pivotal/spring/cloud/spring-cloud-services-starter-config-client/1.5.0.RELEASE/spring-cloud-services-starter-config-client-1.5.0.RELEASE.jar
19-Jun-2019 05:42:00 [INFO] Downloading: https://repo.spring.io/libs-milestone-local/org/springframework/cloud/spring-cloud-config-client/1.3.1.RELEASE/spring-cloud-config-client-1.3.1.RELEASE.jar
19-Jun-2019 05:42:00 [INFO] Downloading: https://repo.spring.io/libs-milestone-local/org/springframework/cloud/spring-cloud-commons/1.2.2.RELEASE/spring-cloud-commons-1.2.2.RELEASE.jar
19-Jun-2019 05:42:00 [INFO] Downloading: https://repo.spring.io/libs-milestone-local/org/springframework/security/spring-security-crypto/4.1.3.RELEASE/spring-security-crypto-4.1.3.RELEASE.jar
19-Jun-2019 05:42:00 [INFO] Downloading: https://repo.spring.io/libs-milestone-local/org/springframework/cloud/spring-cloud-context/1.2.2.RELEASE/spring-cloud-context-1.2.2.RELEASE.jar
19-Jun-2019 05:42:00 [INFO] Downloading: https://repo.spring.io/libs-milestone-local/org/springframework/security/oauth/spring-security-oauth2/2.0.11.RELEASE/spring-security-oauth2-2.0.11.RELEASE.jar
19-Jun-2019 05:42:00 [INFO] Downloading: https://repo.spring.io/libs-milestone-local/io/pivotal/spring/cloud/spring-cloud-services-cloudfoundry-connector/1.5.0.RELEASE/spring-cloud-services-cloudfoundry-connector-1.5.0.RELEASE.jar
19-Jun-2019 05:42:00 [INFO] Downloading: https://repo.spring.io/libs-milestone-local/io/pivotal/spring/cloud/spring-cloud-services-connector-core/1.5.0.RELEASE/spring-cloud-services-connector-core-1.5.0.RELEASE.jar
19-Jun-2019 05:42:00 [INFO] Downloading: https://repo.spring.io/libs-milestone-local/org/springframework/cloud/spring-cloud-core/1.2.3.RELEASE/spring-cloud-core-1.2.3.RELEASE.jar
19-Jun-2019 05:42:00 [INFO] Downloading: https://repo.spring.io/libs-milestone-local/org/springframework/cloud/spring-cloud-cloudfoundry-connector/1.2.3.RELEASE/spring-cloud-cloudfoundry-connector-1.2.3.RELEASE.jar
19-Jun-2019 05:42:00 [INFO] Downloading: https://repo.spring.io/libs-milestone-local/io/pivotal/spring/cloud/spring-cloud-services-spring-connector/1.5.0.RELEASE/spring-cloud-services-spring-connector-1.5.0.RELEASE.jar
19-Jun-2019 05:42:00 [INFO] Downloading: https://repo.spring.io/libs-milestone-local/org/projectlombok/lombok/1.16.10/lombok-1.16.10.jar
19-Jun-2019 05:42:00 [INFO] Downloading: https://repo.spring.io/libs-milestone-local/org/springframework/cloud/spring-cloud-spring-service-connector/1.2.3.RELEASE/spring-cloud-spring-service-connector-1.2.3.RELEASE.jar
19-Jun-2019 05:42:00 [INFO] Downloading: https://repo.spring.io/libs-milestone-local/io/pivotal/spring/cloud/cloudfoundry-certificate-truster/1.0.1.RELEASE/cloudfoundry-certificate-truster-1.0.1.RELEASE.jar
19-Jun-2019 05:42:00 [INFO] Downloading: https://repo.spring.io/libs-milestone-local/io/micrometer/micrometer-spring-legacy/1.0.3/micrometer-spring-legacy-1.0.3.jar
19-Jun-2019 05:42:00 [INFO] Downloading: https://repo.spring.io/libs-milestone-local/io/micrometer/micrometer-core/1.0.3/micrometer-core-1.0.3.jar
19-Jun-2019 05:42:00 [INFO] Downloading: https://repo.spring.io/libs-milestone-local/org/springframework/boot/spring-boot-starter-data-redis/1.4.1.RELEASE/spring-boot-starter-data-redis-1.4.1.RELEASE.jar
19-Jun-2019 05:42:00 [INFO] Downloading: https://repo.spring.io/libs-milestone-local/org/springframework/data/spring-data-redis/1.7.3.RELEASE/spring-data-redis-1.7.3.RELEASE.jar
19-Jun-2019 05:42:00 [INFO] Downloading: https://repo.spring.io/libs-milestone-local/org/springframework/data/spring-data-keyvalue/1.1.3.RELEASE/spring-data-keyvalue-1.1.3.RELEASE.jar
19-Jun-2019 05:42:00 [INFO] Downloading: https://repo.spring.io/libs-milestone-local/org/springframework/spring-context-support/4.3.3.RELEASE/spring-context-support-4.3.3.RELEASE.jar
19-Jun-2019 05:42:00 [INFO] Downloading: https://repo.spring.io/libs-milestone-local/redis/clients/jedis/2.8.1/jedis-2.8.1.jar
19-Jun-2019 05:42:00 [INFO] Downloading: https://repo.spring.io/libs-milestone-local/org/apache/commons/commons-pool2/2.4.2/commons-pool2-2.4.2.jar
19-Jun-2019 05:42:00 [INFO] Downloading: https://repo.spring.io/libs-milestone-local/org/springframework/spring-web/4.3.4.RELEASE/spring-web-4.3.4.RELEASE.jar
19-Jun-2019 05:42:00 [INFO] Downloading: https://repo.spring.io/libs-milestone-local/org/springframework/analytics/spring-analytics/1.1.3.RELEASE/spring-analytics-1.1.3.RELEASE.jar
19-Jun-2019 05:42:00 [INFO] Downloading: https://repo.spring.io/libs-milestone-local/org/springframework/hateoas/spring-hateoas/0.20.0.RELEASE/spring-hateoas-0.20.0.RELEASE.jar
19-Jun-2019 05:42:00 [INFO] Downloading: https://repo.spring.io/libs-milestone-local/org/springframework/cloud/spring-cloud-skipper/1.1.0.RELEASE/spring-cloud-skipper-1.1.0.RELEASE.jar
19-Jun-2019 05:42:00 [INFO] Downloading: https://repo.spring.io/libs-milestone-local/com/fasterxml/jackson/dataformat/jackson-dataformat-yaml/2.8.3/jackson-dataformat-yaml-2.8.3.jar
19-Jun-2019 05:42:00 [INFO] Downloading: https://repo.spring.io/libs-milestone-local/org/zeroturnaround/zt-zip/1.11/zt-zip-1.11.jar
19-Jun-2019 05:42:00 [INFO] Downloading: https://repo.spring.io/libs-milestone-local/org/springframework/boot/spring-boot-configuration-metadata/1.4.1.RELEASE/spring-boot-configuration-metadata-1.4.1.RELEASE.jar
19-Jun-2019 05:42:00 [INFO] Downloading: https://repo.spring.io/libs-milestone-local/org/springframework/cloud/spring-cloud-task-core/1.3.0.RELEASE/spring-cloud-task-core-1.3.0.RELEASE.jar
19-Jun-2019 05:42:00 [INFO] Downloading: https://repo.spring.io/libs-milestone-local/org/springframework/cloud/spring-cloud-deployer-resource-support/1.2.1.RELEASE/spring-cloud-deployer-resource-support-1.2.1.RELEASE.jar
19-Jun-2019 05:42:00 [INFO] Downloading: https://repo.spring.io/libs-milestone-local/com/fasterxml/jackson/datatype/jackson-datatype-jsr310/2.8.3/jackson-datatype-jsr310-2.8.3.jar
19-Jun-2019 05:42:00 [INFO] Downloading: https://repo.spring.io/release/org/springframework/cloud/stream/app/app-starters-test-support/1.3.3.RELEASE/app-starters-test-support-1.3.3.RELEASE.jar
19-Jun-2019 05:42:00 [INFO] Downloading: https://repo.spring.io/release/org/springframework/cloud/spring-cloud-stream-test-support-internal/1.3.1.RELEASE/spring-cloud-stream-test-support-internal-1.3.1.RELEASE.jar
19-Jun-2019 05:42:00 [INFO] Downloading: https://repo.spring.io/release/org/springframework/integration/spring-integration-test/4.3.2.RELEASE/spring-integration-test-4.3.2.RELEASE.jar
19-Jun-2019 05:42:00 [INFO] Downloading: https://repo.spring.io/release/org/springframework/cloud/spring-cloud-stream-metrics/1.3.1.RELEASE/spring-cloud-stream-metrics-1.3.1.RELEASE.jar
19-Jun-2019 05:42:00 [INFO] Downloading: https://repo.spring.io/release/org/springframework/cloud/spring-cloud-stream/1.3.1.RELEASE/spring-cloud-stream-1.3.1.RELEASE.jar
19-Jun-2019 05:42:01 [INFO] Downloaded: https://repo.spring.io/release/org/springframework/cloud/spring-cloud-stream-metrics/1.3.1.RELEASE/spring-cloud-stream-metrics-1.3.1.RELEASE.jar (20 KB at 76.6 KB/sec)
19-Jun-2019 05:42:01 [INFO] Downloading: https://repo.spring.io/release/org/springframework/integration/spring-integration-xml/4.3.2.RELEASE/spring-integration-xml-4.3.2.RELEASE.jar
19-Jun-2019 05:42:01 [INFO] Downloaded: https://repo.spring.io/release/org/springframework/cloud/spring-cloud-stream-test-support-internal/1.3.1.RELEASE/spring-cloud-stream-test-support-internal-1.3.1.RELEASE.jar (7 KB at 25.3 KB/sec)
19-Jun-2019 05:42:01 [INFO] Downloading: https://repo.spring.io/release/org/springframework/spring-oxm/4.3.3.RELEASE/spring-oxm-4.3.3.RELEASE.jar
19-Jun-2019 05:42:01 [INFO] Downloaded: https://repo.spring.io/release/org/springframework/integration/spring-integration-test/4.3.2.RELEASE/spring-integration-test-4.3.2.RELEASE.jar (38 KB at 125.0 KB/sec)
19-Jun-2019 05:42:01 [INFO] Downloading: https://repo.spring.io/release/org/springframework/ws/spring-xml/2.3.0.RELEASE/spring-xml-2.3.0.RELEASE.jar
19-Jun-2019 05:42:01 [INFO] Downloaded: https://repo.spring.io/release/org/springframework/cloud/stream/app/app-starters-test-support/1.3.3.RELEASE/app-starters-test-support-1.3.3.RELEASE.jar (11 KB at 34.0 KB/sec)
19-Jun-2019 05:42:01 [INFO] Downloading: https://repo.spring.io/release/org/springframework/boot/spring-boot-starter-security/1.4.1.RELEASE/spring-boot-starter-security-1.4.1.RELEASE.jar
19-Jun-2019 05:42:01 [INFO] Downloaded: https://repo.spring.io/release/org/springframework/cloud/spring-cloud-stream/1.3.1.RELEASE/spring-cloud-stream-1.3.1.RELEASE.jar (196 KB at 622.6 KB/sec)
19-Jun-2019 05:42:01 [INFO] Downloading: https://repo.spring.io/release/org/springframework/security/spring-security-config/4.1.3.RELEASE/spring-security-config-4.1.3.RELEASE.jar
19-Jun-2019 05:42:01 [INFO] Downloaded: https://repo.spring.io/release/org/springframework/boot/spring-boot-starter-security/1.4.1.RELEASE/spring-boot-starter-security-1.4.1.RELEASE.jar (3 KB at 4.9 KB/sec)
19-Jun-2019 05:42:01 [INFO] Downloading: https://repo.spring.io/release/org/springframework/security/spring-security-core/4.1.3.RELEASE/spring-security-core-4.1.3.RELEASE.jar
19-Jun-2019 05:42:01 [INFO] Downloaded: https://repo.spring.io/release/org/springframework/spring-oxm/4.3.3.RELEASE/spring-oxm-4.3.3.RELEASE.jar (84 KB at 150.1 KB/sec)
19-Jun-2019 05:42:01 [INFO] Downloading: https://repo.spring.io/release/org/springframework/security/spring-security-web/4.1.3.RELEASE/spring-security-web-4.1.3.RELEASE.jar
19-Jun-2019 05:42:01 [INFO] Downloaded: https://repo.spring.io/release/org/springframework/integration/spring-integration-xml/4.3.2.RELEASE/spring-integration-xml-4.3.2.RELEASE.jar (78 KB at 136.0 KB/sec)
19-Jun-2019 05:42:01 [INFO] Downloading: https://repo.spring.io/release/io/pivotal/spring/cloud/spring-cloud-services-starter-config-client/1.5.0.RELEASE/spring-cloud-services-starter-config-client-1.5.0.RELEASE.jar
19-Jun-2019 05:42:01 [INFO] Downloaded: https://repo.spring.io/release/org/springframework/ws/spring-xml/2.3.0.RELEASE/spring-xml-2.3.0.RELEASE.jar (66 KB at 108.2 KB/sec)
19-Jun-2019 05:42:01 [INFO] Downloading: https://repo.spring.io/release/org/springframework/cloud/spring-cloud-config-client/1.3.1.RELEASE/spring-cloud-config-client-1.3.1.RELEASE.jar
19-Jun-2019 05:42:01 [INFO] Downloaded: https://repo.spring.io/release/org/springframework/security/spring-security-config/4.1.3.RELEASE/spring-security-config-4.1.3.RELEASE.jar (533 KB at 873.3 KB/sec)
19-Jun-2019 05:42:01 [INFO] Downloading: https://repo.spring.io/release/org/springframework/cloud/spring-cloud-commons/1.2.2.RELEASE/spring-cloud-commons-1.2.2.RELEASE.jar
19-Jun-2019 05:42:01 [INFO] Downloaded: https://repo.spring.io/release/org/springframework/security/spring-security-core/4.1.3.RELEASE/spring-security-core-4.1.3.RELEASE.jar (368 KB at 516.7 KB/sec)
19-Jun-2019 05:42:01 [INFO] Downloading: https://repo.spring.io/release/org/springframework/security/spring-security-crypto/4.1.3.RELEASE/spring-security-crypto-4.1.3.RELEASE.jar
19-Jun-2019 05:42:01 [INFO] Downloaded: https://repo.spring.io/release/org/springframework/cloud/spring-cloud-config-client/1.3.1.RELEASE/spring-cloud-config-client-1.3.1.RELEASE.jar (33 KB at 42.1 KB/sec)
19-Jun-2019 05:42:01 [INFO] Downloading: https://repo.spring.io/release/org/springframework/cloud/spring-cloud-context/1.2.2.RELEASE/spring-cloud-context-1.2.2.RELEASE.jar
19-Jun-2019 05:42:01 [INFO] Downloaded: https://repo.spring.io/release/io/pivotal/spring/cloud/spring-cloud-services-starter-config-client/1.5.0.RELEASE/spring-cloud-services-starter-config-client-1.5.0.RELEASE.jar (3 KB at 2.6 KB/sec)
19-Jun-2019 05:42:01 [INFO] Downloading: https://repo.spring.io/release/org/springframework/security/oauth/spring-security-oauth2/2.0.11.RELEASE/spring-security-oauth2-2.0.11.RELEASE.jar
19-Jun-2019 05:42:01 [INFO] Downloaded: https://repo.spring.io/release/org/springframework/cloud/spring-cloud-commons/1.2.2.RELEASE/spring-cloud-commons-1.2.2.RELEASE.jar (108 KB at 121.3 KB/sec)
19-Jun-2019 05:42:01 [INFO] Downloading: https://repo.spring.io/release/io/pivotal/spring/cloud/spring-cloud-services-cloudfoundry-connector/1.5.0.RELEASE/spring-cloud-services-cloudfoundry-connector-1.5.0.RELEASE.jar
19-Jun-2019 05:42:01 [INFO] Downloaded: https://repo.spring.io/release/org/springframework/security/spring-security-web/4.1.3.RELEASE/spring-security-web-4.1.3.RELEASE.jar (352 KB at 359.0 KB/sec)
19-Jun-2019 05:42:01 [INFO] Downloading: https://repo.spring.io/release/io/pivotal/spring/cloud/spring-cloud-services-connector-core/1.5.0.RELEASE/spring-cloud-services-connector-core-1.5.0.RELEASE.jar
19-Jun-2019 05:42:01 [INFO] Downloaded: https://repo.spring.io/release/org/springframework/cloud/spring-cloud-context/1.2.2.RELEASE/spring-cloud-context-1.2.2.RELEASE.jar (96 KB at 91.4 KB/sec)
19-Jun-2019 05:42:01 [INFO] Downloading: https://repo.spring.io/release/org/springframework/cloud/spring-cloud-core/1.2.3.RELEASE/spring-cloud-core-1.2.3.RELEASE.jar
19-Jun-2019 05:42:01 [INFO] Downloaded: https://repo.spring.io/release/org/springframework/security/spring-security-crypto/4.1.3.RELEASE/spring-security-crypto-4.1.3.RELEASE.jar (54 KB at 50.9 KB/sec)
19-Jun-2019 05:42:01 [INFO] Downloading: https://repo.spring.io/release/org/springframework/cloud/spring-cloud-cloudfoundry-connector/1.2.3.RELEASE/spring-cloud-cloudfoundry-connector-1.2.3.RELEASE.jar
19-Jun-2019 05:42:01 [INFO] Downloaded: https://repo.spring.io/release/io/pivotal/spring/cloud/spring-cloud-services-cloudfoundry-connector/1.5.0.RELEASE/spring-cloud-services-cloudfoundry-connector-1.5.0.RELEASE.jar (10 KB at 8.7 KB/sec)
19-Jun-2019 05:42:01 [INFO] Downloading: https://repo.spring.io/release/io/pivotal/spring/cloud/spring-cloud-services-spring-connector/1.5.0.RELEASE/spring-cloud-services-spring-connector-1.5.0.RELEASE.jar
19-Jun-2019 05:42:02 [INFO] Downloaded: https://repo.spring.io/release/org/springframework/security/oauth/spring-security-oauth2/2.0.11.RELEASE/spring-security-oauth2-2.0.11.RELEASE.jar (443 KB at 386.9 KB/sec)
19-Jun-2019 05:42:02 [INFO] Downloading: https://repo.spring.io/release/org/projectlombok/lombok/1.16.10/lombok-1.16.10.jar
19-Jun-2019 05:42:02 [INFO] Downloaded: https://repo.spring.io/release/io/pivotal/spring/cloud/spring-cloud-services-connector-core/1.5.0.RELEASE/spring-cloud-services-connector-core-1.5.0.RELEASE.jar (9 KB at 7.2 KB/sec)
19-Jun-2019 05:42:02 [INFO] Downloading: https://repo.spring.io/release/org/springframework/cloud/spring-cloud-spring-service-connector/1.2.3.RELEASE/spring-cloud-spring-service-connector-1.2.3.RELEASE.jar
19-Jun-2019 05:42:02 [INFO] Downloading: https://repo.spring.io/release/io/pivotal/spring/cloud/cloudfoundry-certificate-truster/1.0.1.RELEASE/cloudfoundry-certificate-truster-1.0.1.RELEASE.jar
19-Jun-2019 05:42:02 [INFO] Downloaded: https://repo.spring.io/release/org/springframework/cloud/spring-cloud-core/1.2.3.RELEASE/spring-cloud-core-1.2.3.RELEASE.jar (41 KB at 32.5 KB/sec)
19-Jun-2019 05:42:02 [INFO] Downloading: https://repo.spring.io/release/io/micrometer/micrometer-spring-legacy/1.0.3/micrometer-spring-legacy-1.0.3.jar
19-Jun-2019 05:42:02 [INFO] Downloaded: https://repo.spring.io/release/io/pivotal/spring/cloud/spring-cloud-services-spring-connector/1.5.0.RELEASE/spring-cloud-services-spring-connector-1.5.0.RELEASE.jar (33 KB at 26.5 KB/sec)
19-Jun-2019 05:42:02 [INFO] Downloading: https://repo.spring.io/release/io/micrometer/micrometer-core/1.0.3/micrometer-core-1.0.3.jar
19-Jun-2019 05:42:02 [INFO] Downloading: https://repo.spring.io/release/org/springframework/boot/spring-boot-starter-data-redis/1.4.1.RELEASE/spring-boot-starter-data-redis-1.4.1.RELEASE.jar
19-Jun-2019 05:42:02 [INFO] Downloading: https://repo.spring.io/release/org/springframework/data/spring-data-redis/1.7.3.RELEASE/spring-data-redis-1.7.3.RELEASE.jar
19-Jun-2019 05:42:02 [INFO] Downloaded: https://repo.spring.io/release/org/springframework/cloud/spring-cloud-spring-service-connector/1.2.3.RELEASE/spring-cloud-spring-service-connector-1.2.3.RELEASE.jar (73 KB at 48.3 KB/sec)
19-Jun-2019 05:42:02 [INFO] Downloading: https://repo.spring.io/release/org/springframework/data/spring-data-keyvalue/1.1.3.RELEASE/spring-data-keyvalue-1.1.3.RELEASE.jar
19-Jun-2019 05:42:02 [INFO] Downloaded: https://repo.spring.io/release/org/springframework/cloud/spring-cloud-cloudfoundry-connector/1.2.3.RELEASE/spring-cloud-cloudfoundry-connector-1.2.3.RELEASE.jar (1223 KB at 806.3 KB/sec)
19-Jun-2019 05:42:02 [INFO] Downloading: https://repo.spring.io/release/org/springframework/spring-context-support/4.3.3.RELEASE/spring-context-support-4.3.3.RELEASE.jar
19-Jun-2019 05:42:02 [INFO] Downloaded: https://repo.spring.io/release/org/springframework/boot/spring-boot-starter-data-redis/1.4.1.RELEASE/spring-boot-starter-data-redis-1.4.1.RELEASE.jar (3 KB at 1.6 KB/sec)
19-Jun-2019 05:42:02 [INFO] Downloading: https://repo.spring.io/release/redis/clients/jedis/2.8.1/jedis-2.8.1.jar
19-Jun-2019 05:42:02 [INFO] Downloaded: https://repo.spring.io/release/io/pivotal/spring/cloud/cloudfoundry-certificate-truster/1.0.1.RELEASE/cloudfoundry-certificate-truster-1.0.1.RELEASE.jar (14 KB at 8.9 KB/sec)
19-Jun-2019 05:42:02 [INFO] Downloading: https://repo.spring.io/release/org/apache/commons/commons-pool2/2.4.2/commons-pool2-2.4.2.jar
19-Jun-2019 05:42:02 [INFO] Downloading: https://repo.spring.io/release/org/springframework/spring-web/4.3.4.RELEASE/spring-web-4.3.4.RELEASE.jar
19-Jun-2019 05:42:02 [INFO] Downloading: https://repo.spring.io/release/org/springframework/analytics/spring-analytics/1.1.3.RELEASE/spring-analytics-1.1.3.RELEASE.jar
19-Jun-2019 05:42:02 [INFO] Downloaded: https://repo.spring.io/release/org/springframework/data/spring-data-redis/1.7.3.RELEASE/spring-data-redis-1.7.3.RELEASE.jar (1095 KB at 610.9 KB/sec)
19-Jun-2019 05:42:02 [INFO] Downloading: https://repo.spring.io/release/org/springframework/hateoas/spring-hateoas/0.20.0.RELEASE/spring-hateoas-0.20.0.RELEASE.jar
19-Jun-2019 05:42:02 [INFO] Downloaded: https://repo.spring.io/release/org/springframework/hateoas/spring-hateoas/0.20.0.RELEASE/spring-hateoas-0.20.0.RELEASE.jar (0 B at 0.0 KB/sec)
19-Jun-2019 05:42:02 [INFO] Downloading: https://repo.spring.io/release/org/springframework/cloud/spring-cloud-skipper/1.1.0.RELEASE/spring-cloud-skipper-1.1.0.RELEASE.jar
19-Jun-2019 05:42:02 [INFO] Downloaded: https://repo.spring.io/release/org/springframework/data/spring-data-keyvalue/1.1.3.RELEASE/spring-data-keyvalue-1.1.3.RELEASE.jar (102 KB at 53.6 KB/sec)
19-Jun-2019 05:42:02 [INFO] Downloading: https://repo.spring.io/release/com/fasterxml/jackson/dataformat/jackson-dataformat-yaml/2.8.3/jackson-dataformat-yaml-2.8.3.jar
19-Jun-2019 05:42:02 [INFO] Downloaded: https://repo.spring.io/release/org/springframework/analytics/spring-analytics/1.1.3.RELEASE/spring-analytics-1.1.3.RELEASE.jar (53 KB at 28.0 KB/sec)
19-Jun-2019 05:42:02 [INFO] Downloading: https://repo.spring.io/release/org/zeroturnaround/zt-zip/1.11/zt-zip-1.11.jar
19-Jun-2019 05:42:02 [INFO] Downloaded: https://repo.spring.io/release/org/springframework/spring-web/4.3.4.RELEASE/spring-web-4.3.4.RELEASE.jar (795 KB at 411.8 KB/sec)
19-Jun-2019 05:42:02 [INFO] Downloading: https://repo.spring.io/release/org/springframework/boot/spring-boot-configuration-metadata/1.4.1.RELEASE/spring-boot-configuration-metadata-1.4.1.RELEASE.jar
19-Jun-2019 05:42:02 [INFO] Downloaded: https://repo.spring.io/release/org/springframework/spring-context-support/4.3.3.RELEASE/spring-context-support-4.3.3.RELEASE.jar (183 KB at 94.2 KB/sec)
19-Jun-2019 05:42:02 [INFO] Downloading: https://repo.spring.io/release/org/springframework/cloud/spring-cloud-task-core/1.3.0.RELEASE/spring-cloud-task-core-1.3.0.RELEASE.jar
19-Jun-2019 05:42:02 [INFO] Downloading: https://repo.spring.io/release/org/springframework/cloud/spring-cloud-deployer-resource-support/1.2.1.RELEASE/spring-cloud-deployer-resource-support-1.2.1.RELEASE.jar
19-Jun-2019 05:42:02 [INFO] Downloading: https://repo.spring.io/release/com/fasterxml/jackson/datatype/jackson-datatype-jsr310/2.8.3/jackson-datatype-jsr310-2.8.3.jar
19-Jun-2019 05:42:02 [INFO] Downloaded: https://repo.spring.io/release/org/springframework/boot/spring-boot-configuration-metadata/1.4.1.RELEASE/spring-boot-configuration-metadata-1.4.1.RELEASE.jar (23 KB at 10.7 KB/sec)
19-Jun-2019 05:42:03 [INFO] Downloaded: https://repo.spring.io/release/org/springframework/cloud/spring-cloud-deployer-resource-support/1.2.1.RELEASE/spring-cloud-deployer-resource-support-1.2.1.RELEASE.jar (12 KB at 5.3 KB/sec)
19-Jun-2019 05:42:03 [INFO] Downloaded: https://repo.spring.io/release/org/springframework/cloud/spring-cloud-skipper/1.1.0.RELEASE/spring-cloud-skipper-1.1.0.RELEASE.jar (99 KB at 44.7 KB/sec)
19-Jun-2019 05:42:03 [INFO] Downloaded: https://repo.spring.io/release/org/springframework/cloud/spring-cloud-task-core/1.3.0.RELEASE/spring-cloud-task-core-1.3.0.RELEASE.jar (86 KB at 36.7 KB/sec)
19-Jun-2019 05:42:03 [INFO] Downloading: https://repo.maven.apache.org/maven2/org/projectlombok/lombok/1.16.10/lombok-1.16.10.jar
19-Jun-2019 05:42:03 [INFO] Downloading: https://repo.maven.apache.org/maven2/io/micrometer/micrometer-spring-legacy/1.0.3/micrometer-spring-legacy-1.0.3.jar
19-Jun-2019 05:42:03 [INFO] Downloading: https://repo.maven.apache.org/maven2/io/micrometer/micrometer-core/1.0.3/micrometer-core-1.0.3.jar
19-Jun-2019 05:42:03 [INFO] Downloading: https://repo.maven.apache.org/maven2/redis/clients/jedis/2.8.1/jedis-2.8.1.jar
19-Jun-2019 05:42:03 [INFO] Downloading: https://repo.maven.apache.org/maven2/org/apache/commons/commons-pool2/2.4.2/commons-pool2-2.4.2.jar
19-Jun-2019 05:42:03 [INFO] Downloaded: https://repo.maven.apache.org/maven2/io/micrometer/micrometer-spring-legacy/1.0.3/micrometer-spring-legacy-1.0.3.jar (134 KB at 1520.2 KB/sec)
19-Jun-2019 05:42:03 [INFO] Downloading: https://repo.maven.apache.org/maven2/com/fasterxml/jackson/dataformat/jackson-dataformat-yaml/2.8.3/jackson-dataformat-yaml-2.8.3.jar
19-Jun-2019 05:42:03 [INFO] Downloaded: https://repo.maven.apache.org/maven2/org/apache/commons/commons-pool2/2.4.2/commons-pool2-2.4.2.jar (110 KB at 1242.6 KB/sec)
19-Jun-2019 05:42:03 [INFO] Downloading: https://repo.maven.apache.org/maven2/org/zeroturnaround/zt-zip/1.11/zt-zip-1.11.jar
19-Jun-2019 05:42:03 [INFO] Downloaded: https://repo.maven.apache.org/maven2/io/micrometer/micrometer-core/1.0.3/micrometer-core-1.0.3.jar (296 KB at 3110.0 KB/sec)
19-Jun-2019 05:42:03 [INFO] Downloading: https://repo.maven.apache.org/maven2/com/fasterxml/jackson/datatype/jackson-datatype-jsr310/2.8.3/jackson-datatype-jsr310-2.8.3.jar
19-Jun-2019 05:42:03 [INFO] Downloaded: https://repo.maven.apache.org/maven2/redis/clients/jedis/2.8.1/jedis-2.8.1.jar (527 KB at 4421.5 KB/sec)
19-Jun-2019 05:42:03 [INFO] Downloaded: https://repo.maven.apache.org/maven2/com/fasterxml/jackson/dataformat/jackson-dataformat-yaml/2.8.3/jackson-dataformat-yaml-2.8.3.jar (40 KB at 332.2 KB/sec)
19-Jun-2019 05:42:03 [INFO] Downloaded: https://repo.maven.apache.org/maven2/org/zeroturnaround/zt-zip/1.11/zt-zip-1.11.jar (103 KB at 891.7 KB/sec)
19-Jun-2019 05:42:03 [INFO] Downloaded: https://repo.maven.apache.org/maven2/com/fasterxml/jackson/datatype/jackson-datatype-jsr310/2.8.3/jackson-datatype-jsr310-2.8.3.jar (89 KB at 728.6 KB/sec)
19-Jun-2019 05:42:03 [INFO] Downloaded: https://repo.maven.apache.org/maven2/org/projectlombok/lombok/1.16.10/lombok-1.16.10.jar (1368 KB at 8653.3 KB/sec)
19-Jun-2019 05:42:03 [INFO]
19-Jun-2019 05:42:03 [INFO] --- maven-checkstyle-plugin:2.17:check (checkstyle-validation) @ spring-cloud-dataflow-acceptance-tests ---
19-Jun-2019 05:42:03 [INFO] Downloading: https://repo.spring.io/libs-snapshot-local/com/puppycrawl/tools/checkstyle/6.11.2/checkstyle-6.11.2.pom
19-Jun-2019 05:42:03 [INFO] Downloading: https://repo.spring.io/libs-milestone-local/com/puppycrawl/tools/checkstyle/6.11.2/checkstyle-6.11.2.pom
19-Jun-2019 05:42:03 [INFO] Downloading: https://repo.maven.apache.org/maven2/com/puppycrawl/tools/checkstyle/6.11.2/checkstyle-6.11.2.pom
19-Jun-2019 05:42:03 [INFO] Downloaded: https://repo.maven.apache.org/maven2/com/puppycrawl/tools/checkstyle/6.11.2/checkstyle-6.11.2.pom (62 KB at 2209.8 KB/sec)
19-Jun-2019 05:42:03 [INFO] Downloading: https://repo.spring.io/libs-snapshot-local/org/antlr/antlr4-runtime/4.5.1-1/antlr4-runtime-4.5.1-1.pom
19-Jun-2019 05:42:03 [INFO] Downloading: https://repo.spring.io/libs-milestone-local/org/antlr/antlr4-runtime/4.5.1-1/antlr4-runtime-4.5.1-1.pom
19-Jun-2019 05:42:03 [INFO] Downloading: https://repo.maven.apache.org/maven2/org/antlr/antlr4-runtime/4.5.1-1/antlr4-runtime-4.5.1-1.pom
19-Jun-2019 05:42:03 [INFO] Downloaded: https://repo.maven.apache.org/maven2/org/antlr/antlr4-runtime/4.5.1-1/antlr4-runtime-4.5.1-1.pom (0 B at 0.0 KB/sec)
19-Jun-2019 05:42:03 [INFO] Downloading: https://repo.spring.io/libs-snapshot-local/org/antlr/antlr4-master/4.5.1-1/antlr4-master-4.5.1-1.pom
19-Jun-2019 05:42:03 [INFO] Downloading: https://repo.spring.io/libs-milestone-local/org/antlr/antlr4-master/4.5.1-1/antlr4-master-4.5.1-1.pom
19-Jun-2019 05:42:04 [INFO] Downloading: https://repo.maven.apache.org/maven2/org/antlr/antlr4-master/4.5.1-1/antlr4-master-4.5.1-1.pom
19-Jun-2019 05:42:04 [INFO] Downloaded: https://repo.maven.apache.org/maven2/org/antlr/antlr4-master/4.5.1-1/antlr4-master-4.5.1-1.pom (0 B at 0.0 KB/sec)
19-Jun-2019 05:42:04 [INFO] Downloading: https://repo.spring.io/libs-snapshot-local/com/puppycrawl/tools/checkstyle/6.11.2/checkstyle-6.11.2.jar
19-Jun-2019 05:42:04 [INFO] Downloading: https://repo.spring.io/libs-snapshot-local/commons-beanutils/commons-beanutils/1.9.2/commons-beanutils-1.9.2.jar
19-Jun-2019 05:42:04 [INFO] Downloading: https://repo.spring.io/libs-snapshot-local/org/antlr/antlr4-runtime/4.5.1-1/antlr4-runtime-4.5.1-1.jar
19-Jun-2019 05:42:04 [INFO] Downloading: https://repo.spring.io/libs-milestone-local/commons-beanutils/commons-beanutils/1.9.2/commons-beanutils-1.9.2.jar
19-Jun-2019 05:42:04 [INFO] Downloading: https://repo.spring.io/libs-milestone-local/org/antlr/antlr4-runtime/4.5.1-1/antlr4-runtime-4.5.1-1.jar
19-Jun-2019 05:42:04 [INFO] Downloading: https://repo.spring.io/libs-milestone-local/com/puppycrawl/tools/checkstyle/6.11.2/checkstyle-6.11.2.jar
19-Jun-2019 05:42:04 [INFO] Downloading: https://repo.maven.apache.org/maven2/com/puppycrawl/tools/checkstyle/6.11.2/checkstyle-6.11.2.jar
19-Jun-2019 05:42:04 [INFO] Downloading: https://repo.maven.apache.org/maven2/org/antlr/antlr4-runtime/4.5.1-1/antlr4-runtime-4.5.1-1.jar
19-Jun-2019 05:42:04 [INFO] Downloading: https://repo.maven.apache.org/maven2/commons-beanutils/commons-beanutils/1.9.2/commons-beanutils-1.9.2.jar
19-Jun-2019 05:42:04 [INFO] Downloaded: https://repo.maven.apache.org/maven2/org/antlr/antlr4-runtime/4.5.1-1/antlr4-runtime-4.5.1-1.jar (0 B at 0.0 KB/sec)
19-Jun-2019 05:42:04 [INFO] Downloaded: https://repo.maven.apache.org/maven2/commons-beanutils/commons-beanutils/1.9.2/commons-beanutils-1.9.2.jar (0 B at 0.0 KB/sec)
19-Jun-2019 05:42:04 [INFO] Downloaded: https://repo.maven.apache.org/maven2/com/puppycrawl/tools/checkstyle/6.11.2/checkstyle-6.11.2.jar (1070 KB at 10182.4 KB/sec)
19-Jun-2019 05:42:05 [INFO]
19-Jun-2019 05:42:05 [INFO] --- maven-resources-plugin:2.6:resources (default-resources) @ spring-cloud-dataflow-acceptance-tests ---
19-Jun-2019 05:42:05 [INFO] Using 'UTF-8' encoding to copy filtered resources.
19-Jun-2019 05:42:05 [INFO] skip non existing resourceDirectory /opt/bamboo-home/xml-data/build-dir/SCDT-LOCAL20XSKIPPER20X-KAFKA/src/main/resources
19-Jun-2019 05:42:05 [INFO] skip non existing resourceDirectory /opt/bamboo-home/xml-data/build-dir/SCDT-LOCAL20XSKIPPER20X-KAFKA/src/main/resources
19-Jun-2019 05:42:05 [INFO]
19-Jun-2019 05:42:05 [INFO] --- maven-compiler-plugin:3.1:compile (default-compile) @ spring-cloud-dataflow-acceptance-tests ---
19-Jun-2019 05:42:05 [INFO] Changes detected - recompiling the module!
19-Jun-2019 05:42:05 [INFO] Compiling 8 source files to /opt/bamboo-home/xml-data/build-dir/SCDT-LOCAL20XSKIPPER20X-KAFKA/target/classes
19-Jun-2019 05:42:05 [INFO]
19-Jun-2019 05:42:05 [INFO] --- maven-resources-plugin:2.6:testResources (default-testResources) @ spring-cloud-dataflow-acceptance-tests ---
19-Jun-2019 05:42:05 [INFO] Using 'UTF-8' encoding to copy filtered resources.
19-Jun-2019 05:42:05 [INFO] Copying 1 resource
19-Jun-2019 05:42:05 [INFO]
19-Jun-2019 05:42:05 [INFO] --- maven-compiler-plugin:3.1:testCompile (default-testCompile) @ spring-cloud-dataflow-acceptance-tests ---
19-Jun-2019 05:42:05 [INFO] Changes detected - recompiling the module!
19-Jun-2019 05:42:05 [INFO] Compiling 16 source files to /opt/bamboo-home/xml-data/build-dir/SCDT-LOCAL20XSKIPPER20X-KAFKA/target/test-classes
19-Jun-2019 05:42:06 [WARNING] /opt/bamboo-home/xml-data/build-dir/SCDT-LOCAL20XSKIPPER20X-KAFKA/src/test/java/org/springframework/cloud/dataflow/acceptance/test/AbstractTaskTests.java: Some input files use unchecked or unsafe operations.
19-Jun-2019 05:42:06 [WARNING] /opt/bamboo-home/xml-data/build-dir/SCDT-LOCAL20XSKIPPER20X-KAFKA/src/test/java/org/springframework/cloud/dataflow/acceptance/test/AbstractTaskTests.java: Recompile with -Xlint:unchecked for details.
19-Jun-2019 05:42:06 [INFO]
19-Jun-2019 05:42:06 [INFO] --- maven-surefire-plugin:2.18.1:test (default-test) @ spring-cloud-dataflow-acceptance-tests ---
19-Jun-2019 05:42:06 [INFO] Surefire report directory: /opt/bamboo-home/xml-data/build-dir/SCDT-LOCAL20XSKIPPER20X-KAFKA/target/surefire-reports
19-Jun-2019 05:42:06
19-Jun-2019 05:42:06 -------------------------------------------------------
19-Jun-2019 05:42:06 T E S T S
19-Jun-2019 05:42:06 -------------------------------------------------------
19-Jun-2019 05:42:06 2019-06-19 05:42:06.833  INFO   --- [           main] .b.t.c.SpringBootTestContextBootstrapper : Neither @ContextConfiguration nor @ContextHierarchy found for test class [org.springframework.cloud.dataflow.acceptance.test.AnalyticsTests], using SpringBootContextLoader
19-Jun-2019 05:42:06 2019-06-19 05:42:06.879  INFO   --- [           main] .b.t.c.SpringBootTestContextBootstrapper : Loaded default TestExecutionListener class names from location [META-INF/spring.factories]: [org.springframework.boot.test.mock.mockito.MockitoTestExecutionListener, org.springframework.boot.test.mock.mockito.ResetMocksTestExecutionListener, org.springframework.boot.test.autoconfigure.restdocs.RestDocsTestExecutionListener, org.springframework.boot.test.autoconfigure.web.client.MockRestServiceServerResetTestExecutionListener, org.springframework.boot.test.autoconfigure.web.servlet.MockMvcPrintOnlyOnFailureTestExecutionListener, org.springframework.boot.test.autoconfigure.web.servlet.WebDriverTestExecutionListener, org.springframework.test.context.web.ServletTestExecutionListener, org.springframework.test.context.support.DirtiesContextBeforeModesTestExecutionListener, org.springframework.test.context.support.DependencyInjectionTestExecutionListener, org.springframework.test.context.support.DirtiesContextTestExecutionListener, org.springframework.test.context.transaction.TransactionalTestExecutionListener, org.springframework.test.context.jdbc.SqlScriptsTestExecutionListener]
19-Jun-2019 05:42:06 2019-06-19 05:42:06.895  INFO   --- [           main] .b.t.c.SpringBootTestContextBootstrapper : Using TestExecutionListeners: [org.springframework.test.context.web.ServletTestExecutionListener@4b5d6a01, org.springframework.test.context.support.DirtiesContextBeforeModesTestExecutionListener@4a22f9e2, org.springframework.boot.test.autoconfigure.SpringBootDependencyInjectionTestExecutionListener@3c419631, org.springframework.test.context.support.DirtiesContextTestExecutionListener@418e7838, org.springframework.test.context.transaction.TransactionalTestExecutionListener@61230f6a, org.springframework.test.context.jdbc.SqlScriptsTestExecutionListener@3c130745, org.springframework.boot.test.mock.mockito.MockitoTestExecutionListener@cd3fee8, org.springframework.boot.test.autoconfigure.web.servlet.MockMvcPrintOnlyOnFailureTestExecutionListener@3e2e18f2, org.springframework.boot.test.autoconfigure.web.client.MockRestServiceServerResetTestExecutionListener@470f1802, org.springframework.boot.test.mock.mockito.ResetMocksTestExecutionListener@63021689, org.springframework.boot.test.autoconfigure.web.servlet.WebDriverTestExecutionListener@703580bf, org.springframework.boot.test.autoconfigure.restdocs.RestDocsTestExecutionListener@3e92efc3]
19-Jun-2019 05:42:06 2019-06-19 05:42:06.897  INFO   --- [           main] .b.t.c.SpringBootTestContextBootstrapper : Neither @ContextConfiguration nor @ContextHierarchy found for test class [org.springframework.cloud.dataflow.acceptance.test.WoodChuckTests], using SpringBootContextLoader
19-Jun-2019 05:42:06 2019-06-19 05:42:06.907  INFO   --- [           main] .b.t.c.SpringBootTestContextBootstrapper : Loaded default TestExecutionListener class names from location [META-INF/spring.factories]: [org.springframework.boot.test.mock.mockito.MockitoTestExecutionListener, org.springframework.boot.test.mock.mockito.ResetMocksTestExecutionListener, org.springframework.boot.test.autoconfigure.restdocs.RestDocsTestExecutionListener, org.springframework.boot.test.autoconfigure.web.client.MockRestServiceServerResetTestExecutionListener, org.springframework.boot.test.autoconfigure.web.servlet.MockMvcPrintOnlyOnFailureTestExecutionListener, org.springframework.boot.test.autoconfigure.web.servlet.WebDriverTestExecutionListener, org.springframework.test.context.web.ServletTestExecutionListener, org.springframework.test.context.support.DirtiesContextBeforeModesTestExecutionListener, org.springframework.test.context.support.DependencyInjectionTestExecutionListener, org.springframework.test.context.support.DirtiesContextTestExecutionListener, org.springframework.test.context.transaction.TransactionalTestExecutionListener, org.springframework.test.context.jdbc.SqlScriptsTestExecutionListener]
19-Jun-2019 05:42:06 2019-06-19 05:42:06.912  INFO   --- [           main] .b.t.c.SpringBootTestContextBootstrapper : Using TestExecutionListeners: [org.springframework.test.context.web.ServletTestExecutionListener@7ec7ffd3, org.springframework.test.context.support.DirtiesContextBeforeModesTestExecutionListener@5b239d7d, org.springframework.boot.test.autoconfigure.SpringBootDependencyInjectionTestExecutionListener@6572421, org.springframework.test.context.support.DirtiesContextTestExecutionListener@6b81ce95, org.springframework.test.context.transaction.TransactionalTestExecutionListener@2a798d51, org.springframework.test.context.jdbc.SqlScriptsTestExecutionListener@6d763516, org.springframework.boot.test.mock.mockito.MockitoTestExecutionListener@52bf72b5, org.springframework.boot.test.autoconfigure.web.servlet.MockMvcPrintOnlyOnFailureTestExecutionListener@37afeb11, org.springframework.boot.test.autoconfigure.web.client.MockRestServiceServerResetTestExecutionListener@515aebb0, org.springframework.boot.test.mock.mockito.ResetMocksTestExecutionListener@dd8ba08, org.springframework.boot.test.autoconfigure.web.servlet.WebDriverTestExecutionListener@245b4bdc, org.springframework.boot.test.autoconfigure.restdocs.RestDocsTestExecutionListener@6c64cb25]
19-Jun-2019 05:42:06 2019-06-19 05:42:06.913  INFO   --- [           main] .b.t.c.SpringBootTestContextBootstrapper : Neither @ContextConfiguration nor @ContextHierarchy found for test class [org.springframework.cloud.dataflow.acceptance.test.HttpSourceTests], using SpringBootContextLoader
19-Jun-2019 05:42:06 2019-06-19 05:42:06.922  INFO   --- [           main] .b.t.c.SpringBootTestContextBootstrapper : Loaded default TestExecutionListener class names from location [META-INF/spring.factories]: [org.springframework.boot.test.mock.mockito.MockitoTestExecutionListener, org.springframework.boot.test.mock.mockito.ResetMocksTestExecutionListener, org.springframework.boot.test.autoconfigure.restdocs.RestDocsTestExecutionListener, org.springframework.boot.test.autoconfigure.web.client.MockRestServiceServerResetTestExecutionListener, org.springframework.boot.test.autoconfigure.web.servlet.MockMvcPrintOnlyOnFailureTestExecutionListener, org.springframework.boot.test.autoconfigure.web.servlet.WebDriverTestExecutionListener, org.springframework.test.context.web.ServletTestExecutionListener, org.springframework.test.context.support.DirtiesContextBeforeModesTestExecutionListener, org.springframework.test.context.support.DependencyInjectionTestExecutionListener, org.springframework.test.context.support.DirtiesContextTestExecutionListener, org.springframework.test.context.transaction.TransactionalTestExecutionListener, org.springframework.test.context.jdbc.SqlScriptsTestExecutionListener]
19-Jun-2019 05:42:06 2019-06-19 05:42:06.925  INFO   --- [           main] .b.t.c.SpringBootTestContextBootstrapper : Using TestExecutionListeners: [org.springframework.test.context.web.ServletTestExecutionListener@40a4337a, org.springframework.test.context.support.DirtiesContextBeforeModesTestExecutionListener@6025e1b6, org.springframework.boot.test.autoconfigure.SpringBootDependencyInjectionTestExecutionListener@22ff4249, org.springframework.test.context.support.DirtiesContextTestExecutionListener@2d1ef81a, org.springframework.test.context.transaction.TransactionalTestExecutionListener@4c402120, org.springframework.test.context.jdbc.SqlScriptsTestExecutionListener@327514f, org.springframework.boot.test.mock.mockito.MockitoTestExecutionListener@5b12b668, org.springframework.boot.test.autoconfigure.web.servlet.MockMvcPrintOnlyOnFailureTestExecutionListener@1165b38, org.springframework.boot.test.autoconfigure.web.client.MockRestServiceServerResetTestExecutionListener@4c12331b, org.springframework.boot.test.mock.mockito.ResetMocksTestExecutionListener@7586beff, org.springframework.boot.test.autoconfigure.web.servlet.WebDriverTestExecutionListener@3b69e7d1, org.springframework.boot.test.autoconfigure.restdocs.RestDocsTestExecutionListener@815b41f]
19-Jun-2019 05:42:06 2019-06-19 05:42:06.942  INFO   --- [           main] .b.t.c.SpringBootTestContextBootstrapper : Neither @ContextConfiguration nor @ContextHierarchy found for test class [org.springframework.cloud.dataflow.acceptance.test.TickTockTests], using SpringBootContextLoader
19-Jun-2019 05:42:06 2019-06-19 05:42:06.955  INFO   --- [           main] .b.t.c.SpringBootTestContextBootstrapper : Loaded default TestExecutionListener class names from location [META-INF/spring.factories]: [org.springframework.boot.test.mock.mockito.MockitoTestExecutionListener, org.springframework.boot.test.mock.mockito.ResetMocksTestExecutionListener, org.springframework.boot.test.autoconfigure.restdocs.RestDocsTestExecutionListener, org.springframework.boot.test.autoconfigure.web.client.MockRestServiceServerResetTestExecutionListener, org.springframework.boot.test.autoconfigure.web.servlet.MockMvcPrintOnlyOnFailureTestExecutionListener, org.springframework.boot.test.autoconfigure.web.servlet.WebDriverTestExecutionListener, org.springframework.test.context.web.ServletTestExecutionListener, org.springframework.test.context.support.DirtiesContextBeforeModesTestExecutionListener, org.springframework.test.context.support.DependencyInjectionTestExecutionListener, org.springframework.test.context.support.DirtiesContextTestExecutionListener, org.springframework.test.context.transaction.TransactionalTestExecutionListener, org.springframework.test.context.jdbc.SqlScriptsTestExecutionListener]
19-Jun-2019 05:42:06 2019-06-19 05:42:06.958  INFO   --- [           main] .b.t.c.SpringBootTestContextBootstrapper : Using TestExecutionListeners: [org.springframework.test.context.web.ServletTestExecutionListener@482bce4f, org.springframework.test.context.support.DirtiesContextBeforeModesTestExecutionListener@366647c2, org.springframework.boot.test.autoconfigure.SpringBootDependencyInjectionTestExecutionListener@6a6afff2, org.springframework.test.context.support.DirtiesContextTestExecutionListener@1649b0e6, org.springframework.test.context.transaction.TransactionalTestExecutionListener@865dd6, org.springframework.test.context.jdbc.SqlScriptsTestExecutionListener@4da4253, org.springframework.boot.test.mock.mockito.MockitoTestExecutionListener@3972a855, org.springframework.boot.test.autoconfigure.web.servlet.MockMvcPrintOnlyOnFailureTestExecutionListener@62e7f11d, org.springframework.boot.test.autoconfigure.web.client.MockRestServiceServerResetTestExecutionListener@503d687a, org.springframework.boot.test.mock.mockito.ResetMocksTestExecutionListener@6a370f4, org.springframework.boot.test.autoconfigure.web.servlet.WebDriverTestExecutionListener@2abf4075, org.springframework.boot.test.autoconfigure.restdocs.RestDocsTestExecutionListener@770d3326]
19-Jun-2019 05:42:06 2019-06-19 05:42:06.965  INFO   --- [           main] .b.t.c.SpringBootTestContextBootstrapper : Neither @ContextConfiguration nor @ContextHierarchy found for test class [org.springframework.cloud.dataflow.acceptance.test.TransformTests], using SpringBootContextLoader
19-Jun-2019 05:42:06 2019-06-19 05:42:06.973  INFO   --- [           main] .b.t.c.SpringBootTestContextBootstrapper : Loaded default TestExecutionListener class names from location [META-INF/spring.factories]: [org.springframework.boot.test.mock.mockito.MockitoTestExecutionListener, org.springframework.boot.test.mock.mockito.ResetMocksTestExecutionListener, org.springframework.boot.test.autoconfigure.restdocs.RestDocsTestExecutionListener, org.springframework.boot.test.autoconfigure.web.client.MockRestServiceServerResetTestExecutionListener, org.springframework.boot.test.autoconfigure.web.servlet.MockMvcPrintOnlyOnFailureTestExecutionListener, org.springframework.boot.test.autoconfigure.web.servlet.WebDriverTestExecutionListener, org.springframework.test.context.web.ServletTestExecutionListener, org.springframework.test.context.support.DirtiesContextBeforeModesTestExecutionListener, org.springframework.test.context.support.DependencyInjectionTestExecutionListener, org.springframework.test.context.support.DirtiesContextTestExecutionListener, org.springframework.test.context.transaction.TransactionalTestExecutionListener, org.springframework.test.context.jdbc.SqlScriptsTestExecutionListener]
19-Jun-2019 05:42:06 2019-06-19 05:42:06.975  INFO   --- [           main] .b.t.c.SpringBootTestContextBootstrapper : Using TestExecutionListeners: [org.springframework.test.context.web.ServletTestExecutionListener@47e2e487, org.springframework.test.context.support.DirtiesContextBeforeModesTestExecutionListener@201a4587, org.springframework.boot.test.autoconfigure.SpringBootDependencyInjectionTestExecutionListener@61001b64, org.springframework.test.context.support.DirtiesContextTestExecutionListener@4310d43, org.springframework.test.context.transaction.TransactionalTestExecutionListener@54a7079e, org.springframework.test.context.jdbc.SqlScriptsTestExecutionListener@26e356f0, org.springframework.boot.test.mock.mockito.MockitoTestExecutionListener@47d9a273, org.springframework.boot.test.autoconfigure.web.servlet.MockMvcPrintOnlyOnFailureTestExecutionListener@4b8ee4de, org.springframework.boot.test.autoconfigure.web.client.MockRestServiceServerResetTestExecutionListener@27f981c6, org.springframework.boot.test.mock.mockito.ResetMocksTestExecutionListener@1b11171f, org.springframework.boot.test.autoconfigure.web.servlet.WebDriverTestExecutionListener@1151e434, org.springframework.boot.test.autoconfigure.restdocs.RestDocsTestExecutionListener@2dc54ad4]
19-Jun-2019 05:42:06 2019-06-19 05:42:06.986  INFO   --- [           main] .b.t.c.SpringBootTestContextBootstrapper : Neither @ContextConfiguration nor @ContextHierarchy found for test class [org.springframework.cloud.dataflow.acceptance.test.NamedChannelTests], using SpringBootContextLoader
19-Jun-2019 05:42:06 2019-06-19 05:42:06.993  INFO   --- [           main] .b.t.c.SpringBootTestContextBootstrapper : Loaded default TestExecutionListener class names from location [META-INF/spring.factories]: [org.springframework.boot.test.mock.mockito.MockitoTestExecutionListener, org.springframework.boot.test.mock.mockito.ResetMocksTestExecutionListener, org.springframework.boot.test.autoconfigure.restdocs.RestDocsTestExecutionListener, org.springframework.boot.test.autoconfigure.web.client.MockRestServiceServerResetTestExecutionListener, org.springframework.boot.test.autoconfigure.web.servlet.MockMvcPrintOnlyOnFailureTestExecutionListener, org.springframework.boot.test.autoconfigure.web.servlet.WebDriverTestExecutionListener, org.springframework.test.context.web.ServletTestExecutionListener, org.springframework.test.context.support.DirtiesContextBeforeModesTestExecutionListener, org.springframework.test.context.support.DependencyInjectionTestExecutionListener, org.springframework.test.context.support.DirtiesContextTestExecutionListener, org.springframework.test.context.transaction.TransactionalTestExecutionListener, org.springframework.test.context.jdbc.SqlScriptsTestExecutionListener]
19-Jun-2019 05:42:06 2019-06-19 05:42:06.995  INFO   --- [           main] .b.t.c.SpringBootTestContextBootstrapper : Using TestExecutionListeners: [org.springframework.test.context.web.ServletTestExecutionListener@70cf32e3, org.springframework.test.context.support.DirtiesContextBeforeModesTestExecutionListener@5a59ca5e, org.springframework.boot.test.autoconfigure.SpringBootDependencyInjectionTestExecutionListener@4bdeaabb, org.springframework.test.context.support.DirtiesContextTestExecutionListener@6c4906d3, org.springframework.test.context.transaction.TransactionalTestExecutionListener@65987993, org.springframework.test.context.jdbc.SqlScriptsTestExecutionListener@71075444, org.springframework.boot.test.mock.mockito.MockitoTestExecutionListener@4f32a3ad, org.springframework.boot.test.autoconfigure.web.servlet.MockMvcPrintOnlyOnFailureTestExecutionListener@6b695b06, org.springframework.boot.test.autoconfigure.web.client.MockRestServiceServerResetTestExecutionListener@4d1bf319, org.springframework.boot.test.mock.mockito.ResetMocksTestExecutionListener@6f53b8a, org.springframework.boot.test.autoconfigure.web.servlet.WebDriverTestExecutionListener@5c80cf32, org.springframework.boot.test.autoconfigure.restdocs.RestDocsTestExecutionListener@7d900ecf]
19-Jun-2019 05:42:07 Running org.springframework.cloud.dataflow.acceptance.test.AnalyticsTests
19-Jun-2019 05:42:07 2019-06-19 05:42:07.018  INFO   --- [           main] .b.t.c.SpringBootTestContextBootstrapper : Neither @ContextConfiguration nor @ContextHierarchy found for test class [org.springframework.cloud.dataflow.acceptance.test.AnalyticsTests], using SpringBootContextLoader
19-Jun-2019 05:42:07 2019-06-19 05:42:07.038  INFO   --- [           main] .b.t.c.SpringBootTestContextBootstrapper : Loaded default TestExecutionListener class names from location [META-INF/spring.factories]: [org.springframework.boot.test.mock.mockito.MockitoTestExecutionListener, org.springframework.boot.test.mock.mockito.ResetMocksTestExecutionListener, org.springframework.boot.test.autoconfigure.restdocs.RestDocsTestExecutionListener, org.springframework.boot.test.autoconfigure.web.client.MockRestServiceServerResetTestExecutionListener, org.springframework.boot.test.autoconfigure.web.servlet.MockMvcPrintOnlyOnFailureTestExecutionListener, org.springframework.boot.test.autoconfigure.web.servlet.WebDriverTestExecutionListener, org.springframework.test.context.web.ServletTestExecutionListener, org.springframework.test.context.support.DirtiesContextBeforeModesTestExecutionListener, org.springframework.test.context.support.DependencyInjectionTestExecutionListener, org.springframework.test.context.support.DirtiesContextTestExecutionListener, org.springframework.test.context.transaction.TransactionalTestExecutionListener, org.springframework.test.context.jdbc.SqlScriptsTestExecutionListener]
19-Jun-2019 05:42:07 2019-06-19 05:42:07.040  INFO   --- [           main] .b.t.c.SpringBootTestContextBootstrapper : Using TestExecutionListeners: [org.springframework.test.context.web.ServletTestExecutionListener@77659b30, org.springframework.test.context.support.DirtiesContextBeforeModesTestExecutionListener@456d6c1e, org.springframework.boot.test.autoconfigure.SpringBootDependencyInjectionTestExecutionListener@1e13529a, org.springframework.test.context.support.DirtiesContextTestExecutionListener@1ec9bd38, org.springframework.test.context.transaction.TransactionalTestExecutionListener@452e19ca, org.springframework.test.context.jdbc.SqlScriptsTestExecutionListener@6b0d80ed, org.springframework.boot.test.mock.mockito.MockitoTestExecutionListener@6f8e8894, org.springframework.boot.test.autoconfigure.web.servlet.MockMvcPrintOnlyOnFailureTestExecutionListener@3cfdd820, org.springframework.boot.test.autoconfigure.web.client.MockRestServiceServerResetTestExecutionListener@928763c, org.springframework.boot.test.mock.mockito.ResetMocksTestExecutionListener@e25951c, org.springframework.boot.test.autoconfigure.web.servlet.WebDriverTestExecutionListener@15f47664, org.springframework.boot.test.autoconfigure.restdocs.RestDocsTestExecutionListener@471a9022]
19-Jun-2019 05:42:07 2019-06-19 05:42:07.589  INFO 23900 --- [           main] s.c.a.AnnotationConfigApplicationContext : Refreshing org.springframework.context.annotation.AnnotationConfigApplicationContext@2fa7ae9: startup date [Wed Jun 19 05:42:07 UTC 2019]; root of context hierarchy
19-Jun-2019 05:42:07 2019-06-19 05:42:07.875  INFO 23900 --- [           main] trationDelegate$BeanPostProcessorChecker : Bean 'configurationPropertiesRebinderAutoConfiguration' of type [class org.springframework.cloud.autoconfigure.ConfigurationPropertiesRebinderAutoConfiguration$$EnhancerBySpringCGLIB$$219d8b3d] is not eligible for getting processed by all BeanPostProcessors (for example: not eligible for auto-proxying)
19-Jun-2019 05:42:08
19-Jun-2019 05:42:08   .   ____          _            __ _ _
19-Jun-2019 05:42:08 /\\ / ___'_ __ _ _(_)_ __  __ _ \ \ \ \
19-Jun-2019 05:42:08 ( ( )\___ | '_ | '_| | '_ \/ _` | \ \ \ \
19-Jun-2019 05:42:08 \\/  ___)| |_)| | | | | || (_| |  ) ) ) )
19-Jun-2019 05:42:08   '  |____| .__|_| |_|_| |_\__, | / / / /
19-Jun-2019 05:42:08 =========|_|==============|___/=/_/_/_/
19-Jun-2019 05:42:08 :: Spring Boot ::        (v1.4.1.RELEASE)
19-Jun-2019 05:42:08
19-Jun-2019 05:42:08 2019-06-19 05:42:08.155  INFO 23900 --- [           main] c.c.c.ConfigServicePropertySourceLocator : Fetching config from server at: http://localhost:8888
19-Jun-2019 05:42:08 2019-06-19 05:42:08.234  WARN 23900 --- [           main] c.c.c.ConfigServicePropertySourceLocator : Could not locate PropertySource: I/O error on GET request for "http://localhost:8888//blah": Connection refused (Connection refused); nested exception is java.net.ConnectException: Connection refused (Connection refused)
19-Jun-2019 05:42:08 2019-06-19 05:42:08.242  INFO 23900 --- [           main] o.s.c.d.acceptance.test.AnalyticsTests   : The following profiles are active: blah
19-Jun-2019 05:42:08 2019-06-19 05:42:08.454  INFO 23900 --- [           main] o.s.c.d.acceptance.test.AnalyticsTests   : Started AnalyticsTests in 1.352 seconds (JVM running for 2.022)
19-Jun-2019 05:42:08 2019-06-19 05:42:08.698  INFO 23900 --- [           main] junit.logTestName                        : Starting Test analyticsTest(org.springframework.cloud.dataflow.acceptance.test.AnalyticsTests)
19-Jun-2019 05:42:08 2019-06-19 05:42:08.704  INFO 23900 --- [           main] o.s.c.d.acceptance.test.AnalyticsTests   : Importing stream apps from uri resource: https://dataflow.spring.io/kafka-maven-latest
19-Jun-2019 05:42:10 2019-06-19 05:42:10.891  INFO 23900 --- [           main] junit.logTestName                        : Finished Test analyticsTest(org.springframework.cloud.dataflow.acceptance.test.AnalyticsTests)
19-Jun-2019 05:42:10 2019-06-19 05:42:10.891  INFO 23900 --- [           main] o.s.c.d.acceptance.test.AnalyticsTests   : Destroy all streams
19-Jun-2019 05:42:10 Tests run: 1, Failures: 0, Errors: 0, Skipped: 1, Time elapsed: 3.891 sec - in org.springframework.cloud.dataflow.acceptance.test.AnalyticsTests
19-Jun-2019 05:42:10 Running org.springframework.cloud.dataflow.acceptance.test.WoodChuckTests
19-Jun-2019 05:42:10 2019-06-19 05:42:10.909  INFO 23900 --- [           main] .b.t.c.SpringBootTestContextBootstrapper : Neither @ContextConfiguration nor @ContextHierarchy found for test class [org.springframework.cloud.dataflow.acceptance.test.WoodChuckTests], using SpringBootContextLoader
19-Jun-2019 05:42:10 2019-06-19 05:42:10.920  INFO 23900 --- [           main] .b.t.c.SpringBootTestContextBootstrapper : Loaded default TestExecutionListener class names from location [META-INF/spring.factories]: [org.springframework.boot.test.mock.mockito.MockitoTestExecutionListener, org.springframework.boot.test.mock.mockito.ResetMocksTestExecutionListener, org.springframework.boot.test.autoconfigure.restdocs.RestDocsTestExecutionListener, org.springframework.boot.test.autoconfigure.web.client.MockRestServiceServerResetTestExecutionListener, org.springframework.boot.test.autoconfigure.web.servlet.MockMvcPrintOnlyOnFailureTestExecutionListener, org.springframework.boot.test.autoconfigure.web.servlet.WebDriverTestExecutionListener, org.springframework.test.context.web.ServletTestExecutionListener, org.springframework.test.context.support.DirtiesContextBeforeModesTestExecutionListener, org.springframework.test.context.support.DependencyInjectionTestExecutionListener, org.springframework.test.context.support.DirtiesContextTestExecutionListener, org.springframework.test.context.transaction.TransactionalTestExecutionListener, org.springframework.test.context.jdbc.SqlScriptsTestExecutionListener]
19-Jun-2019 05:42:10 2019-06-19 05:42:10.923  INFO 23900 --- [           main] .b.t.c.SpringBootTestContextBootstrapper : Using TestExecutionListeners: [org.springframework.test.context.web.ServletTestExecutionListener@102ecc22, org.springframework.test.context.support.DirtiesContextBeforeModesTestExecutionListener@7ff35a3f, org.springframework.boot.test.autoconfigure.SpringBootDependencyInjectionTestExecutionListener@26dc9bd5, org.springframework.test.context.support.DirtiesContextTestExecutionListener@252dc8c4, org.springframework.test.context.transaction.TransactionalTestExecutionListener@43045f9f, org.springframework.test.context.jdbc.SqlScriptsTestExecutionListener@2643d762, org.springframework.boot.test.mock.mockito.MockitoTestExecutionListener@6403e24c, org.springframework.boot.test.autoconfigure.web.servlet.MockMvcPrintOnlyOnFailureTestExecutionListener@2f236de0, org.springframework.boot.test.autoconfigure.web.client.MockRestServiceServerResetTestExecutionListener@4eba373c, org.springframework.boot.test.mock.mockito.ResetMocksTestExecutionListener@767a014e, org.springframework.boot.test.autoconfigure.web.servlet.WebDriverTestExecutionListener@d109c4f, org.springframework.boot.test.autoconfigure.restdocs.RestDocsTestExecutionListener@3968bc60]
19-Jun-2019 05:42:11 2019-06-19 05:42:11.023  INFO 23900 --- [           main] junit.logTestName                        : Starting Test testPartitioning(org.springframework.cloud.dataflow.acceptance.test.WoodChuckTests)
19-Jun-2019 05:42:11 2019-06-19 05:42:11.033  INFO 23900 --- [           main] o.s.c.d.acceptance.test.WoodChuckTests   : Creating stream 'WOODCHUCK-TEST'
19-Jun-2019 05:42:11 2019-06-19 05:42:11.177  INFO 23900 --- [           main] o.s.c.d.acceptance.test.WoodChuckTests   : Deploying stream 'WOODCHUCK-TEST' with properties: {app.*.spring.cloud.streamapp.security.enabled=false, app.log.logging.pattern.level=WOODCHUCK-${INSTANCE_INDEX:${CF_INSTANCE_INDEX:${spring.cloud.stream.instanceIndex:0}}} %5p, app.*.logging.file=${PID}-test.log, app.splitter.producer.partitionKeyExpression=payload, app.*.endpoints.logfile.sensitive=false, app.log.spring.cloud.stream.kafka.bindings.input.consumer.autoRebalanceEnabled=false, app.*.management.endpoints.web.exposure.include=*, deployer.log.count=2}
19-Jun-2019 05:42:21 2019-06-19 05:42:21.966  INFO 23900 --- [           main] o.s.c.d.acceptance.test.WoodChuckTests   : Checking: Stream=WOODCHUCK-TEST, status = deploying, status description = The stream is being deployed.
19-Jun-2019 05:42:21 2019-06-19 05:42:21.966  INFO 23900 --- [           main] o.s.c.d.acceptance.test.WoodChuckTests   : Sleeping to check status of Stream=WOODCHUCK-TEST
19-Jun-2019 05:42:32 2019-06-19 05:42:32.182  INFO 23900 --- [           main] o.s.c.d.acceptance.test.WoodChuckTests   : Checking: Stream=WOODCHUCK-TEST, status = deploying, status description = The stream is being deployed.
19-Jun-2019 05:42:32 2019-06-19 05:42:32.183  INFO 23900 --- [           main] o.s.c.d.acceptance.test.WoodChuckTests   : Sleeping to check status of Stream=WOODCHUCK-TEST
19-Jun-2019 05:42:42 2019-06-19 05:42:42.302  INFO 23900 --- [           main] o.s.c.d.acceptance.test.WoodChuckTests   : Checking: Stream=WOODCHUCK-TEST, status = deploying, status description = The stream is being deployed.
19-Jun-2019 05:42:42 2019-06-19 05:42:42.303  INFO 23900 --- [           main] o.s.c.d.acceptance.test.WoodChuckTests   : Sleeping to check status of Stream=WOODCHUCK-TEST
19-Jun-2019 05:42:52 2019-06-19 05:42:52.365  INFO 23900 --- [           main] o.s.c.d.acceptance.test.WoodChuckTests   : Checking: Stream=WOODCHUCK-TEST, status = deployed, status description = The stream has been successfully deployed
19-Jun-2019 05:42:52 2019-06-19 05:42:52.415  INFO 23900 --- [           main] o.s.c.d.acceptance.test.WoodChuckTests   : Sleeping to check status of Stream=WOODCHUCK-TEST
19-Jun-2019 05:43:02 2019-06-19 05:43:02.416  INFO 23900 --- [           main] o.s.c.d.acceptance.test.WoodChuckTests   : Stream 'WOODCHUCK-TEST' started with status: deployed
19-Jun-2019 05:43:02 2019-06-19 05:43:02.416  INFO 23900 --- [           main] o.s.c.d.acceptance.test.WoodChuckTests   : App 'log' has instances: {WOODCHUCK-TEST.log-v1-0=http://10.194.6.129:47190, WOODCHUCK-TEST.log-v1-1=http://10.194.6.129:42007}
19-Jun-2019 05:43:02 2019-06-19 05:43:02.416  INFO 23900 --- [           main] o.s.c.d.acceptance.test.WoodChuckTests   : App 'http' has instances: {WOODCHUCK-TEST.http-v1-0=http://10.194.6.129:51201}
19-Jun-2019 05:43:02 2019-06-19 05:43:02.416  INFO 23900 --- [           main] o.s.c.d.acceptance.test.WoodChuckTests   : App 'splitter' has instances: {WOODCHUCK-TEST.splitter-v1-0=http://10.194.6.129:41946}
19-Jun-2019 05:43:02 2019-06-19 05:43:02.416  INFO 23900 --- [           main] o.s.c.d.acceptance.test.WoodChuckTests   : Looking for 'Started HttpSource' in logfile for http
19-Jun-2019 05:43:12 2019-06-19 05:43:12.417  INFO 23900 --- [           main] o.s.c.d.acceptance.test.WoodChuckTests   : Requesting log for app WOODCHUCK-TEST.http-v1-0
19-Jun-2019 05:43:12 2019-06-19 05:43:12.544  INFO 23900 --- [           main] o.s.c.d.acceptance.test.WoodChuckTests   : Retrieved logfile from 'http://10.194.6.129:51201/actuator/logfile
19-Jun-2019 05:43:12 2019-06-19 05:43:12.548  INFO 23900 --- [           main] o.s.c.d.acceptance.test.WoodChuckTests   : Matched all 'Started HttpSource' in logfile for app http (source WOODCHUCK-TEST.http-v1-0)
19-Jun-2019 05:43:12 2019-06-19 05:43:12.548  INFO 23900 --- [           main] o.s.c.d.acceptance.test.WoodChuckTests   : Looking for 'Started SplitterProcessor' in logfile for splitter
19-Jun-2019 05:43:22 2019-06-19 05:43:22.548  INFO 23900 --- [           main] o.s.c.d.acceptance.test.WoodChuckTests   : Requesting log for app WOODCHUCK-TEST.splitter-v1-0
19-Jun-2019 05:43:22 2019-06-19 05:43:22.717  INFO 23900 --- [           main] o.s.c.d.acceptance.test.WoodChuckTests   : Retrieved logfile from 'http://10.194.6.129:41946/actuator/logfile
19-Jun-2019 05:43:22 2019-06-19 05:43:22.718  INFO 23900 --- [           main] o.s.c.d.acceptance.test.WoodChuckTests   : Matched all 'Started SplitterProcessor' in logfile for app splitter (source WOODCHUCK-TEST.splitter-v1-0)
19-Jun-2019 05:43:22 2019-06-19 05:43:22.718  INFO 23900 --- [           main] o.s.c.d.acceptance.test.WoodChuckTests   : Looking for 'Started LogSink' in logfile for log
19-Jun-2019 05:43:32 2019-06-19 05:43:32.718  INFO 23900 --- [           main] o.s.c.d.acceptance.test.WoodChuckTests   : Requesting log for app WOODCHUCK-TEST.log-v1-0
19-Jun-2019 05:43:32 2019-06-19 05:43:32.870  INFO 23900 --- [           main] o.s.c.d.acceptance.test.WoodChuckTests   : Retrieved logfile from 'http://10.194.6.129:47190/actuator/logfile
19-Jun-2019 05:43:32 2019-06-19 05:43:32.870  INFO 23900 --- [           main] o.s.c.d.acceptance.test.WoodChuckTests   : Requesting log for app WOODCHUCK-TEST.log-v1-1
19-Jun-2019 05:43:33 2019-06-19 05:43:33.010  INFO 23900 --- [           main] o.s.c.d.acceptance.test.WoodChuckTests   : Retrieved logfile from 'http://10.194.6.129:42007/actuator/logfile
19-Jun-2019 05:43:33 2019-06-19 05:43:33.010  INFO 23900 --- [           main] o.s.c.d.acceptance.test.WoodChuckTests   : Matched all 'Started LogSink' in logfile for app log (source WOODCHUCK-TEST.log-v1-0)
19-Jun-2019 05:43:33 2019-06-19 05:43:33.117  INFO 23900 --- [           main] o.s.c.d.acceptance.test.WoodChuckTests   : Looking for 'WOODCHUCK-0,How,chuck' in logfile for log
19-Jun-2019 05:43:43 2019-06-19 05:43:43.118  INFO 23900 --- [           main] o.s.c.d.acceptance.test.WoodChuckTests   : Requesting log for app WOODCHUCK-TEST.log-v1-0
19-Jun-2019 05:43:43 2019-06-19 05:43:43.128  INFO 23900 --- [           main] o.s.c.d.acceptance.test.WoodChuckTests   : Retrieved logfile from 'http://10.194.6.129:47190/actuator/logfile
19-Jun-2019 05:43:43 2019-06-19 05:43:43.128  INFO 23900 --- [           main] o.s.c.d.acceptance.test.WoodChuckTests   : Requesting log for app WOODCHUCK-TEST.log-v1-1
19-Jun-2019 05:43:43 2019-06-19 05:43:43.140  INFO 23900 --- [           main] o.s.c.d.acceptance.test.WoodChuckTests   : Retrieved logfile from 'http://10.194.6.129:42007/actuator/logfile
19-Jun-2019 05:43:43 2019-06-19 05:43:43.140  INFO 23900 --- [           main] o.s.c.d.acceptance.test.WoodChuckTests   : Matched all 'WOODCHUCK-0,How,chuck' in logfile for app log (source WOODCHUCK-TEST.log-v1-0)
19-Jun-2019 05:43:43 2019-06-19 05:43:43.141  INFO 23900 --- [           main] o.s.c.d.acceptance.test.WoodChuckTests   : Looking for 'WOODCHUCK-1,much,wood,would,if,a,woodchuck,could' in logfile for log
19-Jun-2019 05:43:53 2019-06-19 05:43:53.141  INFO 23900 --- [           main] o.s.c.d.acceptance.test.WoodChuckTests   : Requesting log for app WOODCHUCK-TEST.log-v1-0
19-Jun-2019 05:43:53 2019-06-19 05:43:53.148  INFO 23900 --- [           main] o.s.c.d.acceptance.test.WoodChuckTests   : Retrieved logfile from 'http://10.194.6.129:47190/actuator/logfile
19-Jun-2019 05:43:53 2019-06-19 05:43:53.148  INFO 23900 --- [           main] o.s.c.d.acceptance.test.WoodChuckTests   : Requesting log for app WOODCHUCK-TEST.log-v1-1
19-Jun-2019 05:43:53 2019-06-19 05:43:53.157  INFO 23900 --- [           main] o.s.c.d.acceptance.test.WoodChuckTests   : Retrieved logfile from 'http://10.194.6.129:42007/actuator/logfile
19-Jun-2019 05:43:53 2019-06-19 05:43:53.158  INFO 23900 --- [           main] o.s.c.d.acceptance.test.WoodChuckTests   : Matched all 'WOODCHUCK-1,much,wood,would,if,a,woodchuck,could' in logfile for app log (source WOODCHUCK-TEST.log-v1-1)
19-Jun-2019 05:43:53 2019-06-19 05:43:53.159  INFO 23900 --- [           main] junit.logTestName                        : Test testPartitioning(org.springframework.cloud.dataflow.acceptance.test.WoodChuckTests) Succeeded
19-Jun-2019 05:43:53 2019-06-19 05:43:53.159  INFO 23900 --- [           main] junit.logTestName                        : Finished Test testPartitioning(org.springframework.cloud.dataflow.acceptance.test.WoodChuckTests)
19-Jun-2019 05:43:53 2019-06-19 05:43:53.159  INFO 23900 --- [           main] o.s.c.d.acceptance.test.WoodChuckTests   : Destroy all streams
19-Jun-2019 05:43:53 Tests run: 1, Failures: 0, Errors: 0, Skipped: 0, Time elapsed: 102.793 sec - in org.springframework.cloud.dataflow.acceptance.test.WoodChuckTests
19-Jun-2019 05:43:53 Running org.springframework.cloud.dataflow.acceptance.test.HttpSourceTests
19-Jun-2019 05:43:53 2019-06-19 05:43:53.759  INFO 23900 --- [           main] .b.t.c.SpringBootTestContextBootstrapper : Neither @ContextConfiguration nor @ContextHierarchy found for test class [org.springframework.cloud.dataflow.acceptance.test.HttpSourceTests], using SpringBootContextLoader
19-Jun-2019 05:43:53 2019-06-19 05:43:53.765  INFO 23900 --- [           main] .b.t.c.SpringBootTestContextBootstrapper : Loaded default TestExecutionListener class names from location [META-INF/spring.factories]: [org.springframework.boot.test.mock.mockito.MockitoTestExecutionListener, org.springframework.boot.test.mock.mockito.ResetMocksTestExecutionListener, org.springframework.boot.test.autoconfigure.restdocs.RestDocsTestExecutionListener, org.springframework.boot.test.autoconfigure.web.client.MockRestServiceServerResetTestExecutionListener, org.springframework.boot.test.autoconfigure.web.servlet.MockMvcPrintOnlyOnFailureTestExecutionListener, org.springframework.boot.test.autoconfigure.web.servlet.WebDriverTestExecutionListener, org.springframework.test.context.web.ServletTestExecutionListener, org.springframework.test.context.support.DirtiesContextBeforeModesTestExecutionListener, org.springframework.test.context.support.DependencyInjectionTestExecutionListener, org.springframework.test.context.support.DirtiesContextTestExecutionListener, org.springframework.test.context.transaction.TransactionalTestExecutionListener, org.springframework.test.context.jdbc.SqlScriptsTestExecutionListener]
19-Jun-2019 05:43:53 2019-06-19 05:43:53.767  INFO 23900 --- [           main] .b.t.c.SpringBootTestContextBootstrapper : Using TestExecutionListeners: [org.springframework.test.context.web.ServletTestExecutionListener@7b306b9f, org.springframework.test.context.support.DirtiesContextBeforeModesTestExecutionListener@142213d5, org.springframework.boot.test.autoconfigure.SpringBootDependencyInjectionTestExecutionListener@934b52f, org.springframework.test.context.support.DirtiesContextTestExecutionListener@2630dbc4, org.springframework.test.context.transaction.TransactionalTestExecutionListener@5ea4300e, org.springframework.test.context.jdbc.SqlScriptsTestExecutionListener@5a1c3cb4, org.springframework.boot.test.mock.mockito.MockitoTestExecutionListener@76ad6715, org.springframework.boot.test.autoconfigure.web.servlet.MockMvcPrintOnlyOnFailureTestExecutionListener@56637cff, org.springframework.boot.test.autoconfigure.web.client.MockRestServiceServerResetTestExecutionListener@2938127d, org.springframework.boot.test.mock.mockito.ResetMocksTestExecutionListener@127a7272, org.springframework.boot.test.autoconfigure.web.servlet.WebDriverTestExecutionListener@ff23ae7, org.springframework.boot.test.autoconfigure.restdocs.RestDocsTestExecutionListener@423b2b62]
19-Jun-2019 05:43:53 2019-06-19 05:43:53.874  INFO 23900 --- [           main] junit.logTestName                        : Starting Test httpSourceTests(org.springframework.cloud.dataflow.acceptance.test.HttpSourceTests)
19-Jun-2019 05:43:53 2019-06-19 05:43:53.875  INFO 23900 --- [           main] o.s.c.d.acceptance.test.HttpSourceTests  : Creating stream 'HTTP-TEST'
19-Jun-2019 05:43:53 2019-06-19 05:43:53.912  INFO 23900 --- [           main] o.s.c.d.acceptance.test.HttpSourceTests  : Deploying stream 'HTTP-TEST' with properties: {app.*.spring.cloud.streamapp.security.enabled=false, app.*.logging.file=${PID}-test.log, app.*.endpoints.logfile.sensitive=false, app.*.management.endpoints.web.exposure.include=*}
19-Jun-2019 05:43:54 2019-06-19 05:43:54.748  INFO 23900 --- [           main] o.s.c.d.acceptance.test.HttpSourceTests  : Checking: Stream=HTTP-TEST, status = deploying, status description = The stream is being deployed.
19-Jun-2019 05:43:54 2019-06-19 05:43:54.749  INFO 23900 --- [           main] o.s.c.d.acceptance.test.HttpSourceTests  : Sleeping to check status of Stream=HTTP-TEST
19-Jun-2019 05:44:04 2019-06-19 05:44:04.815  INFO 23900 --- [           main] o.s.c.d.acceptance.test.HttpSourceTests  : Checking: Stream=HTTP-TEST, status = deploying, status description = The stream is being deployed.
19-Jun-2019 05:44:04 2019-06-19 05:44:04.815  INFO 23900 --- [           main] o.s.c.d.acceptance.test.HttpSourceTests  : Sleeping to check status of Stream=HTTP-TEST
19-Jun-2019 05:44:14 2019-06-19 05:44:14.858  INFO 23900 --- [           main] o.s.c.d.acceptance.test.HttpSourceTests  : Checking: Stream=HTTP-TEST, status = deployed, status description = The stream has been successfully deployed
19-Jun-2019 05:44:14 2019-06-19 05:44:14.908  INFO 23900 --- [           main] o.s.c.d.acceptance.test.HttpSourceTests  : Sleeping to check status of Stream=HTTP-TEST
19-Jun-2019 05:44:24 2019-06-19 05:44:24.909  INFO 23900 --- [           main] o.s.c.d.acceptance.test.HttpSourceTests  : Stream 'HTTP-TEST' started with status: deployed
19-Jun-2019 05:44:24 2019-06-19 05:44:24.909  INFO 23900 --- [           main] o.s.c.d.acceptance.test.HttpSourceTests  : App 'log' has instances: {HTTP-TEST.log-v1-0=http://10.194.6.129:36857}
19-Jun-2019 05:44:24 2019-06-19 05:44:24.909  INFO 23900 --- [           main] o.s.c.d.acceptance.test.HttpSourceTests  : App 'http' has instances: {HTTP-TEST.http-v1-0=http://10.194.6.129:54845}
19-Jun-2019 05:44:24 2019-06-19 05:44:24.914  INFO 23900 --- [           main] o.s.c.d.acceptance.test.HttpSourceTests  : Looking for 'Started HttpSource' in logfile for http
19-Jun-2019 05:44:34 2019-06-19 05:44:34.915  INFO 23900 --- [           main] o.s.c.d.acceptance.test.HttpSourceTests  : Requesting log for app HTTP-TEST.http-v1-0
19-Jun-2019 05:44:35 2019-06-19 05:44:35.044  INFO 23900 --- [           main] o.s.c.d.acceptance.test.HttpSourceTests  : Retrieved logfile from 'http://10.194.6.129:54845/actuator/logfile
19-Jun-2019 05:44:35 2019-06-19 05:44:35.045  INFO 23900 --- [           main] o.s.c.d.acceptance.test.HttpSourceTests  : Matched all 'Started HttpSource' in logfile for app http (source HTTP-TEST.http-v1-0)
19-Jun-2019 05:44:35 2019-06-19 05:44:35.045  INFO 23900 --- [           main] o.s.c.d.acceptance.test.HttpSourceTests  : Looking for 'Started LogSink' in logfile for log
19-Jun-2019 05:44:45 2019-06-19 05:44:45.045  INFO 23900 --- [           main] o.s.c.d.acceptance.test.HttpSourceTests  : Requesting log for app HTTP-TEST.log-v1-0
19-Jun-2019 05:44:45 2019-06-19 05:44:45.186  INFO 23900 --- [           main] o.s.c.d.acceptance.test.HttpSourceTests  : Retrieved logfile from 'http://10.194.6.129:36857/actuator/logfile
19-Jun-2019 05:44:45 2019-06-19 05:44:45.186  INFO 23900 --- [           main] o.s.c.d.acceptance.test.HttpSourceTests  : Matched all 'Started LogSink' in logfile for app log (source HTTP-TEST.log-v1-0)
19-Jun-2019 05:44:45 2019-06-19 05:44:45.319  INFO 23900 --- [           main] o.s.c.d.acceptance.test.HttpSourceTests  : Looking for '997ffa44-a365-4e68-a8a1-5834010c6ce1' in logfile for log
19-Jun-2019 05:44:55 2019-06-19 05:44:55.319  INFO 23900 --- [           main] o.s.c.d.acceptance.test.HttpSourceTests  : Requesting log for app HTTP-TEST.log-v1-0
19-Jun-2019 05:44:55 2019-06-19 05:44:55.328  INFO 23900 --- [           main] o.s.c.d.acceptance.test.HttpSourceTests  : Retrieved logfile from 'http://10.194.6.129:36857/actuator/logfile
19-Jun-2019 05:44:55 2019-06-19 05:44:55.328  INFO 23900 --- [           main] o.s.c.d.acceptance.test.HttpSourceTests  : Matched all '997ffa44-a365-4e68-a8a1-5834010c6ce1' in logfile for app log (source HTTP-TEST.log-v1-0)
19-Jun-2019 05:44:55 2019-06-19 05:44:55.329  INFO 23900 --- [           main] junit.logTestName                        : Test httpSourceTests(org.springframework.cloud.dataflow.acceptance.test.HttpSourceTests) Succeeded
19-Jun-2019 05:44:55 2019-06-19 05:44:55.329  INFO 23900 --- [           main] junit.logTestName                        : Finished Test httpSourceTests(org.springframework.cloud.dataflow.acceptance.test.HttpSourceTests)
19-Jun-2019 05:44:55 2019-06-19 05:44:55.329  INFO 23900 --- [           main] o.s.c.d.acceptance.test.HttpSourceTests  : Destroy all streams
19-Jun-2019 05:44:55 Tests run: 1, Failures: 0, Errors: 0, Skipped: 0, Time elapsed: 61.823 sec - in org.springframework.cloud.dataflow.acceptance.test.HttpSourceTests
19-Jun-2019 05:44:55 Running org.springframework.cloud.dataflow.acceptance.test.TimestampTaskTests
19-Jun-2019 05:44:55 2019-06-19 05:44:55.605  INFO 23900 --- [           main] o.s.c.support.GenericApplicationContext  : Refreshing org.springframework.context.support.GenericApplicationContext@1afd72ef: startup date [Wed Jun 19 05:44:55 UTC 2019]; root of context hierarchy
19-Jun-2019 05:44:55 2019-06-19 05:44:55.754  INFO 23900 --- [           main] junit.logTestName                        : Starting Test timeStampTests(org.springframework.cloud.dataflow.acceptance.test.TimestampTaskTests)
19-Jun-2019 05:44:55 2019-06-19 05:44:55.755  INFO 23900 --- [           main] o.s.c.d.a.test.AbstractTaskTests         : Importing task apps from uri resource: https://dataflow.spring.io/task-maven-latest
19-Jun-2019 05:44:56 2019-06-19 05:44:56.312  INFO 23900 --- [           main] o.s.c.d.a.test.AbstractTaskTests         : Done importing task apps.
19-Jun-2019 05:45:08 2019-06-19 05:45:08.221  INFO 23900 --- [           main] junit.logTestName                        : Test timeStampTests(org.springframework.cloud.dataflow.acceptance.test.TimestampTaskTests) Succeeded
19-Jun-2019 05:45:08 2019-06-19 05:45:08.221  INFO 23900 --- [           main] junit.logTestName                        : Finished Test timeStampTests(org.springframework.cloud.dataflow.acceptance.test.TimestampTaskTests)
19-Jun-2019 05:45:08 2019-06-19 05:45:08.287  INFO 23900 --- [           main] junit.logTestName                        : Starting Test timeStampTestsMultipleLaunch(org.springframework.cloud.dataflow.acceptance.test.TimestampTaskTests)
19-Jun-2019 05:45:28 2019-06-19 05:45:28.744  INFO 23900 --- [           main] junit.logTestName                        : Test timeStampTestsMultipleLaunch(org.springframework.cloud.dataflow.acceptance.test.TimestampTaskTests) Succeeded
19-Jun-2019 05:45:28 2019-06-19 05:45:28.744  INFO 23900 --- [           main] junit.logTestName                        : Finished Test timeStampTestsMultipleLaunch(org.springframework.cloud.dataflow.acceptance.test.TimestampTaskTests)
19-Jun-2019 05:45:28 Tests run: 2, Failures: 0, Errors: 0, Skipped: 0, Time elapsed: 33.16 sec - in org.springframework.cloud.dataflow.acceptance.test.TimestampTaskTests
19-Jun-2019 05:45:28 Running org.springframework.cloud.dataflow.acceptance.test.TickTockTests
19-Jun-2019 05:45:28 2019-06-19 05:45:28.745  INFO 23900 --- [           main] .b.t.c.SpringBootTestContextBootstrapper : Neither @ContextConfiguration nor @ContextHierarchy found for test class [org.springframework.cloud.dataflow.acceptance.test.TickTockTests], using SpringBootContextLoader
19-Jun-2019 05:45:28 2019-06-19 05:45:28.750  INFO 23900 --- [           main] .b.t.c.SpringBootTestContextBootstrapper : Loaded default TestExecutionListener class names from location [META-INF/spring.factories]: [org.springframework.boot.test.mock.mockito.MockitoTestExecutionListener, org.springframework.boot.test.mock.mockito.ResetMocksTestExecutionListener, org.springframework.boot.test.autoconfigure.restdocs.RestDocsTestExecutionListener, org.springframework.boot.test.autoconfigure.web.client.MockRestServiceServerResetTestExecutionListener, org.springframework.boot.test.autoconfigure.web.servlet.MockMvcPrintOnlyOnFailureTestExecutionListener, org.springframework.boot.test.autoconfigure.web.servlet.WebDriverTestExecutionListener, org.springframework.test.context.web.ServletTestExecutionListener, org.springframework.test.context.support.DirtiesContextBeforeModesTestExecutionListener, org.springframework.test.context.support.DependencyInjectionTestExecutionListener, org.springframework.test.context.support.DirtiesContextTestExecutionListener, org.springframework.test.context.transaction.TransactionalTestExecutionListener, org.springframework.test.context.jdbc.SqlScriptsTestExecutionListener]
19-Jun-2019 05:45:28 2019-06-19 05:45:28.751  INFO 23900 --- [           main] .b.t.c.SpringBootTestContextBootstrapper : Using TestExecutionListeners: [org.springframework.test.context.web.ServletTestExecutionListener@f5b6e78, org.springframework.test.context.support.DirtiesContextBeforeModesTestExecutionListener@4b4eced1, org.springframework.boot.test.autoconfigure.SpringBootDependencyInjectionTestExecutionListener@71926a36, org.springframework.test.context.support.DirtiesContextTestExecutionListener@216e9ca3, org.springframework.test.context.transaction.TransactionalTestExecutionListener@75120e58, org.springframework.test.context.jdbc.SqlScriptsTestExecutionListener@48976e6d, org.springframework.boot.test.mock.mockito.MockitoTestExecutionListener@2a367e93, org.springframework.boot.test.autoconfigure.web.servlet.MockMvcPrintOnlyOnFailureTestExecutionListener@7f6874f2, org.springframework.boot.test.autoconfigure.web.client.MockRestServiceServerResetTestExecutionListener@1a6dc589, org.springframework.boot.test.mock.mockito.ResetMocksTestExecutionListener@697a34af, org.springframework.boot.test.autoconfigure.web.servlet.WebDriverTestExecutionListener@70211df5, org.springframework.boot.test.autoconfigure.restdocs.RestDocsTestExecutionListener@4c5228e7]
19-Jun-2019 05:45:28 2019-06-19 05:45:28.820  INFO 23900 --- [           main] junit.logTestName                        : Starting Test tickTockUpdateRollbackTests(org.springframework.cloud.dataflow.acceptance.test.TickTockTests)
19-Jun-2019 05:45:28 2019-06-19 05:45:28.844  INFO 23900 --- [           main] o.s.c.d.acceptance.test.TickTockTests    : Creating stream 'TICKTOCK'
19-Jun-2019 05:45:28 2019-06-19 05:45:28.872  INFO 23900 --- [           main] o.s.c.d.acceptance.test.TickTockTests    : Deploying stream 'TICKTOCK' with properties: {app.*.spring.cloud.streamapp.security.enabled=false, app.*.logging.file=${PID}-test.log, app.*.endpoints.logfile.sensitive=false, app.log.log.expression='TICKTOCK - TIMESTAMP: '.concat(payload), app.*.management.endpoints.web.exposure.include=*}
19-Jun-2019 05:45:31 2019-06-19 05:45:31.566  INFO 23900 --- [           main] o.s.c.d.acceptance.test.TickTockTests    : Checking: Stream=TICKTOCK, status = deploying, status description = The stream is being deployed.
19-Jun-2019 05:45:31 2019-06-19 05:45:31.567  INFO 23900 --- [           main] o.s.c.d.acceptance.test.TickTockTests    : Sleeping to check status of Stream=TICKTOCK
19-Jun-2019 05:45:41 2019-06-19 05:45:41.637  INFO 23900 --- [           main] o.s.c.d.acceptance.test.TickTockTests    : Checking: Stream=TICKTOCK, status = deploying, status description = The stream is being deployed.
19-Jun-2019 05:45:41 2019-06-19 05:45:41.637  INFO 23900 --- [           main] o.s.c.d.acceptance.test.TickTockTests    : Sleeping to check status of Stream=TICKTOCK
19-Jun-2019 05:45:51 2019-06-19 05:45:51.677  INFO 23900 --- [           main] o.s.c.d.acceptance.test.TickTockTests    : Checking: Stream=TICKTOCK, status = deployed, status description = The stream has been successfully deployed
19-Jun-2019 05:45:51 2019-06-19 05:45:51.738  INFO 23900 --- [           main] o.s.c.d.acceptance.test.TickTockTests    : Sleeping to check status of Stream=TICKTOCK
19-Jun-2019 05:46:01 2019-06-19 05:46:01.739  INFO 23900 --- [           main] o.s.c.d.acceptance.test.TickTockTests    : Stream 'TICKTOCK' started with status: deployed
19-Jun-2019 05:46:01 2019-06-19 05:46:01.739  INFO 23900 --- [           main] o.s.c.d.acceptance.test.TickTockTests    : App 'log' has instances: {TICKTOCK.log-v1-0=http://10.194.6.129:48896}
19-Jun-2019 05:46:01 2019-06-19 05:46:01.739  INFO 23900 --- [           main] o.s.c.d.acceptance.test.TickTockTests    : App 'time' has instances: {TICKTOCK.time-v1-0=http://10.194.6.129:43331}
19-Jun-2019 05:46:01 2019-06-19 05:46:01.739  INFO 23900 --- [           main] o.s.c.d.acceptance.test.TickTockTests    : Looking for 'Started TimeSource' in logfile for time
19-Jun-2019 05:46:11 2019-06-19 05:46:11.739  INFO 23900 --- [           main] o.s.c.d.acceptance.test.TickTockTests    : Requesting log for app TICKTOCK.time-v1-0
19-Jun-2019 05:46:11 2019-06-19 05:46:11.873  INFO 23900 --- [           main] o.s.c.d.acceptance.test.TickTockTests    : Retrieved logfile from 'http://10.194.6.129:43331/actuator/logfile
19-Jun-2019 05:46:11 2019-06-19 05:46:11.874  INFO 23900 --- [           main] o.s.c.d.acceptance.test.TickTockTests    : Matched all 'Started TimeSource' in logfile for app time (source TICKTOCK.time-v1-0)
19-Jun-2019 05:46:11 2019-06-19 05:46:11.874  INFO 23900 --- [           main] o.s.c.d.acceptance.test.TickTockTests    : Looking for 'Started LogSink' in logfile for log
19-Jun-2019 05:46:21 2019-06-19 05:46:21.874  INFO 23900 --- [           main] o.s.c.d.acceptance.test.TickTockTests    : Requesting log for app TICKTOCK.log-v1-0
19-Jun-2019 05:46:22 2019-06-19 05:46:22.052  INFO 23900 --- [           main] o.s.c.d.acceptance.test.TickTockTests    : Retrieved logfile from 'http://10.194.6.129:48896/actuator/logfile
19-Jun-2019 05:46:22 2019-06-19 05:46:22.052  INFO 23900 --- [           main] o.s.c.d.acceptance.test.TickTockTests    : Matched all 'Started LogSink' in logfile for app log (source TICKTOCK.log-v1-0)
19-Jun-2019 05:46:22 2019-06-19 05:46:22.052  INFO 23900 --- [           main] o.s.c.d.acceptance.test.TickTockTests    : Looking for 'TICKTOCK - TIMESTAMP:' in logfile for log
19-Jun-2019 05:46:32 2019-06-19 05:46:32.052  INFO 23900 --- [           main] o.s.c.d.acceptance.test.TickTockTests    : Requesting log for app TICKTOCK.log-v1-0
19-Jun-2019 05:46:32 2019-06-19 05:46:32.061  INFO 23900 --- [           main] o.s.c.d.acceptance.test.TickTockTests    : Retrieved logfile from 'http://10.194.6.129:48896/actuator/logfile
19-Jun-2019 05:46:32 2019-06-19 05:46:32.061  INFO 23900 --- [           main] o.s.c.d.acceptance.test.TickTockTests    : Matched all 'TICKTOCK - TIMESTAMP:' in logfile for app log (source TICKTOCK.log-v1-0)
19-Jun-2019 05:46:32 2019-06-19 05:46:32.062  INFO 23900 --- [           main] o.s.c.d.acceptance.test.TickTockTests    : Updating stream 'TICKTOCK'
19-Jun-2019 05:46:32 2019-06-19 05:46:32.792  INFO 23900 --- [           main] o.s.c.d.acceptance.test.TickTockTests    : Checking: Stream=TICKTOCK, status = deploying, status description = The stream is being deployed.
19-Jun-2019 05:46:32 2019-06-19 05:46:32.792  INFO 23900 --- [           main] o.s.c.d.acceptance.test.TickTockTests    : Sleeping to check status of Stream=TICKTOCK
19-Jun-2019 05:46:42 2019-06-19 05:46:42.837  INFO 23900 --- [           main] o.s.c.d.acceptance.test.TickTockTests    : Checking: Stream=TICKTOCK, status = deployed, status description = The stream has been successfully deployed
19-Jun-2019 05:46:42 2019-06-19 05:46:42.879  INFO 23900 --- [           main] o.s.c.d.acceptance.test.TickTockTests    : Sleeping to check status of Stream=TICKTOCK
19-Jun-2019 05:46:52 2019-06-19 05:46:52.879  INFO 23900 --- [           main] o.s.c.d.acceptance.test.TickTockTests    : Stream 'TICKTOCK' started with status: deployed
19-Jun-2019 05:46:52 2019-06-19 05:46:52.880  INFO 23900 --- [           main] o.s.c.d.acceptance.test.TickTockTests    : App 'log' has instances: {TICKTOCK.log-v1-0=http://10.194.6.129:48896, TICKTOCK.log-v2-0=http://10.194.6.129:54991}
19-Jun-2019 05:46:52 2019-06-19 05:46:52.880  INFO 23900 --- [           main] o.s.c.d.acceptance.test.TickTockTests    : App 'time' has instances: {TICKTOCK.time-v1-0=http://10.194.6.129:43331}
19-Jun-2019 05:46:52 2019-06-19 05:46:52.880  INFO 23900 --- [           main] o.s.c.d.acceptance.test.TickTockTests    : Looking for 'Started LogSink' in logfile for log
19-Jun-2019 05:47:02 2019-06-19 05:47:02.880  INFO 23900 --- [           main] o.s.c.d.acceptance.test.TickTockTests    : Requesting log for app TICKTOCK.log-v1-0
19-Jun-2019 05:47:02 2019-06-19 05:47:02.882  WARN 23900 --- [           main] o.s.c.d.acceptance.test.TickTockTests    : Error while trying to access logfile from 'http://10.194.6.129:48896/logfile' due to : org.springframework.web.client.ResourceAccessException: I/O error on GET request for "http://10.194.6.129:48896/logfile": Connection refused (Connection refused); nested exception is java.net.ConnectException: Connection refused (Connection refused)
19-Jun-2019 05:47:02 2019-06-19 05:47:02.882  INFO 23900 --- [           main] o.s.c.d.acceptance.test.TickTockTests    : Requesting log for app TICKTOCK.log-v2-0
19-Jun-2019 05:47:03 2019-06-19 05:47:03.026  INFO 23900 --- [           main] o.s.c.d.acceptance.test.TickTockTests    : Retrieved logfile from 'http://10.194.6.129:54991/actuator/logfile
19-Jun-2019 05:47:03 2019-06-19 05:47:03.026  INFO 23900 --- [           main] o.s.c.d.acceptance.test.TickTockTests    : Matched all 'Started LogSink' in logfile for app log (source TICKTOCK.log-v2-0)
19-Jun-2019 05:47:03 2019-06-19 05:47:03.026  INFO 23900 --- [           main] o.s.c.d.acceptance.test.TickTockTests    : Looking for 'TICKTOCK Updated - TIMESTAMP:' in logfile for log
19-Jun-2019 05:47:13 2019-06-19 05:47:13.026  INFO 23900 --- [           main] o.s.c.d.acceptance.test.TickTockTests    : Requesting log for app TICKTOCK.log-v1-0
19-Jun-2019 05:47:13 2019-06-19 05:47:13.028  WARN 23900 --- [           main] o.s.c.d.acceptance.test.TickTockTests    : Error while trying to access logfile from 'http://10.194.6.129:48896/logfile' due to : org.springframework.web.client.ResourceAccessException: I/O error on GET request for "http://10.194.6.129:48896/logfile": Connection refused (Connection refused); nested exception is java.net.ConnectException: Connection refused (Connection refused)
19-Jun-2019 05:47:13 2019-06-19 05:47:13.028  INFO 23900 --- [           main] o.s.c.d.acceptance.test.TickTockTests    : Requesting log for app TICKTOCK.log-v2-0
19-Jun-2019 05:47:13 2019-06-19 05:47:13.037  INFO 23900 --- [           main] o.s.c.d.acceptance.test.TickTockTests    : Retrieved logfile from 'http://10.194.6.129:54991/actuator/logfile
19-Jun-2019 05:47:13 2019-06-19 05:47:13.037  INFO 23900 --- [           main] o.s.c.d.acceptance.test.TickTockTests    : Matched all 'TICKTOCK Updated - TIMESTAMP:' in logfile for app log (source TICKTOCK.log-v2-0)
19-Jun-2019 05:47:13 2019-06-19 05:47:13.038  INFO 23900 --- [           main] o.s.c.d.acceptance.test.TickTockTests    : Rolling back the stream 'TICKTOCK' to the version 0
19-Jun-2019 05:47:13 2019-06-19 05:47:13.490  INFO 23900 --- [           main] o.s.c.d.acceptance.test.TickTockTests    : Checking: Stream=TICKTOCK, status = deploying, status description = The stream is being deployed.
19-Jun-2019 05:47:13 2019-06-19 05:47:13.490  INFO 23900 --- [           main] o.s.c.d.acceptance.test.TickTockTests    : Sleeping to check status of Stream=TICKTOCK
19-Jun-2019 05:47:23 2019-06-19 05:47:23.528  INFO 23900 --- [           main] o.s.c.d.acceptance.test.TickTockTests    : Checking: Stream=TICKTOCK, status = deployed, status description = The stream has been successfully deployed
19-Jun-2019 05:47:23 2019-06-19 05:47:23.569  INFO 23900 --- [           main] o.s.c.d.acceptance.test.TickTockTests    : Sleeping to check status of Stream=TICKTOCK
19-Jun-2019 05:47:33 2019-06-19 05:47:33.570  INFO 23900 --- [           main] o.s.c.d.acceptance.test.TickTockTests    : Stream 'TICKTOCK' started with status: deployed
19-Jun-2019 05:47:33 2019-06-19 05:47:33.570  INFO 23900 --- [           main] o.s.c.d.acceptance.test.TickTockTests    : App 'log' has instances: {TICKTOCK.log-v1-0=http://10.194.6.129:48896, TICKTOCK.log-v3-0=http://10.194.6.129:40702, TICKTOCK.log-v2-0=http://10.194.6.129:54991}
19-Jun-2019 05:47:33 2019-06-19 05:47:33.570  INFO 23900 --- [           main] o.s.c.d.acceptance.test.TickTockTests    : App 'time' has instances: {TICKTOCK.time-v1-0=http://10.194.6.129:43331}
19-Jun-2019 05:47:33 2019-06-19 05:47:33.570  INFO 23900 --- [           main] o.s.c.d.acceptance.test.TickTockTests    : Looking for 'TICKTOCK - TIMESTAMP:' in logfile for log
19-Jun-2019 05:47:43 2019-06-19 05:47:43.570  INFO 23900 --- [           main] o.s.c.d.acceptance.test.TickTockTests    : Requesting log for app TICKTOCK.log-v1-0
19-Jun-2019 05:47:43 2019-06-19 05:47:43.572  WARN 23900 --- [           main] o.s.c.d.acceptance.test.TickTockTests    : Error while trying to access logfile from 'http://10.194.6.129:48896/logfile' due to : org.springframework.web.client.ResourceAccessException: I/O error on GET request for "http://10.194.6.129:48896/logfile": Connection refused (Connection refused); nested exception is java.net.ConnectException: Connection refused (Connection refused)
19-Jun-2019 05:47:43 2019-06-19 05:47:43.572  INFO 23900 --- [           main] o.s.c.d.acceptance.test.TickTockTests    : Requesting log for app TICKTOCK.log-v3-0
19-Jun-2019 05:47:43 2019-06-19 05:47:43.713  INFO 23900 --- [           main] o.s.c.d.acceptance.test.TickTockTests    : Retrieved logfile from 'http://10.194.6.129:40702/actuator/logfile
19-Jun-2019 05:47:43 2019-06-19 05:47:43.713  INFO 23900 --- [           main] o.s.c.d.acceptance.test.TickTockTests    : Requesting log for app TICKTOCK.log-v2-0
19-Jun-2019 05:47:43 2019-06-19 05:47:43.714  WARN 23900 --- [           main] o.s.c.d.acceptance.test.TickTockTests    : Error while trying to access logfile from 'http://10.194.6.129:54991/logfile' due to : org.springframework.web.client.ResourceAccessException: I/O error on GET request for "http://10.194.6.129:54991/logfile": Connection refused (Connection refused); nested exception is java.net.ConnectException: Connection refused (Connection refused)
19-Jun-2019 05:47:43 2019-06-19 05:47:43.714  INFO 23900 --- [           main] o.s.c.d.acceptance.test.TickTockTests    : Matched all 'TICKTOCK - TIMESTAMP:' in logfile for app log (source TICKTOCK.log-v3-0)
19-Jun-2019 05:47:43 2019-06-19 05:47:43.716  INFO 23900 --- [           main] junit.logTestName                        : Test tickTockUpdateRollbackTests(org.springframework.cloud.dataflow.acceptance.test.TickTockTests) Succeeded
19-Jun-2019 05:47:43 2019-06-19 05:47:43.716  INFO 23900 --- [           main] junit.logTestName                        : Finished Test tickTockUpdateRollbackTests(org.springframework.cloud.dataflow.acceptance.test.TickTockTests)
19-Jun-2019 05:47:43 2019-06-19 05:47:43.716  INFO 23900 --- [           main] o.s.c.d.acceptance.test.TickTockTests    : Destroy all streams
19-Jun-2019 05:47:44 2019-06-19 05:47:44.047  INFO 23900 --- [           main] junit.logTestName                        : Starting Test tickTockTests(org.springframework.cloud.dataflow.acceptance.test.TickTockTests)
19-Jun-2019 05:47:44 2019-06-19 05:47:44.048  INFO 23900 --- [           main] o.s.c.d.acceptance.test.TickTockTests    : Creating stream 'TICKTOCK'
19-Jun-2019 05:47:44 2019-06-19 05:47:44.099  INFO 23900 --- [           main] o.s.c.d.acceptance.test.TickTockTests    : Deploying stream 'TICKTOCK' with properties: {app.*.spring.cloud.streamapp.security.enabled=false, app.*.logging.file=${PID}-test.log, app.*.endpoints.logfile.sensitive=false, app.log.log.expression='TICKTOCK - TIMESTAMP: '.concat(payload), app.*.management.endpoints.web.exposure.include=*}
19-Jun-2019 05:47:44 2019-06-19 05:47:44.661  INFO 23900 --- [           main] o.s.c.d.acceptance.test.TickTockTests    : Checking: Stream=TICKTOCK, status = deploying, status description = The stream is being deployed.
19-Jun-2019 05:47:44 2019-06-19 05:47:44.661  INFO 23900 --- [           main] o.s.c.d.acceptance.test.TickTockTests    : Sleeping to check status of Stream=TICKTOCK
19-Jun-2019 05:47:54 2019-06-19 05:47:54.738  INFO 23900 --- [           main] o.s.c.d.acceptance.test.TickTockTests    : Checking: Stream=TICKTOCK, status = deploying, status description = The stream is being deployed.
19-Jun-2019 05:47:54 2019-06-19 05:47:54.738  INFO 23900 --- [           main] o.s.c.d.acceptance.test.TickTockTests    : Sleeping to check status of Stream=TICKTOCK
19-Jun-2019 05:48:04 2019-06-19 05:48:04.779  INFO 23900 --- [           main] o.s.c.d.acceptance.test.TickTockTests    : Checking: Stream=TICKTOCK, status = deployed, status description = The stream has been successfully deployed
19-Jun-2019 05:48:04 2019-06-19 05:48:04.816  INFO 23900 --- [           main] o.s.c.d.acceptance.test.TickTockTests    : Sleeping to check status of Stream=TICKTOCK
19-Jun-2019 05:48:14 2019-06-19 05:48:14.817  INFO 23900 --- [           main] o.s.c.d.acceptance.test.TickTockTests    : Stream 'TICKTOCK' started with status: deployed
19-Jun-2019 05:48:14 2019-06-19 05:48:14.817  INFO 23900 --- [           main] o.s.c.d.acceptance.test.TickTockTests    : App 'log' has instances: {TICKTOCK.log-v4-0=http://10.194.6.129:38919}
19-Jun-2019 05:48:14 2019-06-19 05:48:14.817  INFO 23900 --- [           main] o.s.c.d.acceptance.test.TickTockTests    : App 'time' has instances: {TICKTOCK.time-v4-0=http://10.194.6.129:58393}
19-Jun-2019 05:48:14 2019-06-19 05:48:14.817  INFO 23900 --- [           main] o.s.c.d.acceptance.test.TickTockTests    : Looking for 'Started TimeSource' in logfile for time
19-Jun-2019 05:48:24 2019-06-19 05:48:24.817  INFO 23900 --- [           main] o.s.c.d.acceptance.test.TickTockTests    : Requesting log for app TICKTOCK.time-v4-0
19-Jun-2019 05:48:24 2019-06-19 05:48:24.934  INFO 23900 --- [           main] o.s.c.d.acceptance.test.TickTockTests    : Retrieved logfile from 'http://10.194.6.129:58393/actuator/logfile
19-Jun-2019 05:48:24 2019-06-19 05:48:24.935  INFO 23900 --- [           main] o.s.c.d.acceptance.test.TickTockTests    : Matched all 'Started TimeSource' in logfile for app time (source TICKTOCK.time-v4-0)
19-Jun-2019 05:48:24 2019-06-19 05:48:24.935  INFO 23900 --- [           main] o.s.c.d.acceptance.test.TickTockTests    : Looking for 'Started LogSink' in logfile for log
19-Jun-2019 05:48:34 2019-06-19 05:48:34.935  INFO 23900 --- [           main] o.s.c.d.acceptance.test.TickTockTests    : Requesting log for app TICKTOCK.log-v4-0
19-Jun-2019 05:48:35 2019-06-19 05:48:35.065  INFO 23900 --- [           main] o.s.c.d.acceptance.test.TickTockTests    : Retrieved logfile from 'http://10.194.6.129:38919/actuator/logfile
19-Jun-2019 05:48:35 2019-06-19 05:48:35.066  INFO 23900 --- [           main] o.s.c.d.acceptance.test.TickTockTests    : Matched all 'Started LogSink' in logfile for app log (source TICKTOCK.log-v4-0)
19-Jun-2019 05:48:35 2019-06-19 05:48:35.066  INFO 23900 --- [           main] o.s.c.d.acceptance.test.TickTockTests    : Looking for 'TICKTOCK - TIMESTAMP:' in logfile for log
19-Jun-2019 05:48:45 2019-06-19 05:48:45.066  INFO 23900 --- [           main] o.s.c.d.acceptance.test.TickTockTests    : Requesting log for app TICKTOCK.log-v4-0
19-Jun-2019 05:48:45 2019-06-19 05:48:45.075  INFO 23900 --- [           main] o.s.c.d.acceptance.test.TickTockTests    : Retrieved logfile from 'http://10.194.6.129:38919/actuator/logfile
19-Jun-2019 05:48:45 2019-06-19 05:48:45.076  INFO 23900 --- [           main] o.s.c.d.acceptance.test.TickTockTests    : Matched all 'TICKTOCK - TIMESTAMP:' in logfile for app log (source TICKTOCK.log-v4-0)
19-Jun-2019 05:48:45 2019-06-19 05:48:45.077  INFO 23900 --- [           main] junit.logTestName                        : Test tickTockTests(org.springframework.cloud.dataflow.acceptance.test.TickTockTests) Succeeded
19-Jun-2019 05:48:45 2019-06-19 05:48:45.077  INFO 23900 --- [           main] junit.logTestName                        : Finished Test tickTockTests(org.springframework.cloud.dataflow.acceptance.test.TickTockTests)
19-Jun-2019 05:48:45 2019-06-19 05:48:45.077  INFO 23900 --- [           main] o.s.c.d.acceptance.test.TickTockTests    : Destroy all streams
19-Jun-2019 05:48:45 Tests run: 3, Failures: 0, Errors: 0, Skipped: 1, Time elapsed: 196.564 sec - in org.springframework.cloud.dataflow.acceptance.test.TickTockTests
19-Jun-2019 05:48:45 Running org.springframework.cloud.dataflow.acceptance.test.ComposedTaskTests
19-Jun-2019 05:48:45 2019-06-19 05:48:45.386  INFO 23900 --- [           main] junit.logTestName                        : Starting Test ctrMultipleLaunch(org.springframework.cloud.dataflow.acceptance.test.ComposedTaskTests)
19-Jun-2019 05:49:48 2019-06-19 05:49:48.003  INFO 23900 --- [           main] junit.logTestName                        : Test ctrMultipleLaunch(org.springframework.cloud.dataflow.acceptance.test.ComposedTaskTests) Succeeded
19-Jun-2019 05:49:48 2019-06-19 05:49:48.004  INFO 23900 --- [           main] junit.logTestName                        : Finished Test ctrMultipleLaunch(org.springframework.cloud.dataflow.acceptance.test.ComposedTaskTests)
19-Jun-2019 05:49:48 2019-06-19 05:49:48.054  INFO 23900 --- [           main] junit.logTestName                        : Starting Test ctrMultipleLaunchWithProperties(org.springframework.cloud.dataflow.acceptance.test.ComposedTaskTests)
19-Jun-2019 05:53:08 2019-06-19 05:53:08.613 ERROR 23900 --- [           main] junit.logTestName                        : !!! Test ctrMultipleLaunchWithProperties(org.springframework.cloud.dataflow.acceptance.test.ComposedTaskTests) Failed !!!
19-Jun-2019 05:53:08
19-Jun-2019 05:53:08 java.lang.AssertionError: null
19-Jun-2019 05:53:08         at org.junit.Assert.fail(Assert.java:86)
19-Jun-2019 05:53:08         at org.junit.Assert.assertTrue(Assert.java:41)
19-Jun-2019 05:53:08         at org.junit.Assert.assertTrue(Assert.java:52)
19-Jun-2019 05:53:08         at org.springframework.cloud.dataflow.acceptance.test.ComposedTaskTests.assertTaskExecutions(ComposedTaskTests.java:67)
19-Jun-2019 05:53:08         at org.springframework.cloud.dataflow.acceptance.test.ComposedTaskTests.ctrMultipleLaunchWithProperties(ComposedTaskTests.java:57)
19-Jun-2019 05:53:08         at sun.reflect.NativeMethodAccessorImpl.invoke0(Native Method)
19-Jun-2019 05:53:08         at sun.reflect.NativeMethodAccessorImpl.invoke(NativeMethodAccessorImpl.java:62)
19-Jun-2019 05:53:08         at sun.reflect.DelegatingMethodAccessorImpl.invoke(DelegatingMethodAccessorImpl.java:43)
19-Jun-2019 05:53:08         at java.lang.reflect.Method.invoke(Method.java:498)
19-Jun-2019 05:53:08         at org.junit.runners.model.FrameworkMethod$1.runReflectiveCall(FrameworkMethod.java:50)
19-Jun-2019 05:53:08         at org.junit.internal.runners.model.ReflectiveCallable.run(ReflectiveCallable.java:12)
19-Jun-2019 05:53:08         at org.junit.runners.model.FrameworkMethod.invokeExplosively(FrameworkMethod.java:47)
19-Jun-2019 05:53:08         at org.junit.internal.runners.statements.InvokeMethod.evaluate(InvokeMethod.java:17)
19-Jun-2019 05:53:08         at org.junit.internal.runners.statements.RunBefores.evaluate(RunBefores.java:26)
19-Jun-2019 05:53:08         at org.springframework.test.context.junit4.statements.RunBeforeTestMethodCallbacks.evaluate(RunBeforeTestMethodCallbacks.java:75)
19-Jun-2019 05:53:08         at org.junit.internal.runners.statements.RunAfters.evaluate(RunAfters.java:27)
19-Jun-2019 05:53:08         at org.springframework.test.context.junit4.statements.RunAfterTestMethodCallbacks.evaluate(RunAfterTestMethodCallbacks.java:86)
19-Jun-2019 05:53:08         at org.junit.rules.TestWatcher$1.evaluate(TestWatcher.java:55)
19-Jun-2019 05:53:08         at org.junit.rules.RunRules.evaluate(RunRules.java:20)
19-Jun-2019 05:53:08         at org.springframework.test.context.junit4.statements.SpringRepeat.evaluate(SpringRepeat.java:84)
19-Jun-2019 05:53:08         at org.junit.runners.ParentRunner.runLeaf(ParentRunner.java:325)
19-Jun-2019 05:53:08         at org.springframework.test.context.junit4.SpringJUnit4ClassRunner.runChild(SpringJUnit4ClassRunner.java:252)
19-Jun-2019 05:53:08         at org.springframework.test.context.junit4.SpringJUnit4ClassRunner.runChild(SpringJUnit4ClassRunner.java:94)
19-Jun-2019 05:53:08         at org.junit.runners.ParentRunner$3.run(ParentRunner.java:290)
19-Jun-2019 05:53:08         at org.junit.runners.ParentRunner$1.schedule(ParentRunner.java:71)
19-Jun-2019 05:53:08         at org.junit.runners.ParentRunner.runChildren(ParentRunner.java:288)
19-Jun-2019 05:53:08         at org.junit.runners.ParentRunner.access$000(ParentRunner.java:58)
19-Jun-2019 05:53:08         at org.junit.runners.ParentRunner$2.evaluate(ParentRunner.java:268)
19-Jun-2019 05:53:08         at org.springframework.test.context.junit4.statements.RunBeforeTestClassCallbacks.evaluate(RunBeforeTestClassCallbacks.java:61)
19-Jun-2019 05:53:08         at org.springframework.test.context.junit4.statements.RunAfterTestClassCallbacks.evaluate(RunAfterTestClassCallbacks.java:70)
19-Jun-2019 05:53:08         at org.junit.runners.ParentRunner.run(ParentRunner.java:363)
19-Jun-2019 05:53:08         at org.springframework.test.context.junit4.SpringJUnit4ClassRunner.run(SpringJUnit4ClassRunner.java:191)
19-Jun-2019 05:53:08         at org.apache.maven.surefire.junit4.JUnit4Provider.execute(JUnit4Provider.java:283)
19-Jun-2019 05:53:08         at org.apache.maven.surefire.junit4.JUnit4Provider.executeWithRerun(JUnit4Provider.java:173)
19-Jun-2019 05:53:08         at org.apache.maven.surefire.junit4.JUnit4Provider.executeTestSet(JUnit4Provider.java:153)
19-Jun-2019 05:53:08         at org.apache.maven.surefire.junit4.JUnit4Provider.invoke(JUnit4Provider.java:128)
19-Jun-2019 05:53:08         at org.apache.maven.surefire.booter.ForkedBooter.invokeProviderInSameClassLoader(ForkedBooter.java:203)
19-Jun-2019 05:53:08         at org.apache.maven.surefire.booter.ForkedBooter.runSuitesInProcess(ForkedBooter.java:155)
19-Jun-2019 05:53:08         at org.apache.maven.surefire.booter.ForkedBooter.main(ForkedBooter.java:103)
19-Jun-2019 05:53:08
19-Jun-2019 05:53:08 2019-06-19 05:53:08.623  INFO 23900 --- [           main] junit.logTestName                        : Finished Test ctrMultipleLaunchWithProperties(org.springframework.cloud.dataflow.acceptance.test.ComposedTaskTests)
19-Jun-2019 05:53:08 2019-06-19 05:53:08.685  INFO 23900 --- [           main] junit.logTestName                        : Starting Test ctrLaunch(org.springframework.cloud.dataflow.acceptance.test.ComposedTaskTests)
19-Jun-2019 05:53:59 2019-06-19 05:53:59.027  INFO 23900 --- [           main] junit.logTestName                        : Test ctrLaunch(org.springframework.cloud.dataflow.acceptance.test.ComposedTaskTests) Succeeded
19-Jun-2019 05:53:59 2019-06-19 05:53:59.028  INFO 23900 --- [           main] junit.logTestName                        : Finished Test ctrLaunch(org.springframework.cloud.dataflow.acceptance.test.ComposedTaskTests)
19-Jun-2019 05:53:59 Tests run: 3, Failures: 1, Errors: 0, Skipped: 0, Time elapsed: 313.718 sec <<< FAILURE! - in org.springframework.cloud.dataflow.acceptance.test.ComposedTaskTests
19-Jun-2019 05:53:59 ctrMultipleLaunchWithProperties(org.springframework.cloud.dataflow.acceptance.test.ComposedTaskTests)  Time elapsed: 200.572 sec  <<< FAILURE!
19-Jun-2019 05:53:59 java.lang.AssertionError: null
19-Jun-2019 05:53:59         at org.junit.Assert.fail(Assert.java:86)
19-Jun-2019 05:53:59         at org.junit.Assert.assertTrue(Assert.java:41)
19-Jun-2019 05:53:59         at org.junit.Assert.assertTrue(Assert.java:52)
19-Jun-2019 05:53:59         at org.springframework.cloud.dataflow.acceptance.test.ComposedTaskTests.assertTaskExecutions(ComposedTaskTests.java:67)
19-Jun-2019 05:53:59         at org.springframework.cloud.dataflow.acceptance.test.ComposedTaskTests.ctrMultipleLaunchWithProperties(ComposedTaskTests.java:57)
19-Jun-2019 05:53:59
19-Jun-2019 05:53:59 Running org.springframework.cloud.dataflow.acceptance.test.TransformTests
19-Jun-2019 05:53:59 2019-06-19 05:53:59.029  INFO 23900 --- [           main] .b.t.c.SpringBootTestContextBootstrapper : Neither @ContextConfiguration nor @ContextHierarchy found for test class [org.springframework.cloud.dataflow.acceptance.test.TransformTests], using SpringBootContextLoader
19-Jun-2019 05:53:59 2019-06-19 05:53:59.034  INFO 23900 --- [           main] .b.t.c.SpringBootTestContextBootstrapper : Loaded default TestExecutionListener class names from location [META-INF/spring.factories]: [org.springframework.boot.test.mock.mockito.MockitoTestExecutionListener, org.springframework.boot.test.mock.mockito.ResetMocksTestExecutionListener, org.springframework.boot.test.autoconfigure.restdocs.RestDocsTestExecutionListener, org.springframework.boot.test.autoconfigure.web.client.MockRestServiceServerResetTestExecutionListener, org.springframework.boot.test.autoconfigure.web.servlet.MockMvcPrintOnlyOnFailureTestExecutionListener, org.springframework.boot.test.autoconfigure.web.servlet.WebDriverTestExecutionListener, org.springframework.test.context.web.ServletTestExecutionListener, org.springframework.test.context.support.DirtiesContextBeforeModesTestExecutionListener, org.springframework.test.context.support.DependencyInjectionTestExecutionListener, org.springframework.test.context.support.DirtiesContextTestExecutionListener, org.springframework.test.context.transaction.TransactionalTestExecutionListener, org.springframework.test.context.jdbc.SqlScriptsTestExecutionListener]
19-Jun-2019 05:53:59 2019-06-19 05:53:59.037  INFO 23900 --- [           main] .b.t.c.SpringBootTestContextBootstrapper : Using TestExecutionListeners: [org.springframework.test.context.web.ServletTestExecutionListener@58015e56, org.springframework.test.context.support.DirtiesContextBeforeModesTestExecutionListener@4d3c6593, org.springframework.boot.test.autoconfigure.SpringBootDependencyInjectionTestExecutionListener@7426a448, org.springframework.test.context.support.DirtiesContextTestExecutionListener@516462cc, org.springframework.test.context.transaction.TransactionalTestExecutionListener@3456558, org.springframework.test.context.jdbc.SqlScriptsTestExecutionListener@2dfb885e, org.springframework.boot.test.mock.mockito.MockitoTestExecutionListener@6cbe7d4d, org.springframework.boot.test.autoconfigure.web.servlet.MockMvcPrintOnlyOnFailureTestExecutionListener@1e3e1014, org.springframework.boot.test.autoconfigure.web.client.MockRestServiceServerResetTestExecutionListener@3679d92e, org.springframework.boot.test.mock.mockito.ResetMocksTestExecutionListener@47b11ec7, org.springframework.boot.test.autoconfigure.web.servlet.WebDriverTestExecutionListener@58fa5769, org.springframework.boot.test.autoconfigure.restdocs.RestDocsTestExecutionListener@36aa52d2]
19-Jun-2019 05:53:59 2019-06-19 05:53:59.097  INFO 23900 --- [           main] junit.logTestName                        : Starting Test transformTests(org.springframework.cloud.dataflow.acceptance.test.TransformTests)
19-Jun-2019 05:53:59 2019-06-19 05:53:59.098  INFO 23900 --- [           main] o.s.c.d.acceptance.test.TransformTests   : Creating stream 'TRANSFORM-TEST'
19-Jun-2019 05:53:59 2019-06-19 05:53:59.135  INFO 23900 --- [           main] o.s.c.d.acceptance.test.TransformTests   : Deploying stream 'TRANSFORM-TEST' with properties: {app.*.spring.cloud.streamapp.security.enabled=false, app.*.logging.file=${PID}-test.log, app.*.endpoints.logfile.sensitive=false, app.*.management.endpoints.web.exposure.include=*}
19-Jun-2019 05:54:01 2019-06-19 05:54:01.756  INFO 23900 --- [           main] o.s.c.d.acceptance.test.TransformTests   : Checking: Stream=TRANSFORM-TEST, status = deploying, status description = The stream is being deployed.
19-Jun-2019 05:54:01 2019-06-19 05:54:01.757  INFO 23900 --- [           main] o.s.c.d.acceptance.test.TransformTests   : Sleeping to check status of Stream=TRANSFORM-TEST
19-Jun-2019 05:54:11 2019-06-19 05:54:11.831  INFO 23900 --- [           main] o.s.c.d.acceptance.test.TransformTests   : Checking: Stream=TRANSFORM-TEST, status = deploying, status description = The stream is being deployed.
19-Jun-2019 05:54:11 2019-06-19 05:54:11.831  INFO 23900 --- [           main] o.s.c.d.acceptance.test.TransformTests   : Sleeping to check status of Stream=TRANSFORM-TEST
19-Jun-2019 05:54:21 2019-06-19 05:54:21.866  INFO 23900 --- [           main] o.s.c.d.acceptance.test.TransformTests   : Checking: Stream=TRANSFORM-TEST, status = deployed, status description = The stream has been successfully deployed
19-Jun-2019 05:54:21 2019-06-19 05:54:21.928  INFO 23900 --- [           main] o.s.c.d.acceptance.test.TransformTests   : Sleeping to check status of Stream=TRANSFORM-TEST
19-Jun-2019 05:54:31 2019-06-19 05:54:31.928  INFO 23900 --- [           main] o.s.c.d.acceptance.test.TransformTests   : Stream 'TRANSFORM-TEST' started with status: deployed
19-Jun-2019 05:54:31 2019-06-19 05:54:31.928  INFO 23900 --- [           main] o.s.c.d.acceptance.test.TransformTests   : App 'transform' has instances: {TRANSFORM-TEST.transform-v1-0=http://10.194.6.129:56910}
19-Jun-2019 05:54:31 2019-06-19 05:54:31.928  INFO 23900 --- [           main] o.s.c.d.acceptance.test.TransformTests   : App 'log' has instances: {TRANSFORM-TEST.log-v1-0=http://10.194.6.129:55886}
19-Jun-2019 05:54:31 2019-06-19 05:54:31.928  INFO 23900 --- [           main] o.s.c.d.acceptance.test.TransformTests   : App 'http' has instances: {TRANSFORM-TEST.http-v1-0=http://10.194.6.129:36077}
19-Jun-2019 05:54:31 2019-06-19 05:54:31.928  INFO 23900 --- [           main] o.s.c.d.acceptance.test.TransformTests   : Looking for 'Started HttpSource' in logfile for http
19-Jun-2019 05:54:41 2019-06-19 05:54:41.929  INFO 23900 --- [           main] o.s.c.d.acceptance.test.TransformTests   : Requesting log for app TRANSFORM-TEST.http-v1-0
19-Jun-2019 05:54:42 2019-06-19 05:54:42.058  INFO 23900 --- [           main] o.s.c.d.acceptance.test.TransformTests   : Retrieved logfile from 'http://10.194.6.129:36077/actuator/logfile
19-Jun-2019 05:54:42 2019-06-19 05:54:42.058  INFO 23900 --- [           main] o.s.c.d.acceptance.test.TransformTests   : Matched all 'Started HttpSource' in logfile for app http (source TRANSFORM-TEST.http-v1-0)
19-Jun-2019 05:54:42 2019-06-19 05:54:42.160  INFO 23900 --- [           main] o.s.c.d.acceptance.test.TransformTests   : Looking for 'Started LogSink' in logfile for log
19-Jun-2019 05:54:52 2019-06-19 05:54:52.160  INFO 23900 --- [           main] o.s.c.d.acceptance.test.TransformTests   : Requesting log for app TRANSFORM-TEST.log-v1-0
19-Jun-2019 05:54:52 2019-06-19 05:54:52.306  INFO 23900 --- [           main] o.s.c.d.acceptance.test.TransformTests   : Retrieved logfile from 'http://10.194.6.129:55886/actuator/logfile
19-Jun-2019 05:54:52 2019-06-19 05:54:52.306  INFO 23900 --- [           main] o.s.c.d.acceptance.test.TransformTests   : Matched all 'Started LogSink' in logfile for app log (source TRANSFORM-TEST.log-v1-0)
19-Jun-2019 05:54:52 2019-06-19 05:54:52.306  INFO 23900 --- [           main] o.s.c.d.acceptance.test.TransformTests   : Looking for 'ABCDEFG' in logfile for log
19-Jun-2019 05:55:02 2019-06-19 05:55:02.306  INFO 23900 --- [           main] o.s.c.d.acceptance.test.TransformTests   : Requesting log for app TRANSFORM-TEST.log-v1-0
19-Jun-2019 05:55:02 2019-06-19 05:55:02.315  INFO 23900 --- [           main] o.s.c.d.acceptance.test.TransformTests   : Retrieved logfile from 'http://10.194.6.129:55886/actuator/logfile
19-Jun-2019 05:55:02 2019-06-19 05:55:02.315  INFO 23900 --- [           main] o.s.c.d.acceptance.test.TransformTests   : Matched all 'ABCDEFG' in logfile for app log (source TRANSFORM-TEST.log-v1-0)
19-Jun-2019 05:55:02 2019-06-19 05:55:02.316  INFO 23900 --- [           main] junit.logTestName                        : Test transformTests(org.springframework.cloud.dataflow.acceptance.test.TransformTests) Succeeded
19-Jun-2019 05:55:02 2019-06-19 05:55:02.317  INFO 23900 --- [           main] junit.logTestName                        : Finished Test transformTests(org.springframework.cloud.dataflow.acceptance.test.TransformTests)
19-Jun-2019 05:55:02 2019-06-19 05:55:02.317  INFO 23900 --- [           main] o.s.c.d.acceptance.test.TransformTests   : Destroy all streams
19-Jun-2019 05:55:02 Tests run: 1, Failures: 0, Errors: 0, Skipped: 0, Time elapsed: 63.636 sec - in org.springframework.cloud.dataflow.acceptance.test.TransformTests
19-Jun-2019 05:55:02 Running org.springframework.cloud.dataflow.acceptance.test.SchedulerTests
19-Jun-2019 05:55:02 2019-06-19 05:55:02.758  INFO 23900 --- [           main] s.c.a.AnnotationConfigApplicationContext : Refreshing org.springframework.context.annotation.AnnotationConfigApplicationContext@5584d9c6: startup date [Wed Jun 19 05:55:02 UTC 2019]; root of context hierarchy
19-Jun-2019 05:55:02 2019-06-19 05:55:02.780  INFO 23900 --- [           main] trationDelegate$BeanPostProcessorChecker : Bean 'configurationPropertiesRebinderAutoConfiguration' of type [class org.springframework.cloud.autoconfigure.ConfigurationPropertiesRebinderAutoConfiguration$$EnhancerBySpringCGLIB$$219d8b3d] is not eligible for getting processed by all BeanPostProcessors (for example: not eligible for auto-proxying)
19-Jun-2019 05:55:02
19-Jun-2019 05:55:02   .   ____          _            __ _ _
19-Jun-2019 05:55:02 /\\ / ___'_ __ _ _(_)_ __  __ _ \ \ \ \
19-Jun-2019 05:55:02 ( ( )\___ | '_ | '_| | '_ \/ _` | \ \ \ \
19-Jun-2019 05:55:02 \\/  ___)| |_)| | | | | || (_| |  ) ) ) )
19-Jun-2019 05:55:02   '  |____| .__|_| |_|_| |_\__, | / / / /
19-Jun-2019 05:55:02 =========|_|==============|___/=/_/_/_/
19-Jun-2019 05:55:02 :: Spring Boot ::        (v1.4.1.RELEASE)
19-Jun-2019 05:55:02
19-Jun-2019 05:55:02 2019-06-19 05:55:02.868  INFO 23900 --- [           main] c.c.c.ConfigServicePropertySourceLocator : Fetching config from server at: http://localhost:8888
19-Jun-2019 05:55:02 2019-06-19 05:55:02.871  WARN 23900 --- [           main] c.c.c.ConfigServicePropertySourceLocator : Could not locate PropertySource: I/O error on GET request for "http://localhost:8888//blah": Connection refused (Connection refused); nested exception is java.net.ConnectException: Connection refused (Connection refused)
19-Jun-2019 05:55:02 2019-06-19 05:55:02.872  INFO 23900 --- [           main] o.a.maven.surefire.booter.ForkedBooter   : The following profiles are active: blah
19-Jun-2019 05:55:02 2019-06-19 05:55:02.873  INFO 23900 --- [           main] s.c.a.AnnotationConfigApplicationContext : Refreshing org.springframework.context.annotation.AnnotationConfigApplicationContext@4a8ffd75: startup date [Wed Jun 19 05:55:02 UTC 2019]; parent: org.springframework.context.annotation.AnnotationConfigApplicationContext@5584d9c6
19-Jun-2019 05:55:02 2019-06-19 05:55:02.959  INFO 23900 --- [           main] o.a.maven.surefire.booter.ForkedBooter   : Started ForkedBooter in 0.28 seconds (JVM running for 776.527)
19-Jun-2019 05:55:02 2019-06-19 05:55:02.959  INFO 23900 --- [           main] s.c.a.AnnotationConfigApplicationContext : Closing org.springframework.context.annotation.AnnotationConfigApplicationContext@4a8ffd75: startup date [Wed Jun 19 05:55:02 UTC 2019]; parent: org.springframework.context.annotation.AnnotationConfigApplicationContext@5584d9c6
19-Jun-2019 05:55:02 2019-06-19 05:55:02.960 ERROR 23900 --- [           main] o.s.c.d.a.test.util.SchedulerRule        : SCHEDULER IS NOT AVAILABLE, SKIPPING TESTS
19-Jun-2019 05:55:02
19-Jun-2019 05:55:02 java.lang.IllegalArgumentException: no SchedulerOperations bean is available.  Skipping test.
19-Jun-2019 05:55:02         at org.springframework.util.Assert.notNull(Assert.java:115)
19-Jun-2019 05:55:02         at org.springframework.cloud.dataflow.acceptance.test.util.SchedulerRule.obtainResource(SchedulerRule.java:57)
19-Jun-2019 05:55:02         at org.springframework.cloud.scheduler.spi.junit.AbstractExternalResourceTestSupport.apply(AbstractExternalResourceTestSupport.java:58)
19-Jun-2019 05:55:02         at org.junit.rules.RunRules.applyAll(RunRules.java:26)
19-Jun-2019 05:55:02         at org.junit.rules.RunRules.<init>(RunRules.java:15)
19-Jun-2019 05:55:02         at org.junit.runners.ParentRunner.withClassRules(ParentRunner.java:245)
19-Jun-2019 05:55:02         at org.junit.runners.ParentRunner.classBlock(ParentRunner.java:194)
19-Jun-2019 05:55:02         at org.junit.runners.ParentRunner.run(ParentRunner.java:362)
19-Jun-2019 05:55:02         at org.springframework.test.context.junit4.SpringJUnit4ClassRunner.run(SpringJUnit4ClassRunner.java:191)
19-Jun-2019 05:55:02         at org.apache.maven.surefire.junit4.JUnit4Provider.execute(JUnit4Provider.java:283)
19-Jun-2019 05:55:02         at org.apache.maven.surefire.junit4.JUnit4Provider.executeWithRerun(JUnit4Provider.java:173)
19-Jun-2019 05:55:02         at org.apache.maven.surefire.junit4.JUnit4Provider.executeTestSet(JUnit4Provider.java:153)
19-Jun-2019 05:55:02         at org.apache.maven.surefire.junit4.JUnit4Provider.invoke(JUnit4Provider.java:128)
19-Jun-2019 05:55:02         at org.apache.maven.surefire.booter.ForkedBooter.invokeProviderInSameClassLoader(ForkedBooter.java:203)
19-Jun-2019 05:55:02         at org.apache.maven.surefire.booter.ForkedBooter.runSuitesInProcess(ForkedBooter.java:155)
19-Jun-2019 05:55:02         at org.apache.maven.surefire.booter.ForkedBooter.main(ForkedBooter.java:103)
19-Jun-2019 05:55:02
19-Jun-2019 05:55:02 Tests run: 1, Failures: 0, Errors: 0, Skipped: 1, Time elapsed: 0.29 sec - in org.springframework.cloud.dataflow.acceptance.test.SchedulerTests
19-Jun-2019 05:55:02 Running org.springframework.cloud.dataflow.acceptance.test.NamedChannelTests
19-Jun-2019 05:55:02 2019-06-19 05:55:02.967  INFO 23900 --- [           main] .b.t.c.SpringBootTestContextBootstrapper : Neither @ContextConfiguration nor @ContextHierarchy found for test class [org.springframework.cloud.dataflow.acceptance.test.NamedChannelTests], using SpringBootContextLoader
19-Jun-2019 05:55:02 2019-06-19 05:55:02.971  INFO 23900 --- [           main] .b.t.c.SpringBootTestContextBootstrapper : Loaded default TestExecutionListener class names from location [META-INF/spring.factories]: [org.springframework.boot.test.mock.mockito.MockitoTestExecutionListener, org.springframework.boot.test.mock.mockito.ResetMocksTestExecutionListener, org.springframework.boot.test.autoconfigure.restdocs.RestDocsTestExecutionListener, org.springframework.boot.test.autoconfigure.web.client.MockRestServiceServerResetTestExecutionListener, org.springframework.boot.test.autoconfigure.web.servlet.MockMvcPrintOnlyOnFailureTestExecutionListener, org.springframework.boot.test.autoconfigure.web.servlet.WebDriverTestExecutionListener, org.springframework.test.context.web.ServletTestExecutionListener, org.springframework.test.context.support.DirtiesContextBeforeModesTestExecutionListener, org.springframework.test.context.support.DependencyInjectionTestExecutionListener, org.springframework.test.context.support.DirtiesContextTestExecutionListener, org.springframework.test.context.transaction.TransactionalTestExecutionListener, org.springframework.test.context.jdbc.SqlScriptsTestExecutionListener]
19-Jun-2019 05:55:02 2019-06-19 05:55:02.973  INFO 23900 --- [           main] .b.t.c.SpringBootTestContextBootstrapper : Using TestExecutionListeners: [org.springframework.test.context.web.ServletTestExecutionListener@161dd92a, org.springframework.test.context.support.DirtiesContextBeforeModesTestExecutionListener@77c3c037, org.springframework.boot.test.autoconfigure.SpringBootDependencyInjectionTestExecutionListener@252744a1, org.springframework.test.context.support.DirtiesContextTestExecutionListener@10e5bf9c, org.springframework.test.context.transaction.TransactionalTestExecutionListener@68c9e023, org.springframework.test.context.jdbc.SqlScriptsTestExecutionListener@1624775, org.springframework.boot.test.mock.mockito.MockitoTestExecutionListener@1e7f19b4, org.springframework.boot.test.autoconfigure.web.servlet.MockMvcPrintOnlyOnFailureTestExecutionListener@235b4cb8, org.springframework.boot.test.autoconfigure.web.client.MockRestServiceServerResetTestExecutionListener@4346808, org.springframework.boot.test.mock.mockito.ResetMocksTestExecutionListener@17fede14, org.springframework.boot.test.autoconfigure.web.servlet.WebDriverTestExecutionListener@712ac7e6, org.springframework.boot.test.autoconfigure.restdocs.RestDocsTestExecutionListener@86d6bf7]
19-Jun-2019 05:55:03 2019-06-19 05:55:03.028  INFO 23900 --- [           main] junit.logTestName                        : Starting Test testDestination(org.springframework.cloud.dataflow.acceptance.test.NamedChannelTests)
19-Jun-2019 05:55:03 2019-06-19 05:55:03.030  INFO 23900 --- [           main] o.s.c.d.a.test.NamedChannelTests         : Creating stream 'LOG-DESTINATION-SINK'
19-Jun-2019 05:55:03 2019-06-19 05:55:03.054  INFO 23900 --- [           main] o.s.c.d.a.test.NamedChannelTests         : Deploying stream 'LOG-DESTINATION-SINK' with properties: {app.*.spring.cloud.streamapp.security.enabled=false, app.*.logging.file=${PID}-test.log, app.*.endpoints.logfile.sensitive=false, app.*.management.endpoints.web.exposure.include=*}
19-Jun-2019 05:55:03 2019-06-19 05:55:03.428  INFO 23900 --- [           main] o.s.c.d.a.test.NamedChannelTests         : Checking: Stream=LOG-DESTINATION-SINK, status = deploying, status description = The stream is being deployed.
19-Jun-2019 05:55:03 2019-06-19 05:55:03.428  INFO 23900 --- [           main] o.s.c.d.a.test.NamedChannelTests         : Sleeping to check status of Stream=LOG-DESTINATION-SINK
19-Jun-2019 05:55:13 2019-06-19 05:55:13.460  INFO 23900 --- [           main] o.s.c.d.a.test.NamedChannelTests         : Checking: Stream=LOG-DESTINATION-SINK, status = deployed, status description = The stream has been successfully deployed
19-Jun-2019 05:55:13 2019-06-19 05:55:13.503  INFO 23900 --- [           main] o.s.c.d.a.test.NamedChannelTests         : Sleeping to check status of Stream=LOG-DESTINATION-SINK
19-Jun-2019 05:55:23 2019-06-19 05:55:23.503  INFO 23900 --- [           main] o.s.c.d.a.test.NamedChannelTests         : Stream 'LOG-DESTINATION-SINK' started with status: deployed
19-Jun-2019 05:55:23 2019-06-19 05:55:23.504  INFO 23900 --- [           main] o.s.c.d.a.test.NamedChannelTests         : App 'log' has instances: {LOG-DESTINATION-SINK.log-v1-0=http://10.194.6.129:58743}
19-Jun-2019 05:55:23 2019-06-19 05:55:23.504  INFO 23900 --- [           main] o.s.c.d.a.test.NamedChannelTests         : Looking for 'Started LogSink' in logfile for log
19-Jun-2019 05:55:33 2019-06-19 05:55:33.504  INFO 23900 --- [           main] o.s.c.d.a.test.NamedChannelTests         : Requesting log for app LOG-DESTINATION-SINK.log-v1-0
19-Jun-2019 05:55:33 2019-06-19 05:55:33.632  INFO 23900 --- [           main] o.s.c.d.a.test.NamedChannelTests         : Retrieved logfile from 'http://10.194.6.129:58743/actuator/logfile
19-Jun-2019 05:55:33 2019-06-19 05:55:33.632  INFO 23900 --- [           main] o.s.c.d.a.test.NamedChannelTests         : Matched all 'Started LogSink' in logfile for app log (source LOG-DESTINATION-SINK.log-v1-0)
19-Jun-2019 05:55:33 2019-06-19 05:55:33.632  INFO 23900 --- [           main] o.s.c.d.a.test.NamedChannelTests         : Creating stream 'HTTP-DESTINATION-SOURCE'
19-Jun-2019 05:55:33 2019-06-19 05:55:33.657  INFO 23900 --- [           main] o.s.c.d.a.test.NamedChannelTests         : Deploying stream 'HTTP-DESTINATION-SOURCE' with properties: {app.*.spring.cloud.streamapp.security.enabled=false, app.*.logging.file=${PID}-test.log, app.*.endpoints.logfile.sensitive=false, app.*.management.endpoints.web.exposure.include=*}
19-Jun-2019 05:55:34 2019-06-19 05:55:34.094  INFO 23900 --- [           main] o.s.c.d.a.test.NamedChannelTests         : Checking: Stream=HTTP-DESTINATION-SOURCE, status = deploying, status description = The stream is being deployed.
19-Jun-2019 05:55:34 2019-06-19 05:55:34.095  INFO 23900 --- [           main] o.s.c.d.a.test.NamedChannelTests         : Sleeping to check status of Stream=HTTP-DESTINATION-SOURCE
19-Jun-2019 05:55:44 2019-06-19 05:55:44.145  INFO 23900 --- [           main] o.s.c.d.a.test.NamedChannelTests         : Checking: Stream=HTTP-DESTINATION-SOURCE, status = deployed, status description = The stream has been successfully deployed
19-Jun-2019 05:55:44 2019-06-19 05:55:44.178  INFO 23900 --- [           main] o.s.c.d.a.test.NamedChannelTests         : Sleeping to check status of Stream=HTTP-DESTINATION-SOURCE
19-Jun-2019 05:55:54 2019-06-19 05:55:54.178  INFO 23900 --- [           main] o.s.c.d.a.test.NamedChannelTests         : Stream 'HTTP-DESTINATION-SOURCE' started with status: deployed
19-Jun-2019 05:55:54 2019-06-19 05:55:54.178  INFO 23900 --- [           main] o.s.c.d.a.test.NamedChannelTests         : App 'http' has instances: {HTTP-DESTINATION-SOURCE.http-v1-0=http://10.194.6.129:32226}
19-Jun-2019 05:55:54 2019-06-19 05:55:54.178  INFO 23900 --- [           main] o.s.c.d.a.test.NamedChannelTests         : Looking for 'Started HttpSource' in logfile for http
19-Jun-2019 05:56:04 2019-06-19 05:56:04.179  INFO 23900 --- [           main] o.s.c.d.a.test.NamedChannelTests         : Requesting log for app HTTP-DESTINATION-SOURCE.http-v1-0
19-Jun-2019 05:56:04 2019-06-19 05:56:04.309  INFO 23900 --- [           main] o.s.c.d.a.test.NamedChannelTests         : Retrieved logfile from 'http://10.194.6.129:32226/actuator/logfile
19-Jun-2019 05:56:04 2019-06-19 05:56:04.309  INFO 23900 --- [           main] o.s.c.d.a.test.NamedChannelTests         : Matched all 'Started HttpSource' in logfile for app http (source HTTP-DESTINATION-SOURCE.http-v1-0)
19-Jun-2019 05:56:04 2019-06-19 05:56:04.440  INFO 23900 --- [           main] o.s.c.d.a.test.NamedChannelTests         : Looking for 'abcdefg' in logfile for log
19-Jun-2019 05:56:14 2019-06-19 05:56:14.440  INFO 23900 --- [           main] o.s.c.d.a.test.NamedChannelTests         : Requesting log for app LOG-DESTINATION-SINK.log-v1-0
19-Jun-2019 05:56:14 2019-06-19 05:56:14.448  INFO 23900 --- [           main] o.s.c.d.a.test.NamedChannelTests         : Retrieved logfile from 'http://10.194.6.129:58743/actuator/logfile
19-Jun-2019 05:56:14 2019-06-19 05:56:14.448  INFO 23900 --- [           main] o.s.c.d.a.test.NamedChannelTests         : Matched all 'abcdefg' in logfile for app log (source LOG-DESTINATION-SINK.log-v1-0)
19-Jun-2019 05:56:14 2019-06-19 05:56:14.450  INFO 23900 --- [           main] junit.logTestName                        : Test testDestination(org.springframework.cloud.dataflow.acceptance.test.NamedChannelTests) Succeeded
19-Jun-2019 05:56:14 2019-06-19 05:56:14.450  INFO 23900 --- [           main] junit.logTestName                        : Finished Test testDestination(org.springframework.cloud.dataflow.acceptance.test.NamedChannelTests)
19-Jun-2019 05:56:14 2019-06-19 05:56:14.450  INFO 23900 --- [           main] o.s.c.d.a.test.NamedChannelTests         : Destroy all streams
19-Jun-2019 05:56:14 2019-06-19 05:56:14.855  INFO 23900 --- [           main] junit.logTestName                        : Starting Test testTap(org.springframework.cloud.dataflow.acceptance.test.NamedChannelTests)
19-Jun-2019 05:56:14 2019-06-19 05:56:14.857  INFO 23900 --- [           main] o.s.c.d.a.test.NamedChannelTests         : Creating stream 'TAPHTTP'
19-Jun-2019 05:56:14 2019-06-19 05:56:14.889  INFO 23900 --- [           main] o.s.c.d.a.test.NamedChannelTests         : Deploying stream 'TAPHTTP' with properties: {app.*.spring.cloud.streamapp.security.enabled=false, app.*.logging.file=${PID}-test.log, app.*.endpoints.logfile.sensitive=false, app.*.management.endpoints.web.exposure.include=*}
19-Jun-2019 05:56:15 2019-06-19 05:56:15.454  INFO 23900 --- [           main] o.s.c.d.a.test.NamedChannelTests         : Checking: Stream=TAPHTTP, status = deploying, status description = The stream is being deployed.
19-Jun-2019 05:56:15 2019-06-19 05:56:15.454  INFO 23900 --- [           main] o.s.c.d.a.test.NamedChannelTests         : Sleeping to check status of Stream=TAPHTTP
19-Jun-2019 05:56:25 2019-06-19 05:56:25.489  INFO 23900 --- [           main] o.s.c.d.a.test.NamedChannelTests         : Checking: Stream=TAPHTTP, status = deploying, status description = The stream is being deployed.
19-Jun-2019 05:56:25 2019-06-19 05:56:25.489  INFO 23900 --- [           main] o.s.c.d.a.test.NamedChannelTests         : Sleeping to check status of Stream=TAPHTTP
19-Jun-2019 05:56:35 2019-06-19 05:56:35.522  INFO 23900 --- [           main] o.s.c.d.a.test.NamedChannelTests         : Checking: Stream=TAPHTTP, status = deployed, status description = The stream has been successfully deployed
19-Jun-2019 05:56:35 2019-06-19 05:56:35.573  INFO 23900 --- [           main] o.s.c.d.a.test.NamedChannelTests         : Sleeping to check status of Stream=TAPHTTP
19-Jun-2019 05:56:45 2019-06-19 05:56:45.573  INFO 23900 --- [           main] o.s.c.d.a.test.NamedChannelTests         : Stream 'TAPHTTP' started with status: deployed
19-Jun-2019 05:56:45 2019-06-19 05:56:45.573  INFO 23900 --- [           main] o.s.c.d.a.test.NamedChannelTests         : App 'log' has instances: {TAPHTTP.log-v1-0=http://10.194.6.129:47479}
19-Jun-2019 05:56:45 2019-06-19 05:56:45.573  INFO 23900 --- [           main] o.s.c.d.a.test.NamedChannelTests         : App 'http' has instances: {TAPHTTP.http-v1-0=http://10.194.6.129:28533}
19-Jun-2019 05:56:45 2019-06-19 05:56:45.573  INFO 23900 --- [           main] o.s.c.d.a.test.NamedChannelTests         : Looking for 'Started HttpSource' in logfile for http
19-Jun-2019 05:56:55 2019-06-19 05:56:55.574  INFO 23900 --- [           main] o.s.c.d.a.test.NamedChannelTests         : Requesting log for app TAPHTTP.http-v1-0
19-Jun-2019 05:56:55 2019-06-19 05:56:55.705  INFO 23900 --- [           main] o.s.c.d.a.test.NamedChannelTests         : Retrieved logfile from 'http://10.194.6.129:28533/actuator/logfile
19-Jun-2019 05:56:55 2019-06-19 05:56:55.705  INFO 23900 --- [           main] o.s.c.d.a.test.NamedChannelTests         : Matched all 'Started HttpSource' in logfile for app http (source TAPHTTP.http-v1-0)
19-Jun-2019 05:56:55 2019-06-19 05:56:55.705  INFO 23900 --- [           main] o.s.c.d.a.test.NamedChannelTests         : Looking for 'Started LogSink' in logfile for log
19-Jun-2019 05:57:05 2019-06-19 05:57:05.706  INFO 23900 --- [           main] o.s.c.d.a.test.NamedChannelTests         : Requesting log for app TAPHTTP.log-v1-0
19-Jun-2019 05:57:05 2019-06-19 05:57:05.842  INFO 23900 --- [           main] o.s.c.d.a.test.NamedChannelTests         : Retrieved logfile from 'http://10.194.6.129:47479/actuator/logfile
19-Jun-2019 05:57:05 2019-06-19 05:57:05.842  INFO 23900 --- [           main] o.s.c.d.a.test.NamedChannelTests         : Matched all 'Started LogSink' in logfile for app log (source TAPHTTP.log-v1-0)
19-Jun-2019 05:57:05 2019-06-19 05:57:05.842  INFO 23900 --- [           main] o.s.c.d.a.test.NamedChannelTests         : Creating stream 'TAPSTREAM'
19-Jun-2019 05:57:05 2019-06-19 05:57:05.868  INFO 23900 --- [           main] o.s.c.d.a.test.NamedChannelTests         : Deploying stream 'TAPSTREAM' with properties: {app.*.spring.cloud.streamapp.security.enabled=false, app.*.logging.file=${PID}-test.log, app.*.endpoints.logfile.sensitive=false, app.*.management.endpoints.web.exposure.include=*}
19-Jun-2019 05:57:06 2019-06-19 05:57:06.303  INFO 23900 --- [           main] o.s.c.d.a.test.NamedChannelTests         : Checking: Stream=TAPSTREAM, status = deploying, status description = The stream is being deployed.
19-Jun-2019 05:57:06 2019-06-19 05:57:06.303  INFO 23900 --- [           main] o.s.c.d.a.test.NamedChannelTests         : Sleeping to check status of Stream=TAPSTREAM
19-Jun-2019 05:57:16 2019-06-19 05:57:16.347  INFO 23900 --- [           main] o.s.c.d.a.test.NamedChannelTests         : Checking: Stream=TAPSTREAM, status = deployed, status description = The stream has been successfully deployed
19-Jun-2019 05:57:16 2019-06-19 05:57:16.415  INFO 23900 --- [           main] o.s.c.d.a.test.NamedChannelTests         : Sleeping to check status of Stream=TAPSTREAM
19-Jun-2019 05:57:26 2019-06-19 05:57:26.415  INFO 23900 --- [           main] o.s.c.d.a.test.NamedChannelTests         : Stream 'TAPSTREAM' started with status: deployed
19-Jun-2019 05:57:26 2019-06-19 05:57:26.415  INFO 23900 --- [           main] o.s.c.d.a.test.NamedChannelTests         : App 'log' has instances: {TAPSTREAM.log-v1-0=http://10.194.6.129:59543}
19-Jun-2019 05:57:26 2019-06-19 05:57:26.415  INFO 23900 --- [           main] o.s.c.d.a.test.NamedChannelTests         : Looking for 'Started LogSink' in logfile for log
19-Jun-2019 05:57:36 2019-06-19 05:57:36.416  INFO 23900 --- [           main] o.s.c.d.a.test.NamedChannelTests         : Requesting log for app TAPSTREAM.log-v1-0
19-Jun-2019 05:57:36 2019-06-19 05:57:36.545  INFO 23900 --- [           main] o.s.c.d.a.test.NamedChannelTests         : Retrieved logfile from 'http://10.194.6.129:59543/actuator/logfile
19-Jun-2019 05:57:36 2019-06-19 05:57:36.546  INFO 23900 --- [           main] o.s.c.d.a.test.NamedChannelTests         : Matched all 'Started LogSink' in logfile for app log (source TAPSTREAM.log-v1-0)
19-Jun-2019 05:57:36 2019-06-19 05:57:36.643  INFO 23900 --- [           main] o.s.c.d.a.test.NamedChannelTests         : Looking for 'abcdefg' in logfile for log
19-Jun-2019 05:57:46 2019-06-19 05:57:46.643  INFO 23900 --- [           main] o.s.c.d.a.test.NamedChannelTests         : Requesting log for app TAPSTREAM.log-v1-0
19-Jun-2019 05:57:46 2019-06-19 05:57:46.655  INFO 23900 --- [           main] o.s.c.d.a.test.NamedChannelTests         : Retrieved logfile from 'http://10.194.6.129:59543/actuator/logfile
19-Jun-2019 05:57:46 2019-06-19 05:57:46.655  INFO 23900 --- [           main] o.s.c.d.a.test.NamedChannelTests         : Matched all 'abcdefg' in logfile for app log (source TAPSTREAM.log-v1-0)
19-Jun-2019 05:57:46 2019-06-19 05:57:46.657  INFO 23900 --- [           main] junit.logTestName                        : Test testTap(org.springframework.cloud.dataflow.acceptance.test.NamedChannelTests) Succeeded
19-Jun-2019 05:57:46 2019-06-19 05:57:46.657  INFO 23900 --- [           main] junit.logTestName                        : Finished Test testTap(org.springframework.cloud.dataflow.acceptance.test.NamedChannelTests)
19-Jun-2019 05:57:46 2019-06-19 05:57:46.657  INFO 23900 --- [           main] o.s.c.d.a.test.NamedChannelTests         : Destroy all streams
19-Jun-2019 05:57:47 2019-06-19 05:57:47.097  INFO 23900 --- [           main] junit.logTestName                        : Starting Test manyToOneTest(org.springframework.cloud.dataflow.acceptance.test.NamedChannelTests)
19-Jun-2019 05:57:47 2019-06-19 05:57:47.107  INFO 23900 --- [           main] o.s.c.d.a.test.NamedChannelTests         : Creating stream 'MANY-TO-ONE'
19-Jun-2019 05:57:47 2019-06-19 05:57:47.137  INFO 23900 --- [           main] o.s.c.d.a.test.NamedChannelTests         : Deploying stream 'MANY-TO-ONE' with properties: {app.*.spring.cloud.streamapp.security.enabled=false, app.*.logging.file=${PID}-test.log, app.*.endpoints.logfile.sensitive=false, app.*.management.endpoints.web.exposure.include=*}
19-Jun-2019 05:57:47 2019-06-19 05:57:47.519  INFO 23900 --- [           main] o.s.c.d.a.test.NamedChannelTests         : Checking: Stream=MANY-TO-ONE, status = deploying, status description = The stream is being deployed.
19-Jun-2019 05:57:47 2019-06-19 05:57:47.519  INFO 23900 --- [           main] o.s.c.d.a.test.NamedChannelTests         : Sleeping to check status of Stream=MANY-TO-ONE
19-Jun-2019 05:57:57 2019-06-19 05:57:57.544  INFO 23900 --- [           main] o.s.c.d.a.test.NamedChannelTests         : Checking: Stream=MANY-TO-ONE, status = deployed, status description = The stream has been successfully deployed
19-Jun-2019 05:57:57 2019-06-19 05:57:57.587  INFO 23900 --- [           main] o.s.c.d.a.test.NamedChannelTests         : Sleeping to check status of Stream=MANY-TO-ONE
19-Jun-2019 05:58:07 2019-06-19 05:58:07.588  INFO 23900 --- [           main] o.s.c.d.a.test.NamedChannelTests         : Stream 'MANY-TO-ONE' started with status: deployed
19-Jun-2019 05:58:07 2019-06-19 05:58:07.588  INFO 23900 --- [           main] o.s.c.d.a.test.NamedChannelTests         : App 'log' has instances: {MANY-TO-ONE.log-v1-0=http://10.194.6.129:21647}
19-Jun-2019 05:58:07 2019-06-19 05:58:07.588  INFO 23900 --- [           main] o.s.c.d.a.test.NamedChannelTests         : Looking for 'Started LogSink' in logfile for log
19-Jun-2019 05:58:17 2019-06-19 05:58:17.588  INFO 23900 --- [           main] o.s.c.d.a.test.NamedChannelTests         : Requesting log for app MANY-TO-ONE.log-v1-0
19-Jun-2019 05:58:17 2019-06-19 05:58:17.724  INFO 23900 --- [           main] o.s.c.d.a.test.NamedChannelTests         : Retrieved logfile from 'http://10.194.6.129:21647/actuator/logfile
19-Jun-2019 05:58:17 2019-06-19 05:58:17.724  INFO 23900 --- [           main] o.s.c.d.a.test.NamedChannelTests         : Matched all 'Started LogSink' in logfile for app log (source MANY-TO-ONE.log-v1-0)
19-Jun-2019 05:58:17 2019-06-19 05:58:17.724  INFO 23900 --- [           main] o.s.c.d.a.test.NamedChannelTests         : Creating stream 'HTTP-SOURCE-1'
19-Jun-2019 05:58:17 2019-06-19 05:58:17.750  INFO 23900 --- [           main] o.s.c.d.a.test.NamedChannelTests         : Deploying stream 'HTTP-SOURCE-1' with properties: {app.*.spring.cloud.streamapp.security.enabled=false, app.*.logging.file=${PID}-test.log, app.*.endpoints.logfile.sensitive=false, app.*.management.endpoints.web.exposure.include=*}
19-Jun-2019 05:58:18 2019-06-19 05:58:18.181  INFO 23900 --- [           main] o.s.c.d.a.test.NamedChannelTests         : Checking: Stream=HTTP-SOURCE-1, status = deploying, status description = The stream is being deployed.
19-Jun-2019 05:58:18 2019-06-19 05:58:18.182  INFO 23900 --- [           main] o.s.c.d.a.test.NamedChannelTests         : Sleeping to check status of Stream=HTTP-SOURCE-1
19-Jun-2019 05:58:28 2019-06-19 05:58:28.230  INFO 23900 --- [           main] o.s.c.d.a.test.NamedChannelTests         : Checking: Stream=HTTP-SOURCE-1, status = deployed, status description = The stream has been successfully deployed
19-Jun-2019 05:58:28 2019-06-19 05:58:28.269  INFO 23900 --- [           main] o.s.c.d.a.test.NamedChannelTests         : Sleeping to check status of Stream=HTTP-SOURCE-1
19-Jun-2019 05:58:38 2019-06-19 05:58:38.269  INFO 23900 --- [           main] o.s.c.d.a.test.NamedChannelTests         : Stream 'HTTP-SOURCE-1' started with status: deployed
19-Jun-2019 05:58:38 2019-06-19 05:58:38.269  INFO 23900 --- [           main] o.s.c.d.a.test.NamedChannelTests         : App 'http' has instances: {HTTP-SOURCE-1.http-v1-0=http://10.194.6.129:21266}
19-Jun-2019 05:58:38 2019-06-19 05:58:38.269  INFO 23900 --- [           main] o.s.c.d.a.test.NamedChannelTests         : Looking for 'Started HttpSource' in logfile for http
19-Jun-2019 05:58:48 2019-06-19 05:58:48.269  INFO 23900 --- [           main] o.s.c.d.a.test.NamedChannelTests         : Requesting log for app HTTP-SOURCE-1.http-v1-0
19-Jun-2019 05:58:48 2019-06-19 05:58:48.396  INFO 23900 --- [           main] o.s.c.d.a.test.NamedChannelTests         : Retrieved logfile from 'http://10.194.6.129:21266/actuator/logfile
19-Jun-2019 05:58:48 2019-06-19 05:58:48.396  INFO 23900 --- [           main] o.s.c.d.a.test.NamedChannelTests         : Matched all 'Started HttpSource' in logfile for app http (source HTTP-SOURCE-1.http-v1-0)
19-Jun-2019 05:58:48 2019-06-19 05:58:48.396  INFO 23900 --- [           main] o.s.c.d.a.test.NamedChannelTests         : Creating stream 'HTTP-SOURCE-2'
19-Jun-2019 05:58:48 2019-06-19 05:58:48.421  INFO 23900 --- [           main] o.s.c.d.a.test.NamedChannelTests         : Deploying stream 'HTTP-SOURCE-2' with properties: {app.*.spring.cloud.streamapp.security.enabled=false, app.*.logging.file=${PID}-test.log, app.*.endpoints.logfile.sensitive=false, app.*.management.endpoints.web.exposure.include=*}
19-Jun-2019 05:58:48 2019-06-19 05:58:48.868  INFO 23900 --- [           main] o.s.c.d.a.test.NamedChannelTests         : Checking: Stream=HTTP-SOURCE-2, status = deploying, status description = The stream is being deployed.
19-Jun-2019 05:58:48 2019-06-19 05:58:48.868  INFO 23900 --- [           main] o.s.c.d.a.test.NamedChannelTests         : Sleeping to check status of Stream=HTTP-SOURCE-2
19-Jun-2019 05:58:58 2019-06-19 05:58:58.928  INFO 23900 --- [           main] o.s.c.d.a.test.NamedChannelTests         : Checking: Stream=HTTP-SOURCE-2, status = deployed, status description = The stream has been successfully deployed
19-Jun-2019 05:58:58 2019-06-19 05:58:58.968  INFO 23900 --- [           main] o.s.c.d.a.test.NamedChannelTests         : Sleeping to check status of Stream=HTTP-SOURCE-2
19-Jun-2019 05:59:08 2019-06-19 05:59:08.968  INFO 23900 --- [           main] o.s.c.d.a.test.NamedChannelTests         : Stream 'HTTP-SOURCE-2' started with status: deployed
19-Jun-2019 05:59:08 2019-06-19 05:59:08.968  INFO 23900 --- [           main] o.s.c.d.a.test.NamedChannelTests         : App 'http' has instances: {HTTP-SOURCE-2.http-v1-0=http://10.194.6.129:54534}
19-Jun-2019 05:59:08 2019-06-19 05:59:08.968  INFO 23900 --- [           main] o.s.c.d.a.test.NamedChannelTests         : Looking for 'Started HttpSource' in logfile for http
19-Jun-2019 05:59:18 2019-06-19 05:59:18.969  INFO 23900 --- [           main] o.s.c.d.a.test.NamedChannelTests         : Requesting log for app HTTP-SOURCE-2.http-v1-0
19-Jun-2019 05:59:19 2019-06-19 05:59:19.102  INFO 23900 --- [           main] o.s.c.d.a.test.NamedChannelTests         : Retrieved logfile from 'http://10.194.6.129:54534/actuator/logfile
19-Jun-2019 05:59:19 2019-06-19 05:59:19.102  INFO 23900 --- [           main] o.s.c.d.a.test.NamedChannelTests         : Matched all 'Started HttpSource' in logfile for app http (source HTTP-SOURCE-2.http-v1-0)
19-Jun-2019 05:59:19 2019-06-19 05:59:19.291  INFO 23900 --- [           main] o.s.c.d.a.test.NamedChannelTests         : Looking for 'abcdefg' in logfile for log
19-Jun-2019 05:59:29 2019-06-19 05:59:29.291  INFO 23900 --- [           main] o.s.c.d.a.test.NamedChannelTests         : Requesting log for app MANY-TO-ONE.log-v1-0
19-Jun-2019 05:59:29 2019-06-19 05:59:29.300  INFO 23900 --- [           main] o.s.c.d.a.test.NamedChannelTests         : Retrieved logfile from 'http://10.194.6.129:21647/actuator/logfile
19-Jun-2019 05:59:29 2019-06-19 05:59:29.300  INFO 23900 --- [           main] o.s.c.d.a.test.NamedChannelTests         : Matched all 'abcdefg' in logfile for app log (source MANY-TO-ONE.log-v1-0)
19-Jun-2019 05:59:29 2019-06-19 05:59:29.428  INFO 23900 --- [           main] o.s.c.d.a.test.NamedChannelTests         : Looking for 'hijklmn' in logfile for log
19-Jun-2019 05:59:39 2019-06-19 05:59:39.428  INFO 23900 --- [           main] o.s.c.d.a.test.NamedChannelTests         : Requesting log for app MANY-TO-ONE.log-v1-0
19-Jun-2019 05:59:39 2019-06-19 05:59:39.435  INFO 23900 --- [           main] o.s.c.d.a.test.NamedChannelTests         : Retrieved logfile from 'http://10.194.6.129:21647/actuator/logfile
19-Jun-2019 05:59:39 2019-06-19 05:59:39.435  INFO 23900 --- [           main] o.s.c.d.a.test.NamedChannelTests         : Matched all 'hijklmn' in logfile for app log (source MANY-TO-ONE.log-v1-0)
19-Jun-2019 05:59:39 2019-06-19 05:59:39.436  INFO 23900 --- [           main] junit.logTestName                        : Test manyToOneTest(org.springframework.cloud.dataflow.acceptance.test.NamedChannelTests) Succeeded
19-Jun-2019 05:59:39 2019-06-19 05:59:39.436  INFO 23900 --- [           main] junit.logTestName                        : Finished Test manyToOneTest(org.springframework.cloud.dataflow.acceptance.test.NamedChannelTests)
19-Jun-2019 05:59:39 2019-06-19 05:59:39.436  INFO 23900 --- [           main] o.s.c.d.a.test.NamedChannelTests         : Destroy all streams
19-Jun-2019 05:59:39 Tests run: 4, Failures: 0, Errors: 0, Skipped: 1, Time elapsed: 276.858 sec - in org.springframework.cloud.dataflow.acceptance.test.NamedChannelTests
19-Jun-2019 05:59:39 Running org.springframework.cloud.dataflow.acceptance.test.util.PlatformHelperTests
19-Jun-2019 05:59:39 Tests run: 3, Failures: 0, Errors: 0, Skipped: 0, Time elapsed: 0.078 sec - in org.springframework.cloud.dataflow.acceptance.test.util.PlatformHelperTests
19-Jun-2019 05:59:39 Running org.springframework.cloud.dataflow.acceptance.test.util.ApplicationTests
19-Jun-2019 05:59:39 Tests run: 2, Failures: 0, Errors: 0, Skipped: 0, Time elapsed: 0 sec - in org.springframework.cloud.dataflow.acceptance.test.util.ApplicationTests
19-Jun-2019 05:59:39 2019-06-19 05:59:39.909  INFO 23900 --- [       Thread-6] o.s.c.support.GenericApplicationContext  : Closing org.springframework.context.support.GenericApplicationContext@1afd72ef: startup date [Wed Jun 19 05:44:55 UTC 2019]; root of context hierarchy
19-Jun-2019 05:59:39
19-Jun-2019 05:59:39 Results :
19-Jun-2019 05:59:39
19-Jun-2019 05:59:39 Failed tests:
19-Jun-2019 05:59:39   ComposedTaskTests.ctrMultipleLaunchWithProperties:57->assertTaskExecutions:67 null
19-Jun-2019 05:59:39
19-Jun-2019 05:59:39 Tests run: 22, Failures: 1, Errors: 0, Skipped: 4
19-Jun-2019 05:59:39
19-Jun-2019 05:59:39 [INFO] ------------------------------------------------------------------------
19-Jun-2019 05:59:39 [INFO] BUILD FAILURE
19-Jun-2019 05:59:39 [INFO] ------------------------------------------------------------------------
19-Jun-2019 05:59:39 [INFO] Total time: 18:01 min
19-Jun-2019 05:59:39 [INFO] Finished at: 2019-06-19T05:59:39+00:00
19-Jun-2019 05:59:40 [INFO] Final Memory: 50M/448M
19-Jun-2019 05:59:40 [INFO] ------------------------------------------------------------------------
19-Jun-2019 05:59:40 [ERROR] Failed to execute goal org.apache.maven.plugins:maven-surefire-plugin:2.18.1:test (default-test) on project spring-cloud-dataflow-acceptance-tests: There are test failures.
19-Jun-2019 05:59:40 [ERROR]
19-Jun-2019 05:59:40 [ERROR] Please refer to /opt/bamboo-home/xml-data/build-dir/SCDT-LOCAL20XSKIPPER20X-KAFKA/target/surefire-reports for the individual test results.
19-Jun-2019 05:59:40 [ERROR] -> [Help 1]
19-Jun-2019 05:59:40 [ERROR]
19-Jun-2019 05:59:40 [ERROR] To see the full stack trace of the errors, re-run Maven with the -e switch.
19-Jun-2019 05:59:40 [ERROR] Re-run Maven using the -X switch to enable full debug logging.
19-Jun-2019 05:59:40 [ERROR]
19-Jun-2019 05:59:40 [ERROR] For more information about the errors and possible solutions, please read the following articles:
19-Jun-2019 05:59:40 [ERROR] [Help 1] http://cwiki.apache.org/confluence/display/MAVEN/MojoFailureException
19-Jun-2019 05:59:40 Clean up, clean up, everybody everywhere; clean up clean up, everybody do your share!
19-Jun-2019 05:59:40 Killing process PID [23707]
19-Jun-2019 05:59:40 Killing process PID [23592]
19-Jun-2019 05:59:40 No stopped containers
19-Jun-2019 05:59:41 Stopping mysql_mysql_1 ...
19-Jun-2019 05:59:43
19-Jun-2019 05:59:43 Stopping mysql_mysql_1 ... done
19-Jun-2019 05:59:43 Removing mysql_mysql_1 ...
19-Jun-2019 05:59:43
19-Jun-2019 05:59:43 Removing mysql_mysql_1 ... done
19-Jun-2019 05:59:43 Going to remove mysql_mysql_1
19-Jun-2019 05:59:43 Stopping kafka_zookeeper_1 ...
19-Jun-2019 05:59:43 Stopping kafka_kafka_1     ...
19-Jun-2019 05:59:46
19-Jun-2019 05:59:46 Stopping kafka_kafka_1     ... done
19-Jun-2019 05:59:54
19-Jun-2019 05:59:54 Stopping kafka_zookeeper_1 ... done
19-Jun-2019 05:59:54 Removing kafka_zookeeper_1 ...
19-Jun-2019 05:59:54 Removing kafka_kafka_1     ...
19-Jun-2019 05:59:54
19-Jun-2019 05:59:54 Removing kafka_zookeeper_1 ... done
19-Jun-2019 05:59:54
19-Jun-2019 05:59:54 Removing kafka_kafka_1     ... done
19-Jun-2019 05:59:54 Going to remove kafka_zookeeper_1, kafka_kafka_1
19-Jun-2019 05:59:54
19-Jun-2019 05:59:54 Finished task 'Execute Acceptance Tests' with result: Success
19-Jun-2019 05:59:54 Starting task 'JUnit Parser' of type 'com.atlassian.bamboo.plugins.testresultparser:task.testresultparser.junit'
19-Jun-2019 05:59:54 Parsing test results under /opt/bamboo-home/xml-data/build-dir/SCDT-LOCAL20XSKIPPER20X-KAFKA...
19-Jun-2019 05:59:54 Failing task since 1 failing test cases were found.
19-Jun-2019 05:59:54 Finished task 'JUnit Parser' with result: Failed
19-Jun-2019 05:59:54 Starting task 'clean up' of type 'com.atlassian.bamboo.plugins.scripttask:task.builder.script'
19-Jun-2019 05:59:54
Beginning to execute external process for build 'Spring Cloud Data Flow Acceptance Tests - Local + SCDF-2.0.3.BS + Skipper 2.0.3.BS - Run Data Flow Acceptance Tests for Kafka #51 (SCDT-LOCAL20XSKIPPER20X-KAFKA-51)'
... running command line:
/opt/bamboo-home/temp/SCDT-LOCAL20XSKIPPER20X-KAFKA-51-ScriptBuildTask-2679418651029595283.sh
... in: /opt/bamboo-home/xml-data/build-dir/SCDT-LOCAL20XSKIPPER20X-KAFKA
... using extra environment variables:
bamboo_planRepository_1_branch=master
bamboo_********_username_password=********
bamboo_signing_store_password=********
bamboo_capability_system_builder_ant_Ant_1_9=/opt/ant-1.9
bamboo_capability_system_builder_ant_Ant_1_8=/opt/ant-1.8
bamboo_planRepository_1_branchDisplayName=master
bamboo_repository_274694331_git_username=spring-buildmaster
bamboo_artifactory_override_resolve_repo=libs-milestone
bamboo_capability_system_builder_node_Node_js_10_16=/opt/node-10.16/bin/node
bamboo_repository_revision_number=a55d24d9f870d3168073114c579a54ea9fa723e7
bamboo_RIAK_BIN=/usr/sbin/riak
bamboo_buildKey=SCDT-LOCAL20XSKIPPER20X-KAFKA
bamboo_repository_274694331_branch_name=master
bamboo_bintray_password=********
bamboo_sonar_token_password=********
bamboo_shortJobName=Run Data Flow Acceptance Tests for Kafka
bamboo_artifactory_override_resolver_password=********
bamboo_sonatype_token=RSJChaox
bamboo_capability_system_builder_gradle___gradlew=./gradlew
bamboo_buildResultsUrl=https://build.spring.io/browse/SCDT-LOCAL20XSKIPPER20X-KAFKA-51
bamboo_capability_system_builder_mvn3_Maven_3_3=/opt/maven-3.3
bamboo_capability_system_builder_mvn3_Maven_3_2=/opt/maven-3.2
bamboo_capability_system_builder_mvn3_Maven_3_1=/opt/maven-3.1
bamboo_planRepository_repositoryUrl=https://github.com/spring-cloud/spring-cloud-dataflow-acceptance-tests.git
bamboo_capability_system_builder_mvn3_Maven_3_6=/opt/maven-3.6
bamboo_agentId=286195715
bamboo_capability_system_builder_mvn3_Maven_3_5=/opt/maven-3.5
bamboo_capability_system_builder_mvn3_Maven_3_0=/opt/maven-3.0
bamboo_planRepository_revision=a55d24d9f870d3168073114c579a54ea9fa723e7
bamboo_planRepository_previousRevision=583bb093ba93c2193a044a960f1c7d4321b70d14
bamboo_capability_remote_build=true
bamboo_repository_branch_name=master
bamboo_sonatype_token_password=********
bamboo_sonatype_user=springsource
bamboo_repository_274694331_name=Git
bamboo_scdf_acceptance_tests_password=********
bamboo_dependenciesDisabled=false
bamboo_repository_274694331_git_branch=master
bamboo_planRepository_branch=master
bamboo_planRepository_1_type=gitv2
bamboo_planRepository_branchName=master
bamboo_capability_system_jdk_JDK_12=/opt/jdk-12
bamboo_capability_system_builder_ant_Ant_1_10=/opt/ant-1.10
bamboo_sonar_password=********
bamboo_hg_cache_directory=/opt/bamboo-home/xml-data/build-dir/_hg-repositories-cache
bamboo_planRepository_1_username=spring-buildmaster
bamboo_repository_274694331_git_repositoryUrl=https://github.com/spring-cloud/spring-cloud-dataflow-acceptance-tests.git
bamboo_planRepository_type=gitv2
bamboo_ManualBuildTriggerReason_userName=igopinathan
bamboo_git_cache_directory=/opt/bamboo-home/xml-data/build-dir/_git-repositories-cache
bamboo_artifactory_username=buildmaster
bamboo_tmp_directory=/opt/bamboo-home/temp
bamboo_planKey=SCDT-LOCAL20XSKIPPER20X
bamboo_planRepository_username=spring-buildmaster
bamboo_JDK8_HOME=/opt/jdk-8
bamboo_repository_274694331_previous_revision_number=583bb093ba93c2193a044a960f1c7d4321b70d14
bamboo_planRepository_1_branchName=master
bamboo_sonar_version=5.6.3
bamboo_sonar_jdbc_password=********
bamboo_bintray_api_key_password=********
bamboo_capability_system_jdk_JDK_1_11=/opt/jdk-11
bamboo_resultsUrl=https://build.spring.io/browse/SCDT-LOCAL20XSKIPPER20X-KAFKA-51
bamboo_capability_system_jdk_JDK_1_10=/opt/jdk-10
bamboo_build_working_directory=/opt/bamboo-home/xml-data/build-dir/SCDT-LOCAL20XSKIPPER20X-KAFKA
bamboo_planRepository_1_name=Git
bamboo_capability_system_os=ubuntu1804
bamboo_nexusPush_stagingProfile=buildmaster
bamboo_shortPlanName=Local + SCDF-2.0.3.BS + Skipper 2.0.3.BS
bamboo_planRepository_name=Git
bamboo_buildNumber=51
bamboo_planName=Spring Cloud Data Flow Acceptance Tests - Local + SCDF-2.0.3.BS + Skipper 2.0.3.BS
bamboo_JDK7_HOME=/opt/jdk-7
bamboo_build_commandline_com_atlassian_bamboo_plugins_scripttask_task_builder_script_7=/opt/bamboo-home/temp/SCDT-LOCAL20XSKIPPER20X-KAFKA-51-ScriptBuildTask-6533657201032302198.sh
bamboo_shortPlanKey=LOCAL20XSKIPPER20X
bamboo_shortJobKey=KAFKA
bamboo_artifactory_password=********
bamboo_buildTimeStamp=2019-06-19T05:40:11.035Z
bamboo_repository_previous_revision_number=583bb093ba93c2193a044a960f1c7d4321b70d14
bamboo_sonar_username=buildmaster
bamboo_********_password=********
bamboo_repository_git_branch=master
bamboo_buildResultKey=SCDT-LOCAL20XSKIPPER20X-KAFKA-51
bamboo_nexusPush_close=true
bamboo_artifactory_override_resolver_username=buildmaster
bamboo_buildPlanName=Spring Cloud Data Flow Acceptance Tests - Local + SCDF-2.0.3.BS + Skipper 2.0.3.BS - Run Data Flow Acceptance Tests for Kafka
bamboo_repository_274694331_revision_number=a55d24d9f870d3168073114c579a54ea9fa723e7
bamboo_planRepository_1_revision=a55d24d9f870d3168073114c579a54ea9fa723e7
bamboo_repository_name=Git
bamboo_signing_key_password=********
bamboo_capability_system_builder_groovy_Groovy_2_5=/opt/groovy-2.5
bamboo_buildFailed=true
bamboo_capability_system_docker_executable=/usr/bin/docker
bamboo_capability_system_jdk_OpenJDK_7=/opt/jdk-7
bamboo_capability_system_builder_groovy_Groovy_2_4=/opt/groovy-2.4
bamboo_artifactory_override_deployer_username=buildmaster
bamboo_capability_system_builder_command_Bash=/bin/bash
bamboo_jobFailed=true
bamboo_agentWorkingDirectory=/opt/bamboo-home/xml-data/build-dir
bamboo_capability_system_git_executable=/usr/bin/git
bamboo_repository_git_username=spring-buildmaster
bamboo_planRepository_1_previousRevision=583bb093ba93c2193a044a960f1c7d4321b70d14
bamboo_capability_os_family=unix
bamboo_planRepository_branchDisplayName=master
bamboo_capability_system_builder_maven_Artifactory_Maven_3_6=/opt/maven-3.6
bamboo_capability_system_builder_maven_Artifactory_Maven_3_5=/opt/maven-3.5
bamboo_capability_system_builder_maven_Artifactory_Maven_3_3=/opt/maven-3.3
bamboo_capability_system_builder_maven_Artifactory_Maven_3_2=/opt/maven-3.2
bamboo_s3_properties=/home/bamboo/tools/s3.properties
bamboo_capability_system_builder_maven_Artifactory_Maven_3_1=/opt/maven-3.1
bamboo_artifactory_override_deploy_repo=libs-snapshot-local
bamboo_capability_system_builder_maven_Artifactory_Maven_3_0=/opt/maven-3.0
bamboo_plan_storageTag=plan-274497908
bamboo_bintray_username_password=********
bamboo_repository_git_repositoryUrl=https://github.com/spring-cloud/spring-cloud-dataflow-acceptance-tests.git
bamboo_working_directory=/opt/bamboo-home/xml-data/build-dir/SCDT-LOCAL20XSKIPPER20X-KAFKA
bamboo_planRepository_1_repositoryUrl=https://github.com/spring-cloud/spring-cloud-dataflow-acceptance-tests.git
bamboo_capability_system_jdk_JDK_1_8=/opt/jdk-8
bamboo_artifactory_override_deployer_password=********
bamboo_capability_system_jdk_JDK_1_9=/opt/jdk-9
bamboo_capability_system_jdk_JDK_1_6=/opt/jdk-6
bamboo_sonatype_password=********
bamboo_capability_system_jdk_JDK_1_7=/opt/jdk-7
bamboo_sonar_ip=10.194.6.9
19-Jun-2019 05:59:54 CLEANING UP RESOURCES AFTER RUNNING TESTS
19-Jun-2019 05:59:54 Environment variable JAVA_HOME must be set
19-Jun-2019 05:59:54 FINISHED CLEANING UP RESOURCES
19-Jun-2019 05:59:54 Finished task 'clean up' with result: Success
19-Jun-2019 05:59:54 Running post build plugin 'Docker Container Cleanup'
19-Jun-2019 05:59:54 Running post build plugin 'NCover Results Collector'
19-Jun-2019 05:59:54 Running post build plugin 'Artifactory Release Management Staging'
19-Jun-2019 05:59:54 Running post build plugin 'Artifactory Build Info Copier'
19-Jun-2019 05:59:54 Running post build plugin 'Artifactory Gradle Properties Info Copier'
19-Jun-2019 05:59:54 Running post build plugin 'Clover Results Collector'
19-Jun-2019 05:59:54 Running post build plugin 'npm Cache Cleanup'
19-Jun-2019 05:59:54 Running post build plugin 'Artifact Copier'
19-Jun-2019 05:59:54 Publishing an artifact: App and Server Logs
19-Jun-2019 05:59:54 Finished publishing of artifact Non required job artifact: [App and Server Logs], pattern: [**/*.log] anchored at: [local] in 41.43 ms
19-Jun-2019 05:59:54 Publishing an artifact: Test Results
19-Jun-2019 05:59:54 Finished publishing of artifact Non required job artifact: [Test Results], pattern: [**/target/surefire-reports/**/*.*] in 39.89 ms
19-Jun-2019 05:59:54 Successfully removed working directory at '/opt/bamboo-home/xml-data/build-dir/SCDT-LOCAL20XSKIPPER20X-KAFKA'
19-Jun-2019 05:59:54 Finalising the build...
19-Jun-2019 05:59:54 Stopping timer.
19-Jun-2019 05:59:54 Build SCDT-LOCAL20XSKIPPER20X-KAFKA-51 completed.
19-Jun-2019 05:59:54 Running on server: post build plugin 'NCover Results Collector'
19-Jun-2019 05:59:54 Running on server: post build plugin 'Build Hanging Detection Configuration'
19-Jun-2019 05:59:54 Running on server: post build plugin 'Clover Delta Calculator'
19-Jun-2019 05:59:54 Running on server: post build plugin 'Maven Dependencies Postprocessor'
19-Jun-2019 05:59:54 All post build plugins have finished
19-Jun-2019 05:59:54 Generating build results summary...
19-Jun-2019 05:59:55 Saving build results to disk...
19-Jun-2019 05:59:55 Logging substituted variables...
19-Jun-2019 05:59:55 Indexing build results...
19-Jun-2019 05:59:55 Finished building SCDT-LOCAL20XSKIPPER20X-KAFKA-51.