Build: #188 failed

Job: Run Data Flow Acceptance Tests for Rabbit failed

Stages & jobs

  1. Test Stage - Kafka

  2. Test Stage - Rabbit

Build log

The build generated 1,217 lines of output.The output is too long and has been truncated to the last 1,000 lines. Download or view full build log

06-Dec-2019 00:24:02         },
06-Dec-2019 00:24:02         "dashboard": {
06-Dec-2019 00:24:02             "name": "Spring Cloud Dataflow UI",
06-Dec-2019 00:24:02             "version": "2.0.3.RELEASE"
06-Dec-2019 00:24:02         },
06-Dec-2019 00:24:02         "implementation": {
06-Dec-2019 00:24:02             "name": "spring-cloud-dataflow-server",
06-Dec-2019 00:24:02             "version": "2.0.4.BUILD-SNAPSHOT"
06-Dec-2019 00:24:02         },
06-Dec-2019 00:24:02         "shell": {
06-Dec-2019 00:24:02             "name": "Spring Cloud Data Flow Shell",
06-Dec-2019 00:24:02             "url": "https://repo.spring.io/libs-snapshot/org/springframework/cloud/spring-cloud-dataflow-shell/2.0.4.BUILD-SNAPSHOT/spring-cloud-dataflow-shell-2.0.4.BUILD-SNAPSHOT.jar",
06-Dec-2019 00:24:02             "version": "2.0.4.BUILD-SNAPSHOT"
06-Dec-2019 00:24:02         }
06-Dec-2019 00:24:02     }
06-Dec-2019 00:24:02 }
06-Dec-2019 00:24:02 SKIPPER SERVER ABOUT:
06-Dec-2019 00:24:02 --2019-12-06 00:24:02--  http://localhost:7577/api/about
06-Dec-2019 00:24:02 Resolving localhost (localhost)... ::1, 127.0.0.1
06-Dec-2019 00:24:02 Connecting to localhost (localhost)|::1|:7577... failed: Connection refused.
06-Dec-2019 00:24:02 Connecting to localhost (localhost)|127.0.0.1|:7577... failed: Connection refused.
06-Dec-2019 00:24:02 No JSON object could be decoded
06-Dec-2019 00:24:03 [INFO] Scanning for projects...
06-Dec-2019 00:24:04 [INFO] Downloading: https://repo.spring.io/libs-milestone-local/org/apache/maven/plugins/maven-metadata.xml
06-Dec-2019 00:24:04 [INFO] Downloading: https://repo.spring.io/libs-snapshot-local/org/apache/maven/plugins/maven-metadata.xml
06-Dec-2019 00:24:04 [INFO] Downloading: https://repo.spring.io/libs-snapshot-local/org/codehaus/mojo/maven-metadata.xml
06-Dec-2019 00:24:04 [INFO] Downloading: https://repo.spring.io/libs-milestone-local/org/codehaus/mojo/maven-metadata.xml
06-Dec-2019 00:24:04 [INFO] Downloading: https://repo.spring.io/libs-milestone-local/org/apache/maven/plugins/maven-surefire-report-plugin/maven-metadata.xml
06-Dec-2019 00:24:04 [INFO] Downloading: https://repo.spring.io/libs-snapshot-local/org/apache/maven/plugins/maven-surefire-report-plugin/maven-metadata.xml
06-Dec-2019 00:24:04 [INFO]                                                                         
06-Dec-2019 00:24:04 [INFO] ------------------------------------------------------------------------
06-Dec-2019 00:24:04 [INFO] Building Data Flow Acceptance Tests 1.1.0.BUILD-SNAPSHOT
06-Dec-2019 00:24:04 [INFO] ------------------------------------------------------------------------
06-Dec-2019 00:24:05 [INFO] Downloading: https://repo.spring.io/libs-snapshot-local/org/springframework/cloud/spring-cloud-dataflow-rest-client/1.7.0.BUILD-SNAPSHOT/maven-metadata.xml
06-Dec-2019 00:24:05 [INFO] Downloaded: https://repo.spring.io/libs-snapshot-local/org/springframework/cloud/spring-cloud-dataflow-rest-client/1.7.0.BUILD-SNAPSHOT/maven-metadata.xml (2 KB at 3.2 KB/sec)
06-Dec-2019 00:24:05 [INFO] Downloading: https://repo.spring.io/libs-snapshot-local/org/springframework/cloud/spring-cloud-dataflow-parent/1.7.0.BUILD-SNAPSHOT/maven-metadata.xml
06-Dec-2019 00:24:05 [INFO] Downloaded: https://repo.spring.io/libs-snapshot-local/org/springframework/cloud/spring-cloud-dataflow-parent/1.7.0.BUILD-SNAPSHOT/maven-metadata.xml (646 B at 4.0 KB/sec)
06-Dec-2019 00:24:05 [INFO] Downloading: https://repo.spring.io/libs-snapshot-local/org/springframework/cloud/spring-cloud-dataflow-dependencies/1.7.0.BUILD-SNAPSHOT/maven-metadata.xml
06-Dec-2019 00:24:05 [INFO] Downloaded: https://repo.spring.io/libs-snapshot-local/org/springframework/cloud/spring-cloud-dataflow-dependencies/1.7.0.BUILD-SNAPSHOT/maven-metadata.xml (652 B at 4.0 KB/sec)
06-Dec-2019 00:24:05 [INFO] Downloading: https://repo.spring.io/libs-snapshot-local/org/springframework/cloud/spring-cloud-dataflow-rest-resource/1.7.0.BUILD-SNAPSHOT/maven-metadata.xml
06-Dec-2019 00:24:05 [INFO] Downloaded: https://repo.spring.io/libs-snapshot-local/org/springframework/cloud/spring-cloud-dataflow-rest-resource/1.7.0.BUILD-SNAPSHOT/maven-metadata.xml (2 KB at 8.0 KB/sec)
06-Dec-2019 00:24:05 [INFO] Downloading: https://repo.spring.io/libs-snapshot-local/org/springframework/cloud/spring-cloud-dataflow-core/1.7.0.BUILD-SNAPSHOT/maven-metadata.xml
06-Dec-2019 00:24:06 [INFO] Downloaded: https://repo.spring.io/libs-snapshot-local/org/springframework/cloud/spring-cloud-dataflow-core/1.7.0.BUILD-SNAPSHOT/maven-metadata.xml (2 KB at 8.0 KB/sec)
06-Dec-2019 00:24:06 [INFO]
06-Dec-2019 00:24:06 [INFO] --- maven-checkstyle-plugin:2.17:check (checkstyle-validation) @ spring-cloud-dataflow-acceptance-tests ---
06-Dec-2019 00:24:06 [INFO]
06-Dec-2019 00:24:06 [INFO] --- maven-resources-plugin:2.6:resources (default-resources) @ spring-cloud-dataflow-acceptance-tests ---
06-Dec-2019 00:24:07 [INFO] Using 'UTF-8' encoding to copy filtered resources.
06-Dec-2019 00:24:07 [INFO] skip non existing resourceDirectory /opt/bamboo-home/xml-data/build-dir/SCDT-LOCAL20XSKIPPER20X-RABBIT/src/main/resources
06-Dec-2019 00:24:07 [INFO] skip non existing resourceDirectory /opt/bamboo-home/xml-data/build-dir/SCDT-LOCAL20XSKIPPER20X-RABBIT/src/main/resources
06-Dec-2019 00:24:07 [INFO]
06-Dec-2019 00:24:07 [INFO] --- maven-compiler-plugin:3.1:compile (default-compile) @ spring-cloud-dataflow-acceptance-tests ---
06-Dec-2019 00:24:07 [INFO] Changes detected - recompiling the module!
06-Dec-2019 00:24:07 [INFO] Compiling 8 source files to /opt/bamboo-home/xml-data/build-dir/SCDT-LOCAL20XSKIPPER20X-RABBIT/target/classes
06-Dec-2019 00:24:07 [INFO]
06-Dec-2019 00:24:07 [INFO] --- maven-resources-plugin:2.6:testResources (default-testResources) @ spring-cloud-dataflow-acceptance-tests ---
06-Dec-2019 00:24:07 [INFO] Using 'UTF-8' encoding to copy filtered resources.
06-Dec-2019 00:24:07 [INFO] Copying 1 resource
06-Dec-2019 00:24:07 [INFO]
06-Dec-2019 00:24:07 [INFO] --- maven-compiler-plugin:3.1:testCompile (default-testCompile) @ spring-cloud-dataflow-acceptance-tests ---
06-Dec-2019 00:24:07 [INFO] Changes detected - recompiling the module!
06-Dec-2019 00:24:07 [INFO] Compiling 16 source files to /opt/bamboo-home/xml-data/build-dir/SCDT-LOCAL20XSKIPPER20X-RABBIT/target/test-classes
06-Dec-2019 00:24:08 [WARNING] /opt/bamboo-home/xml-data/build-dir/SCDT-LOCAL20XSKIPPER20X-RABBIT/src/test/java/org/springframework/cloud/dataflow/acceptance/test/AbstractTaskTests.java: Some input files use unchecked or unsafe operations.
06-Dec-2019 00:24:08 [WARNING] /opt/bamboo-home/xml-data/build-dir/SCDT-LOCAL20XSKIPPER20X-RABBIT/src/test/java/org/springframework/cloud/dataflow/acceptance/test/AbstractTaskTests.java: Recompile with -Xlint:unchecked for details.
06-Dec-2019 00:24:08 [INFO]
06-Dec-2019 00:24:08 [INFO] --- maven-surefire-plugin:2.18.1:test (default-test) @ spring-cloud-dataflow-acceptance-tests ---
06-Dec-2019 00:24:08 [INFO] Surefire report directory: /opt/bamboo-home/xml-data/build-dir/SCDT-LOCAL20XSKIPPER20X-RABBIT/target/surefire-reports
06-Dec-2019 00:24:08
06-Dec-2019 00:24:08 -------------------------------------------------------
06-Dec-2019 00:24:08 T E S T S
06-Dec-2019 00:24:08 -------------------------------------------------------
06-Dec-2019 00:24:08 2019-12-06 00:24:08.899  INFO   --- [           main] .b.t.c.SpringBootTestContextBootstrapper : Neither @ContextConfiguration nor @ContextHierarchy found for test class [org.springframework.cloud.dataflow.acceptance.test.AnalyticsTests], using SpringBootContextLoader
06-Dec-2019 00:24:08 2019-12-06 00:24:08.961  INFO   --- [           main] .b.t.c.SpringBootTestContextBootstrapper : Loaded default TestExecutionListener class names from location [META-INF/spring.factories]: [org.springframework.boot.test.mock.mockito.MockitoTestExecutionListener, org.springframework.boot.test.mock.mockito.ResetMocksTestExecutionListener, org.springframework.boot.test.autoconfigure.restdocs.RestDocsTestExecutionListener, org.springframework.boot.test.autoconfigure.web.client.MockRestServiceServerResetTestExecutionListener, org.springframework.boot.test.autoconfigure.web.servlet.MockMvcPrintOnlyOnFailureTestExecutionListener, org.springframework.boot.test.autoconfigure.web.servlet.WebDriverTestExecutionListener, org.springframework.test.context.web.ServletTestExecutionListener, org.springframework.test.context.support.DirtiesContextBeforeModesTestExecutionListener, org.springframework.test.context.support.DependencyInjectionTestExecutionListener, org.springframework.test.context.support.DirtiesContextTestExecutionListener, org.springframework.test.context.transaction.TransactionalTestExecutionListener, org.springframework.test.context.jdbc.SqlScriptsTestExecutionListener]
06-Dec-2019 00:24:08 2019-12-06 00:24:08.980  INFO   --- [           main] .b.t.c.SpringBootTestContextBootstrapper : Using TestExecutionListeners: [org.springframework.test.context.web.ServletTestExecutionListener@4b5d6a01, org.springframework.test.context.support.DirtiesContextBeforeModesTestExecutionListener@4a22f9e2, org.springframework.boot.test.autoconfigure.SpringBootDependencyInjectionTestExecutionListener@3c419631, org.springframework.test.context.support.DirtiesContextTestExecutionListener@418e7838, org.springframework.test.context.transaction.TransactionalTestExecutionListener@61230f6a, org.springframework.test.context.jdbc.SqlScriptsTestExecutionListener@3c130745, org.springframework.boot.test.mock.mockito.MockitoTestExecutionListener@cd3fee8, org.springframework.boot.test.autoconfigure.web.servlet.MockMvcPrintOnlyOnFailureTestExecutionListener@3e2e18f2, org.springframework.boot.test.autoconfigure.web.client.MockRestServiceServerResetTestExecutionListener@470f1802, org.springframework.boot.test.mock.mockito.ResetMocksTestExecutionListener@63021689, org.springframework.boot.test.autoconfigure.web.servlet.WebDriverTestExecutionListener@703580bf, org.springframework.boot.test.autoconfigure.restdocs.RestDocsTestExecutionListener@3e92efc3]
06-Dec-2019 00:24:08 2019-12-06 00:24:08.982  INFO   --- [           main] .b.t.c.SpringBootTestContextBootstrapper : Neither @ContextConfiguration nor @ContextHierarchy found for test class [org.springframework.cloud.dataflow.acceptance.test.WoodChuckTests], using SpringBootContextLoader
06-Dec-2019 00:24:08 2019-12-06 00:24:08.994  INFO   --- [           main] .b.t.c.SpringBootTestContextBootstrapper : Loaded default TestExecutionListener class names from location [META-INF/spring.factories]: [org.springframework.boot.test.mock.mockito.MockitoTestExecutionListener, org.springframework.boot.test.mock.mockito.ResetMocksTestExecutionListener, org.springframework.boot.test.autoconfigure.restdocs.RestDocsTestExecutionListener, org.springframework.boot.test.autoconfigure.web.client.MockRestServiceServerResetTestExecutionListener, org.springframework.boot.test.autoconfigure.web.servlet.MockMvcPrintOnlyOnFailureTestExecutionListener, org.springframework.boot.test.autoconfigure.web.servlet.WebDriverTestExecutionListener, org.springframework.test.context.web.ServletTestExecutionListener, org.springframework.test.context.support.DirtiesContextBeforeModesTestExecutionListener, org.springframework.test.context.support.DependencyInjectionTestExecutionListener, org.springframework.test.context.support.DirtiesContextTestExecutionListener, org.springframework.test.context.transaction.TransactionalTestExecutionListener, org.springframework.test.context.jdbc.SqlScriptsTestExecutionListener]
06-Dec-2019 00:24:08 2019-12-06 00:24:08.998  INFO   --- [           main] .b.t.c.SpringBootTestContextBootstrapper : Using TestExecutionListeners: [org.springframework.test.context.web.ServletTestExecutionListener@7ec7ffd3, org.springframework.test.context.support.DirtiesContextBeforeModesTestExecutionListener@5b239d7d, org.springframework.boot.test.autoconfigure.SpringBootDependencyInjectionTestExecutionListener@6572421, org.springframework.test.context.support.DirtiesContextTestExecutionListener@6b81ce95, org.springframework.test.context.transaction.TransactionalTestExecutionListener@2a798d51, org.springframework.test.context.jdbc.SqlScriptsTestExecutionListener@6d763516, org.springframework.boot.test.mock.mockito.MockitoTestExecutionListener@52bf72b5, org.springframework.boot.test.autoconfigure.web.servlet.MockMvcPrintOnlyOnFailureTestExecutionListener@37afeb11, org.springframework.boot.test.autoconfigure.web.client.MockRestServiceServerResetTestExecutionListener@515aebb0, org.springframework.boot.test.mock.mockito.ResetMocksTestExecutionListener@dd8ba08, org.springframework.boot.test.autoconfigure.web.servlet.WebDriverTestExecutionListener@245b4bdc, org.springframework.boot.test.autoconfigure.restdocs.RestDocsTestExecutionListener@6c64cb25]
06-Dec-2019 00:24:09 2019-12-06 00:24:08.999  INFO   --- [           main] .b.t.c.SpringBootTestContextBootstrapper : Neither @ContextConfiguration nor @ContextHierarchy found for test class [org.springframework.cloud.dataflow.acceptance.test.HttpSourceTests], using SpringBootContextLoader
06-Dec-2019 00:24:09 2019-12-06 00:24:09.010  INFO   --- [           main] .b.t.c.SpringBootTestContextBootstrapper : Loaded default TestExecutionListener class names from location [META-INF/spring.factories]: [org.springframework.boot.test.mock.mockito.MockitoTestExecutionListener, org.springframework.boot.test.mock.mockito.ResetMocksTestExecutionListener, org.springframework.boot.test.autoconfigure.restdocs.RestDocsTestExecutionListener, org.springframework.boot.test.autoconfigure.web.client.MockRestServiceServerResetTestExecutionListener, org.springframework.boot.test.autoconfigure.web.servlet.MockMvcPrintOnlyOnFailureTestExecutionListener, org.springframework.boot.test.autoconfigure.web.servlet.WebDriverTestExecutionListener, org.springframework.test.context.web.ServletTestExecutionListener, org.springframework.test.context.support.DirtiesContextBeforeModesTestExecutionListener, org.springframework.test.context.support.DependencyInjectionTestExecutionListener, org.springframework.test.context.support.DirtiesContextTestExecutionListener, org.springframework.test.context.transaction.TransactionalTestExecutionListener, org.springframework.test.context.jdbc.SqlScriptsTestExecutionListener]
06-Dec-2019 00:24:09 2019-12-06 00:24:09.013  INFO   --- [           main] .b.t.c.SpringBootTestContextBootstrapper : Using TestExecutionListeners: [org.springframework.test.context.web.ServletTestExecutionListener@40a4337a, org.springframework.test.context.support.DirtiesContextBeforeModesTestExecutionListener@6025e1b6, org.springframework.boot.test.autoconfigure.SpringBootDependencyInjectionTestExecutionListener@22ff4249, org.springframework.test.context.support.DirtiesContextTestExecutionListener@2d1ef81a, org.springframework.test.context.transaction.TransactionalTestExecutionListener@4c402120, org.springframework.test.context.jdbc.SqlScriptsTestExecutionListener@327514f, org.springframework.boot.test.mock.mockito.MockitoTestExecutionListener@5b12b668, org.springframework.boot.test.autoconfigure.web.servlet.MockMvcPrintOnlyOnFailureTestExecutionListener@1165b38, org.springframework.boot.test.autoconfigure.web.client.MockRestServiceServerResetTestExecutionListener@4c12331b, org.springframework.boot.test.mock.mockito.ResetMocksTestExecutionListener@7586beff, org.springframework.boot.test.autoconfigure.web.servlet.WebDriverTestExecutionListener@3b69e7d1, org.springframework.boot.test.autoconfigure.restdocs.RestDocsTestExecutionListener@815b41f]
06-Dec-2019 00:24:09 2019-12-06 00:24:09.030  INFO   --- [           main] .b.t.c.SpringBootTestContextBootstrapper : Neither @ContextConfiguration nor @ContextHierarchy found for test class [org.springframework.cloud.dataflow.acceptance.test.TickTockTests], using SpringBootContextLoader
06-Dec-2019 00:24:09 2019-12-06 00:24:09.039  INFO   --- [           main] .b.t.c.SpringBootTestContextBootstrapper : Loaded default TestExecutionListener class names from location [META-INF/spring.factories]: [org.springframework.boot.test.mock.mockito.MockitoTestExecutionListener, org.springframework.boot.test.mock.mockito.ResetMocksTestExecutionListener, org.springframework.boot.test.autoconfigure.restdocs.RestDocsTestExecutionListener, org.springframework.boot.test.autoconfigure.web.client.MockRestServiceServerResetTestExecutionListener, org.springframework.boot.test.autoconfigure.web.servlet.MockMvcPrintOnlyOnFailureTestExecutionListener, org.springframework.boot.test.autoconfigure.web.servlet.WebDriverTestExecutionListener, org.springframework.test.context.web.ServletTestExecutionListener, org.springframework.test.context.support.DirtiesContextBeforeModesTestExecutionListener, org.springframework.test.context.support.DependencyInjectionTestExecutionListener, org.springframework.test.context.support.DirtiesContextTestExecutionListener, org.springframework.test.context.transaction.TransactionalTestExecutionListener, org.springframework.test.context.jdbc.SqlScriptsTestExecutionListener]
06-Dec-2019 00:24:09 2019-12-06 00:24:09.042  INFO   --- [           main] .b.t.c.SpringBootTestContextBootstrapper : Using TestExecutionListeners: [org.springframework.test.context.web.ServletTestExecutionListener@55b53d44, org.springframework.test.context.support.DirtiesContextBeforeModesTestExecutionListener@482bce4f, org.springframework.boot.test.autoconfigure.SpringBootDependencyInjectionTestExecutionListener@366647c2, org.springframework.test.context.support.DirtiesContextTestExecutionListener@6a6afff2, org.springframework.test.context.transaction.TransactionalTestExecutionListener@1649b0e6, org.springframework.test.context.jdbc.SqlScriptsTestExecutionListener@865dd6, org.springframework.boot.test.mock.mockito.MockitoTestExecutionListener@4da4253, org.springframework.boot.test.autoconfigure.web.servlet.MockMvcPrintOnlyOnFailureTestExecutionListener@3972a855, org.springframework.boot.test.autoconfigure.web.client.MockRestServiceServerResetTestExecutionListener@62e7f11d, org.springframework.boot.test.mock.mockito.ResetMocksTestExecutionListener@503d687a, org.springframework.boot.test.autoconfigure.web.servlet.WebDriverTestExecutionListener@6a370f4, org.springframework.boot.test.autoconfigure.restdocs.RestDocsTestExecutionListener@2abf4075]
06-Dec-2019 00:24:09 2019-12-06 00:24:09.050  INFO   --- [           main] .b.t.c.SpringBootTestContextBootstrapper : Neither @ContextConfiguration nor @ContextHierarchy found for test class [org.springframework.cloud.dataflow.acceptance.test.TransformTests], using SpringBootContextLoader
06-Dec-2019 00:24:09 2019-12-06 00:24:09.058  INFO   --- [           main] .b.t.c.SpringBootTestContextBootstrapper : Loaded default TestExecutionListener class names from location [META-INF/spring.factories]: [org.springframework.boot.test.mock.mockito.MockitoTestExecutionListener, org.springframework.boot.test.mock.mockito.ResetMocksTestExecutionListener, org.springframework.boot.test.autoconfigure.restdocs.RestDocsTestExecutionListener, org.springframework.boot.test.autoconfigure.web.client.MockRestServiceServerResetTestExecutionListener, org.springframework.boot.test.autoconfigure.web.servlet.MockMvcPrintOnlyOnFailureTestExecutionListener, org.springframework.boot.test.autoconfigure.web.servlet.WebDriverTestExecutionListener, org.springframework.test.context.web.ServletTestExecutionListener, org.springframework.test.context.support.DirtiesContextBeforeModesTestExecutionListener, org.springframework.test.context.support.DependencyInjectionTestExecutionListener, org.springframework.test.context.support.DirtiesContextTestExecutionListener, org.springframework.test.context.transaction.TransactionalTestExecutionListener, org.springframework.test.context.jdbc.SqlScriptsTestExecutionListener]
06-Dec-2019 00:24:09 2019-12-06 00:24:09.061  INFO   --- [           main] .b.t.c.SpringBootTestContextBootstrapper : Using TestExecutionListeners: [org.springframework.test.context.web.ServletTestExecutionListener@51e69659, org.springframework.test.context.support.DirtiesContextBeforeModesTestExecutionListener@47e2e487, org.springframework.boot.test.autoconfigure.SpringBootDependencyInjectionTestExecutionListener@201a4587, org.springframework.test.context.support.DirtiesContextTestExecutionListener@61001b64, org.springframework.test.context.transaction.TransactionalTestExecutionListener@4310d43, org.springframework.test.context.jdbc.SqlScriptsTestExecutionListener@54a7079e, org.springframework.boot.test.mock.mockito.MockitoTestExecutionListener@26e356f0, org.springframework.boot.test.autoconfigure.web.servlet.MockMvcPrintOnlyOnFailureTestExecutionListener@47d9a273, org.springframework.boot.test.autoconfigure.web.client.MockRestServiceServerResetTestExecutionListener@4b8ee4de, org.springframework.boot.test.mock.mockito.ResetMocksTestExecutionListener@27f981c6, org.springframework.boot.test.autoconfigure.web.servlet.WebDriverTestExecutionListener@1b11171f, org.springframework.boot.test.autoconfigure.restdocs.RestDocsTestExecutionListener@1151e434]
06-Dec-2019 00:24:09 2019-12-06 00:24:09.073  INFO   --- [           main] .b.t.c.SpringBootTestContextBootstrapper : Neither @ContextConfiguration nor @ContextHierarchy found for test class [org.springframework.cloud.dataflow.acceptance.test.NamedChannelTests], using SpringBootContextLoader
06-Dec-2019 00:24:09 2019-12-06 00:24:09.080  INFO   --- [           main] .b.t.c.SpringBootTestContextBootstrapper : Loaded default TestExecutionListener class names from location [META-INF/spring.factories]: [org.springframework.boot.test.mock.mockito.MockitoTestExecutionListener, org.springframework.boot.test.mock.mockito.ResetMocksTestExecutionListener, org.springframework.boot.test.autoconfigure.restdocs.RestDocsTestExecutionListener, org.springframework.boot.test.autoconfigure.web.client.MockRestServiceServerResetTestExecutionListener, org.springframework.boot.test.autoconfigure.web.servlet.MockMvcPrintOnlyOnFailureTestExecutionListener, org.springframework.boot.test.autoconfigure.web.servlet.WebDriverTestExecutionListener, org.springframework.test.context.web.ServletTestExecutionListener, org.springframework.test.context.support.DirtiesContextBeforeModesTestExecutionListener, org.springframework.test.context.support.DependencyInjectionTestExecutionListener, org.springframework.test.context.support.DirtiesContextTestExecutionListener, org.springframework.test.context.transaction.TransactionalTestExecutionListener, org.springframework.test.context.jdbc.SqlScriptsTestExecutionListener]
06-Dec-2019 00:24:09 2019-12-06 00:24:09.083  INFO   --- [           main] .b.t.c.SpringBootTestContextBootstrapper : Using TestExecutionListeners: [org.springframework.test.context.web.ServletTestExecutionListener@70cf32e3, org.springframework.test.context.support.DirtiesContextBeforeModesTestExecutionListener@5a59ca5e, org.springframework.boot.test.autoconfigure.SpringBootDependencyInjectionTestExecutionListener@4bdeaabb, org.springframework.test.context.support.DirtiesContextTestExecutionListener@6c4906d3, org.springframework.test.context.transaction.TransactionalTestExecutionListener@65987993, org.springframework.test.context.jdbc.SqlScriptsTestExecutionListener@71075444, org.springframework.boot.test.mock.mockito.MockitoTestExecutionListener@4f32a3ad, org.springframework.boot.test.autoconfigure.web.servlet.MockMvcPrintOnlyOnFailureTestExecutionListener@6b695b06, org.springframework.boot.test.autoconfigure.web.client.MockRestServiceServerResetTestExecutionListener@4d1bf319, org.springframework.boot.test.mock.mockito.ResetMocksTestExecutionListener@6f53b8a, org.springframework.boot.test.autoconfigure.web.servlet.WebDriverTestExecutionListener@5c80cf32, org.springframework.boot.test.autoconfigure.restdocs.RestDocsTestExecutionListener@7d900ecf]
06-Dec-2019 00:24:09 Running org.springframework.cloud.dataflow.acceptance.test.AnalyticsTests
06-Dec-2019 00:24:09 2019-12-06 00:24:09.112  INFO   --- [           main] .b.t.c.SpringBootTestContextBootstrapper : Neither @ContextConfiguration nor @ContextHierarchy found for test class [org.springframework.cloud.dataflow.acceptance.test.AnalyticsTests], using SpringBootContextLoader
06-Dec-2019 00:24:09 2019-12-06 00:24:09.131  INFO   --- [           main] .b.t.c.SpringBootTestContextBootstrapper : Loaded default TestExecutionListener class names from location [META-INF/spring.factories]: [org.springframework.boot.test.mock.mockito.MockitoTestExecutionListener, org.springframework.boot.test.mock.mockito.ResetMocksTestExecutionListener, org.springframework.boot.test.autoconfigure.restdocs.RestDocsTestExecutionListener, org.springframework.boot.test.autoconfigure.web.client.MockRestServiceServerResetTestExecutionListener, org.springframework.boot.test.autoconfigure.web.servlet.MockMvcPrintOnlyOnFailureTestExecutionListener, org.springframework.boot.test.autoconfigure.web.servlet.WebDriverTestExecutionListener, org.springframework.test.context.web.ServletTestExecutionListener, org.springframework.test.context.support.DirtiesContextBeforeModesTestExecutionListener, org.springframework.test.context.support.DependencyInjectionTestExecutionListener, org.springframework.test.context.support.DirtiesContextTestExecutionListener, org.springframework.test.context.transaction.TransactionalTestExecutionListener, org.springframework.test.context.jdbc.SqlScriptsTestExecutionListener]
06-Dec-2019 00:24:09 2019-12-06 00:24:09.135  INFO   --- [           main] .b.t.c.SpringBootTestContextBootstrapper : Using TestExecutionListeners: [org.springframework.test.context.web.ServletTestExecutionListener@77659b30, org.springframework.test.context.support.DirtiesContextBeforeModesTestExecutionListener@456d6c1e, org.springframework.boot.test.autoconfigure.SpringBootDependencyInjectionTestExecutionListener@1e13529a, org.springframework.test.context.support.DirtiesContextTestExecutionListener@1ec9bd38, org.springframework.test.context.transaction.TransactionalTestExecutionListener@452e19ca, org.springframework.test.context.jdbc.SqlScriptsTestExecutionListener@6b0d80ed, org.springframework.boot.test.mock.mockito.MockitoTestExecutionListener@6f8e8894, org.springframework.boot.test.autoconfigure.web.servlet.MockMvcPrintOnlyOnFailureTestExecutionListener@3cfdd820, org.springframework.boot.test.autoconfigure.web.client.MockRestServiceServerResetTestExecutionListener@928763c, org.springframework.boot.test.mock.mockito.ResetMocksTestExecutionListener@e25951c, org.springframework.boot.test.autoconfigure.web.servlet.WebDriverTestExecutionListener@15f47664, org.springframework.boot.test.autoconfigure.restdocs.RestDocsTestExecutionListener@471a9022]
06-Dec-2019 00:24:09 2019-12-06 00:24:09.843  INFO 6646 --- [           main] s.c.a.AnnotationConfigApplicationContext : Refreshing org.springframework.context.annotation.AnnotationConfigApplicationContext@2fa7ae9: startup date [Fri Dec 06 00:24:09 UTC 2019]; root of context hierarchy
06-Dec-2019 00:24:10 2019-12-06 00:24:10.103  INFO 6646 --- [           main] trationDelegate$BeanPostProcessorChecker : Bean 'configurationPropertiesRebinderAutoConfiguration' of type [class org.springframework.cloud.autoconfigure.ConfigurationPropertiesRebinderAutoConfiguration$$EnhancerBySpringCGLIB$$ed959188] is not eligible for getting processed by all BeanPostProcessors (for example: not eligible for auto-proxying)
06-Dec-2019 00:24:10
06-Dec-2019 00:24:10   .   ____          _            __ _ _
06-Dec-2019 00:24:10 /\\ / ___'_ __ _ _(_)_ __  __ _ \ \ \ \
06-Dec-2019 00:24:10 ( ( )\___ | '_ | '_| | '_ \/ _` | \ \ \ \
06-Dec-2019 00:24:10 \\/  ___)| |_)| | | | | || (_| |  ) ) ) )
06-Dec-2019 00:24:10   '  |____| .__|_| |_|_| |_\__, | / / / /
06-Dec-2019 00:24:10 =========|_|==============|___/=/_/_/_/
06-Dec-2019 00:24:10 :: Spring Boot ::        (v1.4.1.RELEASE)
06-Dec-2019 00:24:10
06-Dec-2019 00:24:10 2019-12-06 00:24:10.396  INFO 6646 --- [           main] c.c.c.ConfigServicePropertySourceLocator : Fetching config from server at: http://localhost:8888
06-Dec-2019 00:24:10 2019-12-06 00:24:10.477  WARN 6646 --- [           main] c.c.c.ConfigServicePropertySourceLocator : Could not locate PropertySource: I/O error on GET request for "http://localhost:8888//blah": Connection refused (Connection refused); nested exception is java.net.ConnectException: Connection refused (Connection refused)
06-Dec-2019 00:24:10 2019-12-06 00:24:10.485  INFO 6646 --- [           main] o.s.c.d.acceptance.test.AnalyticsTests   : The following profiles are active: blah
06-Dec-2019 00:24:10 2019-12-06 00:24:10.696  INFO 6646 --- [           main] o.s.c.d.acceptance.test.AnalyticsTests   : Started AnalyticsTests in 1.487 seconds (JVM running for 2.254)
06-Dec-2019 00:24:10 2019-12-06 00:24:10.917  INFO 6646 --- [           main] junit.logTestName                        : Starting Test analyticsTest(org.springframework.cloud.dataflow.acceptance.test.AnalyticsTests)
06-Dec-2019 00:24:10 2019-12-06 00:24:10.928  INFO 6646 --- [           main] o.s.c.d.acceptance.test.AnalyticsTests   : Importing stream apps from uri resource: https://dataflow.spring.io/rabbitmq-maven-latest
06-Dec-2019 00:24:13 2019-12-06 00:24:13.162  INFO 6646 --- [           main] junit.logTestName                        : Finished Test analyticsTest(org.springframework.cloud.dataflow.acceptance.test.AnalyticsTests)
06-Dec-2019 00:24:13 2019-12-06 00:24:13.162  INFO 6646 --- [           main] o.s.c.d.acceptance.test.AnalyticsTests   : Destroy all streams
06-Dec-2019 00:24:13 Tests run: 1, Failures: 0, Errors: 0, Skipped: 1, Time elapsed: 4.07 sec - in org.springframework.cloud.dataflow.acceptance.test.AnalyticsTests
06-Dec-2019 00:24:13 Running org.springframework.cloud.dataflow.acceptance.test.WoodChuckTests
06-Dec-2019 00:24:13 2019-12-06 00:24:13.182  INFO 6646 --- [           main] .b.t.c.SpringBootTestContextBootstrapper : Neither @ContextConfiguration nor @ContextHierarchy found for test class [org.springframework.cloud.dataflow.acceptance.test.WoodChuckTests], using SpringBootContextLoader
06-Dec-2019 00:24:13 2019-12-06 00:24:13.190  INFO 6646 --- [           main] .b.t.c.SpringBootTestContextBootstrapper : Loaded default TestExecutionListener class names from location [META-INF/spring.factories]: [org.springframework.boot.test.mock.mockito.MockitoTestExecutionListener, org.springframework.boot.test.mock.mockito.ResetMocksTestExecutionListener, org.springframework.boot.test.autoconfigure.restdocs.RestDocsTestExecutionListener, org.springframework.boot.test.autoconfigure.web.client.MockRestServiceServerResetTestExecutionListener, org.springframework.boot.test.autoconfigure.web.servlet.MockMvcPrintOnlyOnFailureTestExecutionListener, org.springframework.boot.test.autoconfigure.web.servlet.WebDriverTestExecutionListener, org.springframework.test.context.web.ServletTestExecutionListener, org.springframework.test.context.support.DirtiesContextBeforeModesTestExecutionListener, org.springframework.test.context.support.DependencyInjectionTestExecutionListener, org.springframework.test.context.support.DirtiesContextTestExecutionListener, org.springframework.test.context.transaction.TransactionalTestExecutionListener, org.springframework.test.context.jdbc.SqlScriptsTestExecutionListener]
06-Dec-2019 00:24:13 2019-12-06 00:24:13.193  INFO 6646 --- [           main] .b.t.c.SpringBootTestContextBootstrapper : Using TestExecutionListeners: [org.springframework.test.context.web.ServletTestExecutionListener@43045f9f, org.springframework.test.context.support.DirtiesContextBeforeModesTestExecutionListener@2643d762, org.springframework.boot.test.autoconfigure.SpringBootDependencyInjectionTestExecutionListener@6403e24c, org.springframework.test.context.support.DirtiesContextTestExecutionListener@2f236de0, org.springframework.test.context.transaction.TransactionalTestExecutionListener@4eba373c, org.springframework.test.context.jdbc.SqlScriptsTestExecutionListener@767a014e, org.springframework.boot.test.mock.mockito.MockitoTestExecutionListener@d109c4f, org.springframework.boot.test.autoconfigure.web.servlet.MockMvcPrintOnlyOnFailureTestExecutionListener@3968bc60, org.springframework.boot.test.autoconfigure.web.client.MockRestServiceServerResetTestExecutionListener@26f46fa6, org.springframework.boot.test.mock.mockito.ResetMocksTestExecutionListener@227a47, org.springframework.boot.test.autoconfigure.web.servlet.WebDriverTestExecutionListener@9596ce8, org.springframework.boot.test.autoconfigure.restdocs.RestDocsTestExecutionListener@75ae4a1f]
06-Dec-2019 00:24:13 2019-12-06 00:24:13.266  INFO 6646 --- [           main] junit.logTestName                        : Starting Test testPartitioning(org.springframework.cloud.dataflow.acceptance.test.WoodChuckTests)
06-Dec-2019 00:24:13 2019-12-06 00:24:13.277  INFO 6646 --- [           main] o.s.c.d.acceptance.test.WoodChuckTests   : Creating stream 'WOODCHUCK-TEST'
06-Dec-2019 00:24:13 2019-12-06 00:24:13.373 ERROR 6646 --- [           main] junit.logTestName                        : !!! Test testPartitioning(org.springframework.cloud.dataflow.acceptance.test.WoodChuckTests) Failed !!!
06-Dec-2019 00:24:13
06-Dec-2019 00:24:13 org.springframework.cloud.dataflow.rest.client.DataFlowClientException: I/O error on GET request for "http://localhost:7577/api/release/status/WOODCHUCK-TEST": Connect to localhost:7577 [localhost/127.0.0.1, localhost/0:0:0:0:0:0:0:1] failed: Connection refused (Connection refused); nested exception is org.apache.http.conn.HttpHostConnectException: Connect to localhost:7577 [localhost/127.0.0.1, localhost/0:0:0:0:0:0:0:1] failed: Connection refused (Connection refused)
06-Dec-2019 00:24:13
06-Dec-2019 00:24:13         at org.springframework.cloud.dataflow.rest.client.VndErrorResponseErrorHandler.handleError(VndErrorResponseErrorHandler.java:63)
06-Dec-2019 00:24:13         at org.springframework.web.client.RestTemplate.handleResponse(RestTemplate.java:667)
06-Dec-2019 00:24:13         at org.springframework.web.client.RestTemplate.doExecute(RestTemplate.java:620)
06-Dec-2019 00:24:13         at org.springframework.web.client.RestTemplate.execute(RestTemplate.java:580)
06-Dec-2019 00:24:13         at org.springframework.web.client.RestTemplate.postForObject(RestTemplate.java:380)
06-Dec-2019 00:24:13         at org.springframework.cloud.dataflow.rest.client.StreamTemplate.createStream(StreamTemplate.java:120)
06-Dec-2019 00:24:13         at org.springframework.cloud.dataflow.acceptance.test.AbstractStreamTests.deployStream(AbstractStreamTests.java:169)
06-Dec-2019 00:24:13         at org.springframework.cloud.dataflow.acceptance.test.WoodChuckTests.testPartitioning(WoodChuckTests.java:43)
06-Dec-2019 00:24:13         at sun.reflect.NativeMethodAccessorImpl.invoke0(Native Method)
06-Dec-2019 00:24:13         at sun.reflect.NativeMethodAccessorImpl.invoke(NativeMethodAccessorImpl.java:62)
06-Dec-2019 00:24:13         at sun.reflect.DelegatingMethodAccessorImpl.invoke(DelegatingMethodAccessorImpl.java:43)
06-Dec-2019 00:24:13         at java.lang.reflect.Method.invoke(Method.java:498)
06-Dec-2019 00:24:13         at org.junit.runners.model.FrameworkMethod$1.runReflectiveCall(FrameworkMethod.java:50)
06-Dec-2019 00:24:13         at org.junit.internal.runners.model.ReflectiveCallable.run(ReflectiveCallable.java:12)
06-Dec-2019 00:24:13         at org.junit.runners.model.FrameworkMethod.invokeExplosively(FrameworkMethod.java:47)
06-Dec-2019 00:24:13         at org.junit.internal.runners.statements.InvokeMethod.evaluate(InvokeMethod.java:17)
06-Dec-2019 00:24:13         at org.junit.internal.runners.statements.RunBefores.evaluate(RunBefores.java:26)
06-Dec-2019 00:24:13         at org.springframework.test.context.junit4.statements.RunBeforeTestMethodCallbacks.evaluate(RunBeforeTestMethodCallbacks.java:75)
06-Dec-2019 00:24:13         at org.springframework.test.context.junit4.statements.RunAfterTestMethodCallbacks.evaluate(RunAfterTestMethodCallbacks.java:86)
06-Dec-2019 00:24:13         at org.junit.rules.TestWatcher$1.evaluate(TestWatcher.java:55)
06-Dec-2019 00:24:13         at org.junit.rules.ExternalResource$1.evaluate(ExternalResource.java:48)
06-Dec-2019 00:24:13         at org.junit.rules.RunRules.evaluate(RunRules.java:20)
06-Dec-2019 00:24:13         at org.springframework.test.context.junit4.statements.SpringRepeat.evaluate(SpringRepeat.java:84)
06-Dec-2019 00:24:13         at org.junit.runners.ParentRunner.runLeaf(ParentRunner.java:325)
06-Dec-2019 00:24:13         at org.springframework.test.context.junit4.SpringJUnit4ClassRunner.runChild(SpringJUnit4ClassRunner.java:252)
06-Dec-2019 00:24:13         at org.springframework.test.context.junit4.SpringJUnit4ClassRunner.runChild(SpringJUnit4ClassRunner.java:94)
06-Dec-2019 00:24:13         at org.junit.runners.ParentRunner$3.run(ParentRunner.java:290)
06-Dec-2019 00:24:13         at org.junit.runners.ParentRunner$1.schedule(ParentRunner.java:71)
06-Dec-2019 00:24:13         at org.junit.runners.ParentRunner.runChildren(ParentRunner.java:288)
06-Dec-2019 00:24:13         at org.junit.runners.ParentRunner.access$000(ParentRunner.java:58)
06-Dec-2019 00:24:13         at org.junit.runners.ParentRunner$2.evaluate(ParentRunner.java:268)
06-Dec-2019 00:24:13         at org.springframework.test.context.junit4.statements.RunBeforeTestClassCallbacks.evaluate(RunBeforeTestClassCallbacks.java:61)
06-Dec-2019 00:24:13         at org.springframework.test.context.junit4.statements.RunAfterTestClassCallbacks.evaluate(RunAfterTestClassCallbacks.java:70)
06-Dec-2019 00:24:13         at org.junit.runners.ParentRunner.run(ParentRunner.java:363)
06-Dec-2019 00:24:13         at org.springframework.test.context.junit4.SpringJUnit4ClassRunner.run(SpringJUnit4ClassRunner.java:191)
06-Dec-2019 00:24:13         at org.apache.maven.surefire.junit4.JUnit4Provider.execute(JUnit4Provider.java:283)
06-Dec-2019 00:24:13         at org.apache.maven.surefire.junit4.JUnit4Provider.executeWithRerun(JUnit4Provider.java:173)
06-Dec-2019 00:24:13         at org.apache.maven.surefire.junit4.JUnit4Provider.executeTestSet(JUnit4Provider.java:153)
06-Dec-2019 00:24:13         at org.apache.maven.surefire.junit4.JUnit4Provider.invoke(JUnit4Provider.java:128)
06-Dec-2019 00:24:13         at org.apache.maven.surefire.booter.ForkedBooter.invokeProviderInSameClassLoader(ForkedBooter.java:203)
06-Dec-2019 00:24:13         at org.apache.maven.surefire.booter.ForkedBooter.runSuitesInProcess(ForkedBooter.java:155)
06-Dec-2019 00:24:13         at org.apache.maven.surefire.booter.ForkedBooter.main(ForkedBooter.java:103)
06-Dec-2019 00:24:13
06-Dec-2019 00:24:13 2019-12-06 00:24:13.373  INFO 6646 --- [           main] junit.logTestName                        : Finished Test testPartitioning(org.springframework.cloud.dataflow.acceptance.test.WoodChuckTests)
06-Dec-2019 00:24:13 2019-12-06 00:24:13.373  INFO 6646 --- [           main] o.s.c.d.acceptance.test.WoodChuckTests   : Destroy all streams
06-Dec-2019 00:24:13 Tests run: 1, Failures: 0, Errors: 1, Skipped: 0, Time elapsed: 0.152 sec <<< FAILURE! - in org.springframework.cloud.dataflow.acceptance.test.WoodChuckTests
06-Dec-2019 00:24:13 testPartitioning(org.springframework.cloud.dataflow.acceptance.test.WoodChuckTests)  Time elapsed: 0.124 sec  <<< ERROR!
06-Dec-2019 00:24:13 org.springframework.cloud.dataflow.rest.client.DataFlowClientException: I/O error on GET request for "http://localhost:7577/api": Connect to localhost:7577 [localhost/127.0.0.1, localhost/0:0:0:0:0:0:0:1] failed: Connection refused (Connection refused); nested exception is org.apache.http.conn.HttpHostConnectException: Connect to localhost:7577 [localhost/127.0.0.1, localhost/0:0:0:0:0:0:0:1] failed: Connection refused (Connection refused)
06-Dec-2019 00:24:13
06-Dec-2019 00:24:13         at org.springframework.cloud.dataflow.rest.client.VndErrorResponseErrorHandler.handleError(VndErrorResponseErrorHandler.java:63)
06-Dec-2019 00:24:13         at org.springframework.web.client.RestTemplate.handleResponse(RestTemplate.java:667)
06-Dec-2019 00:24:13         at org.springframework.web.client.RestTemplate.doExecute(RestTemplate.java:620)
06-Dec-2019 00:24:13         at org.springframework.web.client.RestTemplate.execute(RestTemplate.java:580)
06-Dec-2019 00:24:13         at org.springframework.web.client.RestTemplate.delete(RestTemplate.java:452)
06-Dec-2019 00:24:13         at org.springframework.cloud.dataflow.rest.client.StreamTemplate.destroyAll(StreamTemplate.java:147)
06-Dec-2019 00:24:13         at org.springframework.cloud.dataflow.acceptance.test.AbstractStreamTests$1.after(AbstractStreamTests.java:119)
06-Dec-2019 00:24:13         at org.junit.rules.ExternalResource$1.evaluate(ExternalResource.java:50)
06-Dec-2019 00:24:13         at org.junit.rules.RunRules.evaluate(RunRules.java:20)
06-Dec-2019 00:24:13         at org.springframework.test.context.junit4.statements.SpringRepeat.evaluate(SpringRepeat.java:84)
06-Dec-2019 00:24:13         at org.junit.runners.ParentRunner.runLeaf(ParentRunner.java:325)
06-Dec-2019 00:24:13         at org.springframework.test.context.junit4.SpringJUnit4ClassRunner.runChild(SpringJUnit4ClassRunner.java:252)
06-Dec-2019 00:24:13         at org.springframework.test.context.junit4.SpringJUnit4ClassRunner.runChild(SpringJUnit4ClassRunner.java:94)
06-Dec-2019 00:24:13         at org.junit.runners.ParentRunner$3.run(ParentRunner.java:290)
06-Dec-2019 00:24:13         at org.junit.runners.ParentRunner$1.schedule(ParentRunner.java:71)
06-Dec-2019 00:24:13         at org.junit.runners.ParentRunner.runChildren(ParentRunner.java:288)
06-Dec-2019 00:24:13         at org.junit.runners.ParentRunner.access$000(ParentRunner.java:58)
06-Dec-2019 00:24:13         at org.junit.runners.ParentRunner$2.evaluate(ParentRunner.java:268)
06-Dec-2019 00:24:13         at org.springframework.test.context.junit4.statements.RunBeforeTestClassCallbacks.evaluate(RunBeforeTestClassCallbacks.java:61)
06-Dec-2019 00:24:13         at org.springframework.test.context.junit4.statements.RunAfterTestClassCallbacks.evaluate(RunAfterTestClassCallbacks.java:70)
06-Dec-2019 00:24:13         at org.junit.runners.ParentRunner.run(ParentRunner.java:363)
06-Dec-2019 00:24:13         at org.springframework.test.context.junit4.SpringJUnit4ClassRunner.run(SpringJUnit4ClassRunner.java:191)
06-Dec-2019 00:24:13         at org.apache.maven.surefire.junit4.JUnit4Provider.execute(JUnit4Provider.java:283)
06-Dec-2019 00:24:13         at org.apache.maven.surefire.junit4.JUnit4Provider.executeWithRerun(JUnit4Provider.java:173)
06-Dec-2019 00:24:13         at org.apache.maven.surefire.junit4.JUnit4Provider.executeTestSet(JUnit4Provider.java:153)
06-Dec-2019 00:24:13         at org.apache.maven.surefire.junit4.JUnit4Provider.invoke(JUnit4Provider.java:128)
06-Dec-2019 00:24:13         at org.apache.maven.surefire.booter.ForkedBooter.invokeProviderInSameClassLoader(ForkedBooter.java:203)
06-Dec-2019 00:24:13         at org.apache.maven.surefire.booter.ForkedBooter.runSuitesInProcess(ForkedBooter.java:155)
06-Dec-2019 00:24:13         at org.apache.maven.surefire.booter.ForkedBooter.main(ForkedBooter.java:103)
06-Dec-2019 00:24:13
06-Dec-2019 00:24:13 Running org.springframework.cloud.dataflow.acceptance.test.HttpSourceTests
06-Dec-2019 00:24:13 2019-12-06 00:24:13.390  INFO 6646 --- [           main] .b.t.c.SpringBootTestContextBootstrapper : Neither @ContextConfiguration nor @ContextHierarchy found for test class [org.springframework.cloud.dataflow.acceptance.test.HttpSourceTests], using SpringBootContextLoader
06-Dec-2019 00:24:13 2019-12-06 00:24:13.395  INFO 6646 --- [           main] .b.t.c.SpringBootTestContextBootstrapper : Loaded default TestExecutionListener class names from location [META-INF/spring.factories]: [org.springframework.boot.test.mock.mockito.MockitoTestExecutionListener, org.springframework.boot.test.mock.mockito.ResetMocksTestExecutionListener, org.springframework.boot.test.autoconfigure.restdocs.RestDocsTestExecutionListener, org.springframework.boot.test.autoconfigure.web.client.MockRestServiceServerResetTestExecutionListener, org.springframework.boot.test.autoconfigure.web.servlet.MockMvcPrintOnlyOnFailureTestExecutionListener, org.springframework.boot.test.autoconfigure.web.servlet.WebDriverTestExecutionListener, org.springframework.test.context.web.ServletTestExecutionListener, org.springframework.test.context.support.DirtiesContextBeforeModesTestExecutionListener, org.springframework.test.context.support.DependencyInjectionTestExecutionListener, org.springframework.test.context.support.DirtiesContextTestExecutionListener, org.springframework.test.context.transaction.TransactionalTestExecutionListener, org.springframework.test.context.jdbc.SqlScriptsTestExecutionListener]
06-Dec-2019 00:24:13 2019-12-06 00:24:13.396  INFO 6646 --- [           main] .b.t.c.SpringBootTestContextBootstrapper : Using TestExecutionListeners: [org.springframework.test.context.web.ServletTestExecutionListener@242b6e1a, org.springframework.test.context.support.DirtiesContextBeforeModesTestExecutionListener@39a87e72, org.springframework.boot.test.autoconfigure.SpringBootDependencyInjectionTestExecutionListener@5d2828c9, org.springframework.test.context.support.DirtiesContextTestExecutionListener@3a082ff4, org.springframework.test.context.transaction.TransactionalTestExecutionListener@45acdd11, org.springframework.test.context.jdbc.SqlScriptsTestExecutionListener@3f0d6038, org.springframework.boot.test.mock.mockito.MockitoTestExecutionListener@237f7970, org.springframework.boot.test.autoconfigure.web.servlet.MockMvcPrintOnlyOnFailureTestExecutionListener@58f39564, org.springframework.boot.test.autoconfigure.web.client.MockRestServiceServerResetTestExecutionListener@7b948f3e, org.springframework.boot.test.mock.mockito.ResetMocksTestExecutionListener@2f4c2cd4, org.springframework.boot.test.autoconfigure.web.servlet.WebDriverTestExecutionListener@77a074b4, org.springframework.boot.test.autoconfigure.restdocs.RestDocsTestExecutionListener@333c8791]
06-Dec-2019 00:24:13 2019-12-06 00:24:13.437  INFO 6646 --- [           main] junit.logTestName                        : Starting Test httpSourceTests(org.springframework.cloud.dataflow.acceptance.test.HttpSourceTests)
06-Dec-2019 00:24:13 2019-12-06 00:24:13.439  INFO 6646 --- [           main] o.s.c.d.acceptance.test.HttpSourceTests  : Creating stream 'HTTP-TEST'
06-Dec-2019 00:24:13 2019-12-06 00:24:13.468 ERROR 6646 --- [           main] junit.logTestName                        : !!! Test httpSourceTests(org.springframework.cloud.dataflow.acceptance.test.HttpSourceTests) Failed !!!
06-Dec-2019 00:24:13
06-Dec-2019 00:24:13 org.springframework.cloud.dataflow.rest.client.DataFlowClientException: I/O error on GET request for "http://localhost:7577/api/release/status/HTTP-TEST": Connect to localhost:7577 [localhost/127.0.0.1, localhost/0:0:0:0:0:0:0:1] failed: Connection refused (Connection refused); nested exception is org.apache.http.conn.HttpHostConnectException: Connect to localhost:7577 [localhost/127.0.0.1, localhost/0:0:0:0:0:0:0:1] failed: Connection refused (Connection refused)
06-Dec-2019 00:24:13
06-Dec-2019 00:24:13         at org.springframework.cloud.dataflow.rest.client.VndErrorResponseErrorHandler.handleError(VndErrorResponseErrorHandler.java:63)
06-Dec-2019 00:24:13         at org.springframework.web.client.RestTemplate.handleResponse(RestTemplate.java:667)
06-Dec-2019 00:24:13         at org.springframework.web.client.RestTemplate.doExecute(RestTemplate.java:620)
06-Dec-2019 00:24:13         at org.springframework.web.client.RestTemplate.execute(RestTemplate.java:580)
06-Dec-2019 00:24:13         at org.springframework.web.client.RestTemplate.postForObject(RestTemplate.java:380)
06-Dec-2019 00:24:13         at org.springframework.cloud.dataflow.rest.client.StreamTemplate.createStream(StreamTemplate.java:120)
06-Dec-2019 00:24:13         at org.springframework.cloud.dataflow.acceptance.test.AbstractStreamTests.deployStream(AbstractStreamTests.java:169)
06-Dec-2019 00:24:13         at org.springframework.cloud.dataflow.acceptance.test.HttpSourceTests.httpSourceTests(HttpSourceTests.java:41)
06-Dec-2019 00:24:13         at sun.reflect.NativeMethodAccessorImpl.invoke0(Native Method)
06-Dec-2019 00:24:13         at sun.reflect.NativeMethodAccessorImpl.invoke(NativeMethodAccessorImpl.java:62)
06-Dec-2019 00:24:13         at sun.reflect.DelegatingMethodAccessorImpl.invoke(DelegatingMethodAccessorImpl.java:43)
06-Dec-2019 00:24:13         at java.lang.reflect.Method.invoke(Method.java:498)
06-Dec-2019 00:24:13         at org.junit.runners.model.FrameworkMethod$1.runReflectiveCall(FrameworkMethod.java:50)
06-Dec-2019 00:24:13         at org.junit.internal.runners.model.ReflectiveCallable.run(ReflectiveCallable.java:12)
06-Dec-2019 00:24:13         at org.junit.runners.model.FrameworkMethod.invokeExplosively(FrameworkMethod.java:47)
06-Dec-2019 00:24:13         at org.junit.internal.runners.statements.InvokeMethod.evaluate(InvokeMethod.java:17)
06-Dec-2019 00:24:13         at org.junit.internal.runners.statements.RunBefores.evaluate(RunBefores.java:26)
06-Dec-2019 00:24:13         at org.springframework.test.context.junit4.statements.RunBeforeTestMethodCallbacks.evaluate(RunBeforeTestMethodCallbacks.java:75)
06-Dec-2019 00:24:13         at org.springframework.test.context.junit4.statements.RunAfterTestMethodCallbacks.evaluate(RunAfterTestMethodCallbacks.java:86)
06-Dec-2019 00:24:13         at org.junit.rules.TestWatcher$1.evaluate(TestWatcher.java:55)
06-Dec-2019 00:24:13         at org.junit.rules.ExternalResource$1.evaluate(ExternalResource.java:48)
06-Dec-2019 00:24:13         at org.junit.rules.RunRules.evaluate(RunRules.java:20)
06-Dec-2019 00:24:13         at org.springframework.test.context.junit4.statements.SpringRepeat.evaluate(SpringRepeat.java:84)
06-Dec-2019 00:24:13         at org.junit.runners.ParentRunner.runLeaf(ParentRunner.java:325)
06-Dec-2019 00:24:13         at org.springframework.test.context.junit4.SpringJUnit4ClassRunner.runChild(SpringJUnit4ClassRunner.java:252)
06-Dec-2019 00:24:13         at org.springframework.test.context.junit4.SpringJUnit4ClassRunner.runChild(SpringJUnit4ClassRunner.java:94)
06-Dec-2019 00:24:13         at org.junit.runners.ParentRunner$3.run(ParentRunner.java:290)
06-Dec-2019 00:24:13         at org.junit.runners.ParentRunner$1.schedule(ParentRunner.java:71)
06-Dec-2019 00:24:13         at org.junit.runners.ParentRunner.runChildren(ParentRunner.java:288)
06-Dec-2019 00:24:13         at org.junit.runners.ParentRunner.access$000(ParentRunner.java:58)
06-Dec-2019 00:24:13         at org.junit.runners.ParentRunner$2.evaluate(ParentRunner.java:268)
06-Dec-2019 00:24:13         at org.springframework.test.context.junit4.statements.RunBeforeTestClassCallbacks.evaluate(RunBeforeTestClassCallbacks.java:61)
06-Dec-2019 00:24:13         at org.springframework.test.context.junit4.statements.RunAfterTestClassCallbacks.evaluate(RunAfterTestClassCallbacks.java:70)
06-Dec-2019 00:24:13         at org.junit.runners.ParentRunner.run(ParentRunner.java:363)
06-Dec-2019 00:24:13         at org.springframework.test.context.junit4.SpringJUnit4ClassRunner.run(SpringJUnit4ClassRunner.java:191)
06-Dec-2019 00:24:13         at org.apache.maven.surefire.junit4.JUnit4Provider.execute(JUnit4Provider.java:283)
06-Dec-2019 00:24:13         at org.apache.maven.surefire.junit4.JUnit4Provider.executeWithRerun(JUnit4Provider.java:173)
06-Dec-2019 00:24:13         at org.apache.maven.surefire.junit4.JUnit4Provider.executeTestSet(JUnit4Provider.java:153)
06-Dec-2019 00:24:13         at org.apache.maven.surefire.junit4.JUnit4Provider.invoke(JUnit4Provider.java:128)
06-Dec-2019 00:24:13         at org.apache.maven.surefire.booter.ForkedBooter.invokeProviderInSameClassLoader(ForkedBooter.java:203)
06-Dec-2019 00:24:13         at org.apache.maven.surefire.booter.ForkedBooter.runSuitesInProcess(ForkedBooter.java:155)
06-Dec-2019 00:24:13         at org.apache.maven.surefire.booter.ForkedBooter.main(ForkedBooter.java:103)
06-Dec-2019 00:24:13
06-Dec-2019 00:24:13 2019-12-06 00:24:13.469  INFO 6646 --- [           main] junit.logTestName                        : Finished Test httpSourceTests(org.springframework.cloud.dataflow.acceptance.test.HttpSourceTests)
06-Dec-2019 00:24:13 2019-12-06 00:24:13.469  INFO 6646 --- [           main] o.s.c.d.acceptance.test.HttpSourceTests  : Destroy all streams
06-Dec-2019 00:24:13 Tests run: 1, Failures: 0, Errors: 1, Skipped: 0, Time elapsed: 0.066 sec <<< FAILURE! - in org.springframework.cloud.dataflow.acceptance.test.HttpSourceTests
06-Dec-2019 00:24:13 httpSourceTests(org.springframework.cloud.dataflow.acceptance.test.HttpSourceTests)  Time elapsed: 0.04 sec  <<< ERROR!
06-Dec-2019 00:24:13 org.springframework.cloud.dataflow.rest.client.DataFlowClientException: I/O error on GET request for "http://localhost:7577/api": Connect to localhost:7577 [localhost/127.0.0.1, localhost/0:0:0:0:0:0:0:1] failed: Connection refused (Connection refused); nested exception is org.apache.http.conn.HttpHostConnectException: Connect to localhost:7577 [localhost/127.0.0.1, localhost/0:0:0:0:0:0:0:1] failed: Connection refused (Connection refused)
06-Dec-2019 00:24:13
06-Dec-2019 00:24:13         at org.springframework.cloud.dataflow.rest.client.VndErrorResponseErrorHandler.handleError(VndErrorResponseErrorHandler.java:63)
06-Dec-2019 00:24:13         at org.springframework.web.client.RestTemplate.handleResponse(RestTemplate.java:667)
06-Dec-2019 00:24:13         at org.springframework.web.client.RestTemplate.doExecute(RestTemplate.java:620)
06-Dec-2019 00:24:13         at org.springframework.web.client.RestTemplate.execute(RestTemplate.java:580)
06-Dec-2019 00:24:13         at org.springframework.web.client.RestTemplate.delete(RestTemplate.java:452)
06-Dec-2019 00:24:13         at org.springframework.cloud.dataflow.rest.client.StreamTemplate.destroyAll(StreamTemplate.java:147)
06-Dec-2019 00:24:13         at org.springframework.cloud.dataflow.acceptance.test.AbstractStreamTests$1.after(AbstractStreamTests.java:119)
06-Dec-2019 00:24:13         at org.junit.rules.ExternalResource$1.evaluate(ExternalResource.java:50)
06-Dec-2019 00:24:13         at org.junit.rules.RunRules.evaluate(RunRules.java:20)
06-Dec-2019 00:24:13         at org.springframework.test.context.junit4.statements.SpringRepeat.evaluate(SpringRepeat.java:84)
06-Dec-2019 00:24:13         at org.junit.runners.ParentRunner.runLeaf(ParentRunner.java:325)
06-Dec-2019 00:24:13         at org.springframework.test.context.junit4.SpringJUnit4ClassRunner.runChild(SpringJUnit4ClassRunner.java:252)
06-Dec-2019 00:24:13         at org.springframework.test.context.junit4.SpringJUnit4ClassRunner.runChild(SpringJUnit4ClassRunner.java:94)
06-Dec-2019 00:24:13         at org.junit.runners.ParentRunner$3.run(ParentRunner.java:290)
06-Dec-2019 00:24:13         at org.junit.runners.ParentRunner$1.schedule(ParentRunner.java:71)
06-Dec-2019 00:24:13         at org.junit.runners.ParentRunner.runChildren(ParentRunner.java:288)
06-Dec-2019 00:24:13         at org.junit.runners.ParentRunner.access$000(ParentRunner.java:58)
06-Dec-2019 00:24:13         at org.junit.runners.ParentRunner$2.evaluate(ParentRunner.java:268)
06-Dec-2019 00:24:13         at org.springframework.test.context.junit4.statements.RunBeforeTestClassCallbacks.evaluate(RunBeforeTestClassCallbacks.java:61)
06-Dec-2019 00:24:13         at org.springframework.test.context.junit4.statements.RunAfterTestClassCallbacks.evaluate(RunAfterTestClassCallbacks.java:70)
06-Dec-2019 00:24:13         at org.junit.runners.ParentRunner.run(ParentRunner.java:363)
06-Dec-2019 00:24:13         at org.springframework.test.context.junit4.SpringJUnit4ClassRunner.run(SpringJUnit4ClassRunner.java:191)
06-Dec-2019 00:24:13         at org.apache.maven.surefire.junit4.JUnit4Provider.execute(JUnit4Provider.java:283)
06-Dec-2019 00:24:13         at org.apache.maven.surefire.junit4.JUnit4Provider.executeWithRerun(JUnit4Provider.java:173)
06-Dec-2019 00:24:13         at org.apache.maven.surefire.junit4.JUnit4Provider.executeTestSet(JUnit4Provider.java:153)
06-Dec-2019 00:24:13         at org.apache.maven.surefire.junit4.JUnit4Provider.invoke(JUnit4Provider.java:128)
06-Dec-2019 00:24:13         at org.apache.maven.surefire.booter.ForkedBooter.invokeProviderInSameClassLoader(ForkedBooter.java:203)
06-Dec-2019 00:24:13         at org.apache.maven.surefire.booter.ForkedBooter.runSuitesInProcess(ForkedBooter.java:155)
06-Dec-2019 00:24:13         at org.apache.maven.surefire.booter.ForkedBooter.main(ForkedBooter.java:103)
06-Dec-2019 00:24:13
06-Dec-2019 00:24:13 Running org.springframework.cloud.dataflow.acceptance.test.TimestampTaskTests
06-Dec-2019 00:24:13 2019-12-06 00:24:13.496  INFO 6646 --- [           main] o.s.c.support.GenericApplicationContext  : Refreshing org.springframework.context.support.GenericApplicationContext@2bfb6b49: startup date [Fri Dec 06 00:24:13 UTC 2019]; root of context hierarchy
06-Dec-2019 00:24:13 2019-12-06 00:24:13.562  INFO 6646 --- [           main] junit.logTestName                        : Starting Test timeStampTests(org.springframework.cloud.dataflow.acceptance.test.TimestampTaskTests)
06-Dec-2019 00:24:13 2019-12-06 00:24:13.563  INFO 6646 --- [           main] o.s.c.d.a.test.AbstractTaskTests         : Importing task apps from uri resource: https://dataflow.spring.io/task-maven-latest
06-Dec-2019 00:24:14 2019-12-06 00:24:14.030  INFO 6646 --- [           main] o.s.c.d.a.test.AbstractTaskTests         : Done importing task apps.
06-Dec-2019 00:24:19 2019-12-06 00:24:19.519  INFO 6646 --- [           main] junit.logTestName                        : Test timeStampTests(org.springframework.cloud.dataflow.acceptance.test.TimestampTaskTests) Succeeded
06-Dec-2019 00:24:19 2019-12-06 00:24:19.520  INFO 6646 --- [           main] junit.logTestName                        : Finished Test timeStampTests(org.springframework.cloud.dataflow.acceptance.test.TimestampTaskTests)
06-Dec-2019 00:24:19 2019-12-06 00:24:19.554  INFO 6646 --- [           main] junit.logTestName                        : Starting Test timeStampTestsMultipleLaunch(org.springframework.cloud.dataflow.acceptance.test.TimestampTaskTests)
06-Dec-2019 00:24:30 2019-12-06 00:24:30.037  INFO 6646 --- [           main] junit.logTestName                        : Test timeStampTestsMultipleLaunch(org.springframework.cloud.dataflow.acceptance.test.TimestampTaskTests) Succeeded
06-Dec-2019 00:24:30 2019-12-06 00:24:30.037  INFO 6646 --- [           main] junit.logTestName                        : Finished Test timeStampTestsMultipleLaunch(org.springframework.cloud.dataflow.acceptance.test.TimestampTaskTests)
06-Dec-2019 00:24:30 Tests run: 2, Failures: 0, Errors: 0, Skipped: 0, Time elapsed: 16.549 sec - in org.springframework.cloud.dataflow.acceptance.test.TimestampTaskTests
06-Dec-2019 00:24:30 Running org.springframework.cloud.dataflow.acceptance.test.TickTockTests
06-Dec-2019 00:24:30 2019-12-06 00:24:30.038  INFO 6646 --- [           main] .b.t.c.SpringBootTestContextBootstrapper : Neither @ContextConfiguration nor @ContextHierarchy found for test class [org.springframework.cloud.dataflow.acceptance.test.TickTockTests], using SpringBootContextLoader
06-Dec-2019 00:24:30 2019-12-06 00:24:30.043  INFO 6646 --- [           main] .b.t.c.SpringBootTestContextBootstrapper : Loaded default TestExecutionListener class names from location [META-INF/spring.factories]: [org.springframework.boot.test.mock.mockito.MockitoTestExecutionListener, org.springframework.boot.test.mock.mockito.ResetMocksTestExecutionListener, org.springframework.boot.test.autoconfigure.restdocs.RestDocsTestExecutionListener, org.springframework.boot.test.autoconfigure.web.client.MockRestServiceServerResetTestExecutionListener, org.springframework.boot.test.autoconfigure.web.servlet.MockMvcPrintOnlyOnFailureTestExecutionListener, org.springframework.boot.test.autoconfigure.web.servlet.WebDriverTestExecutionListener, org.springframework.test.context.web.ServletTestExecutionListener, org.springframework.test.context.support.DirtiesContextBeforeModesTestExecutionListener, org.springframework.test.context.support.DependencyInjectionTestExecutionListener, org.springframework.test.context.support.DirtiesContextTestExecutionListener, org.springframework.test.context.transaction.TransactionalTestExecutionListener, org.springframework.test.context.jdbc.SqlScriptsTestExecutionListener]
06-Dec-2019 00:24:30 2019-12-06 00:24:30.045  INFO 6646 --- [           main] .b.t.c.SpringBootTestContextBootstrapper : Using TestExecutionListeners: [org.springframework.test.context.web.ServletTestExecutionListener@358ab600, org.springframework.test.context.support.DirtiesContextBeforeModesTestExecutionListener@e26af6, org.springframework.boot.test.autoconfigure.SpringBootDependencyInjectionTestExecutionListener@44065156, org.springframework.test.context.support.DirtiesContextTestExecutionListener@3791f50e, org.springframework.test.context.transaction.TransactionalTestExecutionListener@574b7f4a, org.springframework.test.context.jdbc.SqlScriptsTestExecutionListener@44ed0a8f, org.springframework.boot.test.mock.mockito.MockitoTestExecutionListener@32177fa5, org.springframework.boot.test.autoconfigure.web.servlet.MockMvcPrintOnlyOnFailureTestExecutionListener@a96d56c, org.springframework.boot.test.autoconfigure.web.client.MockRestServiceServerResetTestExecutionListener@6ab4a5b, org.springframework.boot.test.mock.mockito.ResetMocksTestExecutionListener@2abe9173, org.springframework.boot.test.autoconfigure.web.servlet.WebDriverTestExecutionListener@235d29d6, org.springframework.boot.test.autoconfigure.restdocs.RestDocsTestExecutionListener@1fdca564]
06-Dec-2019 00:24:30 2019-12-06 00:24:30.091  INFO 6646 --- [           main] junit.logTestName                        : Starting Test tickTockUpdateRollbackTests(org.springframework.cloud.dataflow.acceptance.test.TickTockTests)
06-Dec-2019 00:24:30 2019-12-06 00:24:30.107 ERROR 6646 --- [           main] junit.logTestName                        : !!! Test tickTockUpdateRollbackTests(org.springframework.cloud.dataflow.acceptance.test.TickTockTests) Failed !!!
06-Dec-2019 00:24:30
06-Dec-2019 00:24:30 org.springframework.cloud.dataflow.rest.client.DataFlowClientException: I/O error on GET request for "http://localhost:7577/api": Connect to localhost:7577 [localhost/127.0.0.1, localhost/0:0:0:0:0:0:0:1] failed: Connection refused (Connection refused); nested exception is org.apache.http.conn.HttpHostConnectException: Connect to localhost:7577 [localhost/127.0.0.1, localhost/0:0:0:0:0:0:0:1] failed: Connection refused (Connection refused)
06-Dec-2019 00:24:30
06-Dec-2019 00:24:30         at org.springframework.cloud.dataflow.rest.client.VndErrorResponseErrorHandler.handleError(VndErrorResponseErrorHandler.java:63)
06-Dec-2019 00:24:30         at org.springframework.web.client.RestTemplate.handleResponse(RestTemplate.java:667)
06-Dec-2019 00:24:30         at org.springframework.web.client.RestTemplate.doExecute(RestTemplate.java:620)
06-Dec-2019 00:24:30         at org.springframework.web.client.RestTemplate.execute(RestTemplate.java:580)
06-Dec-2019 00:24:30         at org.springframework.web.client.RestTemplate.delete(RestTemplate.java:452)
06-Dec-2019 00:24:30         at org.springframework.cloud.dataflow.rest.client.StreamTemplate.destroyAll(StreamTemplate.java:147)
06-Dec-2019 00:24:30         at org.springframework.cloud.dataflow.acceptance.test.TickTockTests.tickTockUpdateRollbackTests(TickTockTests.java:61)
06-Dec-2019 00:24:30         at sun.reflect.NativeMethodAccessorImpl.invoke0(Native Method)
06-Dec-2019 00:24:30         at sun.reflect.NativeMethodAccessorImpl.invoke(NativeMethodAccessorImpl.java:62)
06-Dec-2019 00:24:30         at sun.reflect.DelegatingMethodAccessorImpl.invoke(DelegatingMethodAccessorImpl.java:43)
06-Dec-2019 00:24:30         at java.lang.reflect.Method.invoke(Method.java:498)
06-Dec-2019 00:24:30         at org.junit.runners.model.FrameworkMethod$1.runReflectiveCall(FrameworkMethod.java:50)
06-Dec-2019 00:24:30         at org.junit.internal.runners.model.ReflectiveCallable.run(ReflectiveCallable.java:12)
06-Dec-2019 00:24:30         at org.junit.runners.model.FrameworkMethod.invokeExplosively(FrameworkMethod.java:47)
06-Dec-2019 00:24:30         at org.junit.internal.runners.statements.InvokeMethod.evaluate(InvokeMethod.java:17)
06-Dec-2019 00:24:30         at org.junit.internal.runners.statements.RunBefores.evaluate(RunBefores.java:26)
06-Dec-2019 00:24:30         at org.springframework.test.context.junit4.statements.RunBeforeTestMethodCallbacks.evaluate(RunBeforeTestMethodCallbacks.java:75)
06-Dec-2019 00:24:30         at org.springframework.test.context.junit4.statements.RunAfterTestMethodCallbacks.evaluate(RunAfterTestMethodCallbacks.java:86)
06-Dec-2019 00:24:30         at org.junit.rules.TestWatcher$1.evaluate(TestWatcher.java:55)
06-Dec-2019 00:24:30         at org.junit.rules.ExternalResource$1.evaluate(ExternalResource.java:48)
06-Dec-2019 00:24:30         at org.junit.rules.RunRules.evaluate(RunRules.java:20)
06-Dec-2019 00:24:30         at org.springframework.test.context.junit4.statements.SpringRepeat.evaluate(SpringRepeat.java:84)
06-Dec-2019 00:24:30         at org.junit.runners.ParentRunner.runLeaf(ParentRunner.java:325)
06-Dec-2019 00:24:30         at org.springframework.test.context.junit4.SpringJUnit4ClassRunner.runChild(SpringJUnit4ClassRunner.java:252)
06-Dec-2019 00:24:30         at org.springframework.test.context.junit4.SpringJUnit4ClassRunner.runChild(SpringJUnit4ClassRunner.java:94)
06-Dec-2019 00:24:30         at org.junit.runners.ParentRunner$3.run(ParentRunner.java:290)
06-Dec-2019 00:24:30         at org.junit.runners.ParentRunner$1.schedule(ParentRunner.java:71)
06-Dec-2019 00:24:30         at org.junit.runners.ParentRunner.runChildren(ParentRunner.java:288)
06-Dec-2019 00:24:30         at org.junit.runners.ParentRunner.access$000(ParentRunner.java:58)
06-Dec-2019 00:24:30         at org.junit.runners.ParentRunner$2.evaluate(ParentRunner.java:268)
06-Dec-2019 00:24:30         at org.springframework.test.context.junit4.statements.RunBeforeTestClassCallbacks.evaluate(RunBeforeTestClassCallbacks.java:61)
06-Dec-2019 00:24:30         at org.springframework.test.context.junit4.statements.RunAfterTestClassCallbacks.evaluate(RunAfterTestClassCallbacks.java:70)
06-Dec-2019 00:24:30         at org.junit.runners.ParentRunner.run(ParentRunner.java:363)
06-Dec-2019 00:24:30         at org.springframework.test.context.junit4.SpringJUnit4ClassRunner.run(SpringJUnit4ClassRunner.java:191)
06-Dec-2019 00:24:30         at org.apache.maven.surefire.junit4.JUnit4Provider.execute(JUnit4Provider.java:283)
06-Dec-2019 00:24:30         at org.apache.maven.surefire.junit4.JUnit4Provider.executeWithRerun(JUnit4Provider.java:173)
06-Dec-2019 00:24:30         at org.apache.maven.surefire.junit4.JUnit4Provider.executeTestSet(JUnit4Provider.java:153)
06-Dec-2019 00:24:30         at org.apache.maven.surefire.junit4.JUnit4Provider.invoke(JUnit4Provider.java:128)
06-Dec-2019 00:24:30         at org.apache.maven.surefire.booter.ForkedBooter.invokeProviderInSameClassLoader(ForkedBooter.java:203)
06-Dec-2019 00:24:30         at org.apache.maven.surefire.booter.ForkedBooter.runSuitesInProcess(ForkedBooter.java:155)
06-Dec-2019 00:24:30         at org.apache.maven.surefire.booter.ForkedBooter.main(ForkedBooter.java:103)
06-Dec-2019 00:24:30
06-Dec-2019 00:24:30 2019-12-06 00:24:30.108  INFO 6646 --- [           main] junit.logTestName                        : Finished Test tickTockUpdateRollbackTests(org.springframework.cloud.dataflow.acceptance.test.TickTockTests)
06-Dec-2019 00:24:30 2019-12-06 00:24:30.108  INFO 6646 --- [           main] o.s.c.d.acceptance.test.TickTockTests    : Destroy all streams
06-Dec-2019 00:24:30 2019-12-06 00:24:30.154  INFO 6646 --- [           main] junit.logTestName                        : Starting Test tickTockTests(org.springframework.cloud.dataflow.acceptance.test.TickTockTests)
06-Dec-2019 00:24:30 2019-12-06 00:24:30.155  INFO 6646 --- [           main] o.s.c.d.acceptance.test.TickTockTests    : Creating stream 'TICKTOCK'
06-Dec-2019 00:24:30 2019-12-06 00:24:30.180 ERROR 6646 --- [           main] junit.logTestName                        : !!! Test tickTockTests(org.springframework.cloud.dataflow.acceptance.test.TickTockTests) Failed !!!
06-Dec-2019 00:24:30
06-Dec-2019 00:24:30 org.springframework.cloud.dataflow.rest.client.DataFlowClientException: I/O error on GET request for "http://localhost:7577/api/release/status/TICKTOCK": Connect to localhost:7577 [localhost/127.0.0.1, localhost/0:0:0:0:0:0:0:1] failed: Connection refused (Connection refused); nested exception is org.apache.http.conn.HttpHostConnectException: Connect to localhost:7577 [localhost/127.0.0.1, localhost/0:0:0:0:0:0:0:1] failed: Connection refused (Connection refused)
06-Dec-2019 00:24:30
06-Dec-2019 00:24:30         at org.springframework.cloud.dataflow.rest.client.VndErrorResponseErrorHandler.handleError(VndErrorResponseErrorHandler.java:63)
06-Dec-2019 00:24:30         at org.springframework.web.client.RestTemplate.handleResponse(RestTemplate.java:667)
06-Dec-2019 00:24:30         at org.springframework.web.client.RestTemplate.doExecute(RestTemplate.java:620)
06-Dec-2019 00:24:30         at org.springframework.web.client.RestTemplate.execute(RestTemplate.java:580)
06-Dec-2019 00:24:30         at org.springframework.web.client.RestTemplate.postForObject(RestTemplate.java:380)
06-Dec-2019 00:24:30         at org.springframework.cloud.dataflow.rest.client.StreamTemplate.createStream(StreamTemplate.java:120)
06-Dec-2019 00:24:30         at org.springframework.cloud.dataflow.acceptance.test.AbstractStreamTests.deployStream(AbstractStreamTests.java:169)
06-Dec-2019 00:24:30         at org.springframework.cloud.dataflow.acceptance.test.TickTockTests.tickTockTests(TickTockTests.java:47)
06-Dec-2019 00:24:30         at sun.reflect.NativeMethodAccessorImpl.invoke0(Native Method)
06-Dec-2019 00:24:30         at sun.reflect.NativeMethodAccessorImpl.invoke(NativeMethodAccessorImpl.java:62)
06-Dec-2019 00:24:30         at sun.reflect.DelegatingMethodAccessorImpl.invoke(DelegatingMethodAccessorImpl.java:43)
06-Dec-2019 00:24:30         at java.lang.reflect.Method.invoke(Method.java:498)
06-Dec-2019 00:24:30         at org.junit.runners.model.FrameworkMethod$1.runReflectiveCall(FrameworkMethod.java:50)
06-Dec-2019 00:24:30         at org.junit.internal.runners.model.ReflectiveCallable.run(ReflectiveCallable.java:12)
06-Dec-2019 00:24:30         at org.junit.runners.model.FrameworkMethod.invokeExplosively(FrameworkMethod.java:47)
06-Dec-2019 00:24:30         at org.junit.internal.runners.statements.InvokeMethod.evaluate(InvokeMethod.java:17)
06-Dec-2019 00:24:30         at org.junit.internal.runners.statements.RunBefores.evaluate(RunBefores.java:26)
06-Dec-2019 00:24:30         at org.springframework.test.context.junit4.statements.RunBeforeTestMethodCallbacks.evaluate(RunBeforeTestMethodCallbacks.java:75)
06-Dec-2019 00:24:30         at org.springframework.test.context.junit4.statements.RunAfterTestMethodCallbacks.evaluate(RunAfterTestMethodCallbacks.java:86)
06-Dec-2019 00:24:30         at org.junit.rules.TestWatcher$1.evaluate(TestWatcher.java:55)
06-Dec-2019 00:24:30         at org.junit.rules.ExternalResource$1.evaluate(ExternalResource.java:48)
06-Dec-2019 00:24:30         at org.junit.rules.RunRules.evaluate(RunRules.java:20)
06-Dec-2019 00:24:30         at org.springframework.test.context.junit4.statements.SpringRepeat.evaluate(SpringRepeat.java:84)
06-Dec-2019 00:24:30         at org.junit.runners.ParentRunner.runLeaf(ParentRunner.java:325)
06-Dec-2019 00:24:30         at org.springframework.test.context.junit4.SpringJUnit4ClassRunner.runChild(SpringJUnit4ClassRunner.java:252)
06-Dec-2019 00:24:30         at org.springframework.test.context.junit4.SpringJUnit4ClassRunner.runChild(SpringJUnit4ClassRunner.java:94)
06-Dec-2019 00:24:30         at org.junit.runners.ParentRunner$3.run(ParentRunner.java:290)
06-Dec-2019 00:24:30         at org.junit.runners.ParentRunner$1.schedule(ParentRunner.java:71)
06-Dec-2019 00:24:30         at org.junit.runners.ParentRunner.runChildren(ParentRunner.java:288)
06-Dec-2019 00:24:30         at org.junit.runners.ParentRunner.access$000(ParentRunner.java:58)
06-Dec-2019 00:24:30         at org.junit.runners.ParentRunner$2.evaluate(ParentRunner.java:268)
06-Dec-2019 00:24:30         at org.springframework.test.context.junit4.statements.RunBeforeTestClassCallbacks.evaluate(RunBeforeTestClassCallbacks.java:61)
06-Dec-2019 00:24:30         at org.springframework.test.context.junit4.statements.RunAfterTestClassCallbacks.evaluate(RunAfterTestClassCallbacks.java:70)
06-Dec-2019 00:24:30         at org.junit.runners.ParentRunner.run(ParentRunner.java:363)
06-Dec-2019 00:24:30         at org.springframework.test.context.junit4.SpringJUnit4ClassRunner.run(SpringJUnit4ClassRunner.java:191)
06-Dec-2019 00:24:30         at org.apache.maven.surefire.junit4.JUnit4Provider.execute(JUnit4Provider.java:283)
06-Dec-2019 00:24:30         at org.apache.maven.surefire.junit4.JUnit4Provider.executeWithRerun(JUnit4Provider.java:173)
06-Dec-2019 00:24:30         at org.apache.maven.surefire.junit4.JUnit4Provider.executeTestSet(JUnit4Provider.java:153)
06-Dec-2019 00:24:30         at org.apache.maven.surefire.junit4.JUnit4Provider.invoke(JUnit4Provider.java:128)
06-Dec-2019 00:24:30         at org.apache.maven.surefire.booter.ForkedBooter.invokeProviderInSameClassLoader(ForkedBooter.java:203)
06-Dec-2019 00:24:30         at org.apache.maven.surefire.booter.ForkedBooter.runSuitesInProcess(ForkedBooter.java:155)
06-Dec-2019 00:24:30         at org.apache.maven.surefire.booter.ForkedBooter.main(ForkedBooter.java:103)
06-Dec-2019 00:24:30
06-Dec-2019 00:24:30 2019-12-06 00:24:30.181  INFO 6646 --- [           main] junit.logTestName                        : Finished Test tickTockTests(org.springframework.cloud.dataflow.acceptance.test.TickTockTests)
06-Dec-2019 00:24:30 2019-12-06 00:24:30.181  INFO 6646 --- [           main] o.s.c.d.acceptance.test.TickTockTests    : Destroy all streams
06-Dec-2019 00:24:30 2019-12-06 00:24:30.223  INFO 6646 --- [           main] junit.logTestName                        : Starting Test tickTockTestsFromConfigServer(org.springframework.cloud.dataflow.acceptance.test.TickTockTests)
06-Dec-2019 00:24:30 2019-12-06 00:24:30.226  INFO 6646 --- [           main] junit.logTestName                        : Finished Test tickTockTestsFromConfigServer(org.springframework.cloud.dataflow.acceptance.test.TickTockTests)
06-Dec-2019 00:24:30 2019-12-06 00:24:30.226  INFO 6646 --- [           main] o.s.c.d.acceptance.test.TickTockTests    : Destroy all streams
06-Dec-2019 00:24:30 Tests run: 3, Failures: 0, Errors: 3, Skipped: 0, Time elapsed: 0.205 sec <<< FAILURE! - in org.springframework.cloud.dataflow.acceptance.test.TickTockTests
06-Dec-2019 00:24:30 tickTockUpdateRollbackTests(org.springframework.cloud.dataflow.acceptance.test.TickTockTests)  Time elapsed: 0.025 sec  <<< ERROR!
06-Dec-2019 00:24:30 org.springframework.cloud.dataflow.rest.client.DataFlowClientException: I/O error on GET request for "http://localhost:7577/api": Connect to localhost:7577 [localhost/127.0.0.1, localhost/0:0:0:0:0:0:0:1] failed: Connection refused (Connection refused); nested exception is org.apache.http.conn.HttpHostConnectException: Connect to localhost:7577 [localhost/127.0.0.1, localhost/0:0:0:0:0:0:0:1] failed: Connection refused (Connection refused)
06-Dec-2019 00:24:30
06-Dec-2019 00:24:30         at org.springframework.cloud.dataflow.rest.client.VndErrorResponseErrorHandler.handleError(VndErrorResponseErrorHandler.java:63)
06-Dec-2019 00:24:30         at org.springframework.web.client.RestTemplate.handleResponse(RestTemplate.java:667)
06-Dec-2019 00:24:30         at org.springframework.web.client.RestTemplate.doExecute(RestTemplate.java:620)
06-Dec-2019 00:24:30         at org.springframework.web.client.RestTemplate.execute(RestTemplate.java:580)
06-Dec-2019 00:24:30         at org.springframework.web.client.RestTemplate.delete(RestTemplate.java:452)
06-Dec-2019 00:24:30         at org.springframework.cloud.dataflow.rest.client.StreamTemplate.destroyAll(StreamTemplate.java:147)
06-Dec-2019 00:24:30         at org.springframework.cloud.dataflow.acceptance.test.AbstractStreamTests$1.after(AbstractStreamTests.java:119)
06-Dec-2019 00:24:30         at org.junit.rules.ExternalResource$1.evaluate(ExternalResource.java:50)
06-Dec-2019 00:24:30         at org.junit.rules.RunRules.evaluate(RunRules.java:20)
06-Dec-2019 00:24:30         at org.springframework.test.context.junit4.statements.SpringRepeat.evaluate(SpringRepeat.java:84)
06-Dec-2019 00:24:30         at org.junit.runners.ParentRunner.runLeaf(ParentRunner.java:325)
06-Dec-2019 00:24:30         at org.springframework.test.context.junit4.SpringJUnit4ClassRunner.runChild(SpringJUnit4ClassRunner.java:252)
06-Dec-2019 00:24:30         at org.springframework.test.context.junit4.SpringJUnit4ClassRunner.runChild(SpringJUnit4ClassRunner.java:94)
06-Dec-2019 00:24:30         at org.junit.runners.ParentRunner$3.run(ParentRunner.java:290)
06-Dec-2019 00:24:30         at org.junit.runners.ParentRunner$1.schedule(ParentRunner.java:71)
06-Dec-2019 00:24:30         at org.junit.runners.ParentRunner.runChildren(ParentRunner.java:288)
06-Dec-2019 00:24:30         at org.junit.runners.ParentRunner.access$000(ParentRunner.java:58)
06-Dec-2019 00:24:30         at org.junit.runners.ParentRunner$2.evaluate(ParentRunner.java:268)
06-Dec-2019 00:24:30         at org.springframework.test.context.junit4.statements.RunBeforeTestClassCallbacks.evaluate(RunBeforeTestClassCallbacks.java:61)
06-Dec-2019 00:24:30         at org.springframework.test.context.junit4.statements.RunAfterTestClassCallbacks.evaluate(RunAfterTestClassCallbacks.java:70)
06-Dec-2019 00:24:30         at org.junit.runners.ParentRunner.run(ParentRunner.java:363)
06-Dec-2019 00:24:30         at org.springframework.test.context.junit4.SpringJUnit4ClassRunner.run(SpringJUnit4ClassRunner.java:191)
06-Dec-2019 00:24:30         at org.apache.maven.surefire.junit4.JUnit4Provider.execute(JUnit4Provider.java:283)
06-Dec-2019 00:24:30         at org.apache.maven.surefire.junit4.JUnit4Provider.executeWithRerun(JUnit4Provider.java:173)
06-Dec-2019 00:24:30         at org.apache.maven.surefire.junit4.JUnit4Provider.executeTestSet(JUnit4Provider.java:153)
06-Dec-2019 00:24:30         at org.apache.maven.surefire.junit4.JUnit4Provider.invoke(JUnit4Provider.java:128)
06-Dec-2019 00:24:30         at org.apache.maven.surefire.booter.ForkedBooter.invokeProviderInSameClassLoader(ForkedBooter.java:203)
06-Dec-2019 00:24:30         at org.apache.maven.surefire.booter.ForkedBooter.runSuitesInProcess(ForkedBooter.java:155)
06-Dec-2019 00:24:30         at org.apache.maven.surefire.booter.ForkedBooter.main(ForkedBooter.java:103)
06-Dec-2019 00:24:30
06-Dec-2019 00:24:30 tickTockTests(org.springframework.cloud.dataflow.acceptance.test.TickTockTests)  Time elapsed: 0.036 sec  <<< ERROR!
06-Dec-2019 00:24:30 org.springframework.cloud.dataflow.rest.client.DataFlowClientException: I/O error on GET request for "http://localhost:7577/api": Connect to localhost:7577 [localhost/127.0.0.1, localhost/0:0:0:0:0:0:0:1] failed: Connection refused (Connection refused); nested exception is org.apache.http.conn.HttpHostConnectException: Connect to localhost:7577 [localhost/127.0.0.1, localhost/0:0:0:0:0:0:0:1] failed: Connection refused (Connection refused)
06-Dec-2019 00:24:30
06-Dec-2019 00:24:30         at org.springframework.cloud.dataflow.rest.client.VndErrorResponseErrorHandler.handleError(VndErrorResponseErrorHandler.java:63)
06-Dec-2019 00:24:30         at org.springframework.web.client.RestTemplate.handleResponse(RestTemplate.java:667)
06-Dec-2019 00:24:30         at org.springframework.web.client.RestTemplate.doExecute(RestTemplate.java:620)
06-Dec-2019 00:24:30         at org.springframework.web.client.RestTemplate.execute(RestTemplate.java:580)
06-Dec-2019 00:24:30         at org.springframework.web.client.RestTemplate.delete(RestTemplate.java:452)
06-Dec-2019 00:24:30         at org.springframework.cloud.dataflow.rest.client.StreamTemplate.destroyAll(StreamTemplate.java:147)
06-Dec-2019 00:24:30         at org.springframework.cloud.dataflow.acceptance.test.AbstractStreamTests$1.after(AbstractStreamTests.java:119)
06-Dec-2019 00:24:30         at org.junit.rules.ExternalResource$1.evaluate(ExternalResource.java:50)
06-Dec-2019 00:24:30         at org.junit.rules.RunRules.evaluate(RunRules.java:20)
06-Dec-2019 00:24:30         at org.springframework.test.context.junit4.statements.SpringRepeat.evaluate(SpringRepeat.java:84)
06-Dec-2019 00:24:30         at org.junit.runners.ParentRunner.runLeaf(ParentRunner.java:325)
06-Dec-2019 00:24:30         at org.springframework.test.context.junit4.SpringJUnit4ClassRunner.runChild(SpringJUnit4ClassRunner.java:252)
06-Dec-2019 00:24:30         at org.springframework.test.context.junit4.SpringJUnit4ClassRunner.runChild(SpringJUnit4ClassRunner.java:94)
06-Dec-2019 00:24:30         at org.junit.runners.ParentRunner$3.run(ParentRunner.java:290)
06-Dec-2019 00:24:30         at org.junit.runners.ParentRunner$1.schedule(ParentRunner.java:71)
06-Dec-2019 00:24:30         at org.junit.runners.ParentRunner.runChildren(ParentRunner.java:288)
06-Dec-2019 00:24:30         at org.junit.runners.ParentRunner.access$000(ParentRunner.java:58)
06-Dec-2019 00:24:30         at org.junit.runners.ParentRunner$2.evaluate(ParentRunner.java:268)
06-Dec-2019 00:24:30         at org.springframework.test.context.junit4.statements.RunBeforeTestClassCallbacks.evaluate(RunBeforeTestClassCallbacks.java:61)
06-Dec-2019 00:24:30         at org.springframework.test.context.junit4.statements.RunAfterTestClassCallbacks.evaluate(RunAfterTestClassCallbacks.java:70)
06-Dec-2019 00:24:30         at org.junit.runners.ParentRunner.run(ParentRunner.java:363)
06-Dec-2019 00:24:30         at org.springframework.test.context.junit4.SpringJUnit4ClassRunner.run(SpringJUnit4ClassRunner.java:191)
06-Dec-2019 00:24:30         at org.apache.maven.surefire.junit4.JUnit4Provider.execute(JUnit4Provider.java:283)
06-Dec-2019 00:24:30         at org.apache.maven.surefire.junit4.JUnit4Provider.executeWithRerun(JUnit4Provider.java:173)
06-Dec-2019 00:24:30         at org.apache.maven.surefire.junit4.JUnit4Provider.executeTestSet(JUnit4Provider.java:153)
06-Dec-2019 00:24:30         at org.apache.maven.surefire.junit4.JUnit4Provider.invoke(JUnit4Provider.java:128)
06-Dec-2019 00:24:30         at org.apache.maven.surefire.booter.ForkedBooter.invokeProviderInSameClassLoader(ForkedBooter.java:203)
06-Dec-2019 00:24:30         at org.apache.maven.surefire.booter.ForkedBooter.runSuitesInProcess(ForkedBooter.java:155)
06-Dec-2019 00:24:30         at org.apache.maven.surefire.booter.ForkedBooter.main(ForkedBooter.java:103)
06-Dec-2019 00:24:30
06-Dec-2019 00:24:30 tickTockTestsFromConfigServer(org.springframework.cloud.dataflow.acceptance.test.TickTockTests)  Time elapsed: 0.02 sec  <<< ERROR!
06-Dec-2019 00:24:30 org.springframework.cloud.dataflow.rest.client.DataFlowClientException: I/O error on GET request for "http://localhost:7577/api": Connect to localhost:7577 [localhost/127.0.0.1, localhost/0:0:0:0:0:0:0:1] failed: Connection refused (Connection refused); nested exception is org.apache.http.conn.HttpHostConnectException: Connect to localhost:7577 [localhost/127.0.0.1, localhost/0:0:0:0:0:0:0:1] failed: Connection refused (Connection refused)
06-Dec-2019 00:24:30
06-Dec-2019 00:24:30         at org.springframework.cloud.dataflow.rest.client.VndErrorResponseErrorHandler.handleError(VndErrorResponseErrorHandler.java:63)
06-Dec-2019 00:24:30         at org.springframework.web.client.RestTemplate.handleResponse(RestTemplate.java:667)
06-Dec-2019 00:24:30         at org.springframework.web.client.RestTemplate.doExecute(RestTemplate.java:620)
06-Dec-2019 00:24:30         at org.springframework.web.client.RestTemplate.execute(RestTemplate.java:580)
06-Dec-2019 00:24:30         at org.springframework.web.client.RestTemplate.delete(RestTemplate.java:452)
06-Dec-2019 00:24:30         at org.springframework.cloud.dataflow.rest.client.StreamTemplate.destroyAll(StreamTemplate.java:147)
06-Dec-2019 00:24:30         at org.springframework.cloud.dataflow.acceptance.test.AbstractStreamTests$1.after(AbstractStreamTests.java:119)
06-Dec-2019 00:24:30         at org.junit.rules.ExternalResource$1.evaluate(ExternalResource.java:50)
06-Dec-2019 00:24:30         at org.junit.rules.RunRules.evaluate(RunRules.java:20)
06-Dec-2019 00:24:30         at org.springframework.test.context.junit4.statements.SpringRepeat.evaluate(SpringRepeat.java:84)
06-Dec-2019 00:24:30         at org.junit.runners.ParentRunner.runLeaf(ParentRunner.java:325)
06-Dec-2019 00:24:30         at org.springframework.test.context.junit4.SpringJUnit4ClassRunner.runChild(SpringJUnit4ClassRunner.java:252)
06-Dec-2019 00:24:30         at org.springframework.test.context.junit4.SpringJUnit4ClassRunner.runChild(SpringJUnit4ClassRunner.java:94)
06-Dec-2019 00:24:30         at org.junit.runners.ParentRunner$3.run(ParentRunner.java:290)
06-Dec-2019 00:24:30         at org.junit.runners.ParentRunner$1.schedule(ParentRunner.java:71)
06-Dec-2019 00:24:30         at org.junit.runners.ParentRunner.runChildren(ParentRunner.java:288)
06-Dec-2019 00:24:30         at org.junit.runners.ParentRunner.access$000(ParentRunner.java:58)
06-Dec-2019 00:24:30         at org.junit.runners.ParentRunner$2.evaluate(ParentRunner.java:268)
06-Dec-2019 00:24:30         at org.springframework.test.context.junit4.statements.RunBeforeTestClassCallbacks.evaluate(RunBeforeTestClassCallbacks.java:61)
06-Dec-2019 00:24:30         at org.springframework.test.context.junit4.statements.RunAfterTestClassCallbacks.evaluate(RunAfterTestClassCallbacks.java:70)
06-Dec-2019 00:24:30         at org.junit.runners.ParentRunner.run(ParentRunner.java:363)
06-Dec-2019 00:24:30         at org.springframework.test.context.junit4.SpringJUnit4ClassRunner.run(SpringJUnit4ClassRunner.java:191)
06-Dec-2019 00:24:30         at org.apache.maven.surefire.junit4.JUnit4Provider.execute(JUnit4Provider.java:283)
06-Dec-2019 00:24:30         at org.apache.maven.surefire.junit4.JUnit4Provider.executeWithRerun(JUnit4Provider.java:173)
06-Dec-2019 00:24:30         at org.apache.maven.surefire.junit4.JUnit4Provider.executeTestSet(JUnit4Provider.java:153)
06-Dec-2019 00:24:30         at org.apache.maven.surefire.junit4.JUnit4Provider.invoke(JUnit4Provider.java:128)
06-Dec-2019 00:24:30         at org.apache.maven.surefire.booter.ForkedBooter.invokeProviderInSameClassLoader(ForkedBooter.java:203)
06-Dec-2019 00:24:30         at org.apache.maven.surefire.booter.ForkedBooter.runSuitesInProcess(ForkedBooter.java:155)
06-Dec-2019 00:24:30         at org.apache.maven.surefire.booter.ForkedBooter.main(ForkedBooter.java:103)
06-Dec-2019 00:24:30
06-Dec-2019 00:24:30 Running org.springframework.cloud.dataflow.acceptance.test.ComposedTaskTests
06-Dec-2019 00:24:30 2019-12-06 00:24:30.283  INFO 6646 --- [           main] junit.logTestName                        : Starting Test ctrMultipleLaunchWithArguments(org.springframework.cloud.dataflow.acceptance.test.ComposedTaskTests)
06-Dec-2019 00:25:36 2019-12-06 00:25:36.034  INFO 6646 --- [           main] junit.logTestName                        : Test ctrMultipleLaunchWithArguments(org.springframework.cloud.dataflow.acceptance.test.ComposedTaskTests) Succeeded
06-Dec-2019 00:25:36 2019-12-06 00:25:36.034  INFO 6646 --- [           main] junit.logTestName                        : Finished Test ctrMultipleLaunchWithArguments(org.springframework.cloud.dataflow.acceptance.test.ComposedTaskTests)
06-Dec-2019 00:25:36 2019-12-06 00:25:36.073  INFO 6646 --- [           main] junit.logTestName                        : Starting Test ctrMultipleLaunch(org.springframework.cloud.dataflow.acceptance.test.ComposedTaskTests)
06-Dec-2019 00:26:16 2019-12-06 00:26:16.665  INFO 6646 --- [           main] junit.logTestName                        : Test ctrMultipleLaunch(org.springframework.cloud.dataflow.acceptance.test.ComposedTaskTests) Succeeded
06-Dec-2019 00:26:16 2019-12-06 00:26:16.666  INFO 6646 --- [           main] junit.logTestName                        : Finished Test ctrMultipleLaunch(org.springframework.cloud.dataflow.acceptance.test.ComposedTaskTests)
06-Dec-2019 00:26:16 2019-12-06 00:26:16.700  INFO 6646 --- [           main] junit.logTestName                        : Starting Test ctrLaunch(org.springframework.cloud.dataflow.acceptance.test.ComposedTaskTests)
06-Dec-2019 00:26:52 2019-12-06 00:26:52.104  INFO 6646 --- [           main] junit.logTestName                        : Test ctrLaunch(org.springframework.cloud.dataflow.acceptance.test.ComposedTaskTests) Succeeded
06-Dec-2019 00:26:52 2019-12-06 00:26:52.105  INFO 6646 --- [           main] junit.logTestName                        : Finished Test ctrLaunch(org.springframework.cloud.dataflow.acceptance.test.ComposedTaskTests)
06-Dec-2019 00:26:52 Tests run: 3, Failures: 0, Errors: 0, Skipped: 0, Time elapsed: 141.843 sec - in org.springframework.cloud.dataflow.acceptance.test.ComposedTaskTests
06-Dec-2019 00:26:52 Running org.springframework.cloud.dataflow.acceptance.test.TransformTests
06-Dec-2019 00:26:52 2019-12-06 00:26:52.106  INFO 6646 --- [           main] .b.t.c.SpringBootTestContextBootstrapper : Neither @ContextConfiguration nor @ContextHierarchy found for test class [org.springframework.cloud.dataflow.acceptance.test.TransformTests], using SpringBootContextLoader
06-Dec-2019 00:26:52 2019-12-06 00:26:52.112  INFO 6646 --- [           main] .b.t.c.SpringBootTestContextBootstrapper : Loaded default TestExecutionListener class names from location [META-INF/spring.factories]: [org.springframework.boot.test.mock.mockito.MockitoTestExecutionListener, org.springframework.boot.test.mock.mockito.ResetMocksTestExecutionListener, org.springframework.boot.test.autoconfigure.restdocs.RestDocsTestExecutionListener, org.springframework.boot.test.autoconfigure.web.client.MockRestServiceServerResetTestExecutionListener, org.springframework.boot.test.autoconfigure.web.servlet.MockMvcPrintOnlyOnFailureTestExecutionListener, org.springframework.boot.test.autoconfigure.web.servlet.WebDriverTestExecutionListener, org.springframework.test.context.web.ServletTestExecutionListener, org.springframework.test.context.support.DirtiesContextBeforeModesTestExecutionListener, org.springframework.test.context.support.DependencyInjectionTestExecutionListener, org.springframework.test.context.support.DirtiesContextTestExecutionListener, org.springframework.test.context.transaction.TransactionalTestExecutionListener, org.springframework.test.context.jdbc.SqlScriptsTestExecutionListener]
06-Dec-2019 00:26:52 2019-12-06 00:26:52.115  INFO 6646 --- [           main] .b.t.c.SpringBootTestContextBootstrapper : Using TestExecutionListeners: [org.springframework.test.context.web.ServletTestExecutionListener@33f2df51, org.springframework.test.context.support.DirtiesContextBeforeModesTestExecutionListener@107bfcb2, org.springframework.boot.test.autoconfigure.SpringBootDependencyInjectionTestExecutionListener@7bac686b, org.springframework.test.context.support.DirtiesContextTestExecutionListener@2ab26378, org.springframework.test.context.transaction.TransactionalTestExecutionListener@f9f3928, org.springframework.test.context.jdbc.SqlScriptsTestExecutionListener@404eca05, org.springframework.boot.test.mock.mockito.MockitoTestExecutionListener@58b91d57, org.springframework.boot.test.autoconfigure.web.servlet.MockMvcPrintOnlyOnFailureTestExecutionListener@61a91c9b, org.springframework.boot.test.autoconfigure.web.client.MockRestServiceServerResetTestExecutionListener@17092fff, org.springframework.boot.test.mock.mockito.ResetMocksTestExecutionListener@2121d1f9, org.springframework.boot.test.autoconfigure.web.servlet.WebDriverTestExecutionListener@31e2232f, org.springframework.boot.test.autoconfigure.restdocs.RestDocsTestExecutionListener@1806bc4c]
06-Dec-2019 00:26:52 2019-12-06 00:26:52.152  INFO 6646 --- [           main] junit.logTestName                        : Starting Test transformTests(org.springframework.cloud.dataflow.acceptance.test.TransformTests)
06-Dec-2019 00:26:52 2019-12-06 00:26:52.153  INFO 6646 --- [           main] o.s.c.d.acceptance.test.TransformTests   : Creating stream 'TRANSFORM-TEST'
06-Dec-2019 00:26:52 2019-12-06 00:26:52.180 ERROR 6646 --- [           main] junit.logTestName                        : !!! Test transformTests(org.springframework.cloud.dataflow.acceptance.test.TransformTests) Failed !!!
06-Dec-2019 00:26:52
06-Dec-2019 00:26:52 org.springframework.cloud.dataflow.rest.client.DataFlowClientException: I/O error on GET request for "http://localhost:7577/api/release/status/TRANSFORM-TEST": Connect to localhost:7577 [localhost/127.0.0.1, localhost/0:0:0:0:0:0:0:1] failed: Connection refused (Connection refused); nested exception is org.apache.http.conn.HttpHostConnectException: Connect to localhost:7577 [localhost/127.0.0.1, localhost/0:0:0:0:0:0:0:1] failed: Connection refused (Connection refused)
06-Dec-2019 00:26:52
06-Dec-2019 00:26:52         at org.springframework.cloud.dataflow.rest.client.VndErrorResponseErrorHandler.handleError(VndErrorResponseErrorHandler.java:63)
06-Dec-2019 00:26:52         at org.springframework.web.client.RestTemplate.handleResponse(RestTemplate.java:667)
06-Dec-2019 00:26:52         at org.springframework.web.client.RestTemplate.doExecute(RestTemplate.java:620)
06-Dec-2019 00:26:52         at org.springframework.web.client.RestTemplate.execute(RestTemplate.java:580)
06-Dec-2019 00:26:52         at org.springframework.web.client.RestTemplate.postForObject(RestTemplate.java:380)
06-Dec-2019 00:26:52         at org.springframework.cloud.dataflow.rest.client.StreamTemplate.createStream(StreamTemplate.java:120)
06-Dec-2019 00:26:52         at org.springframework.cloud.dataflow.acceptance.test.AbstractStreamTests.deployStream(AbstractStreamTests.java:169)
06-Dec-2019 00:26:52         at org.springframework.cloud.dataflow.acceptance.test.TransformTests.transformTests(TransformTests.java:39)
06-Dec-2019 00:26:52         at sun.reflect.NativeMethodAccessorImpl.invoke0(Native Method)
06-Dec-2019 00:26:52         at sun.reflect.NativeMethodAccessorImpl.invoke(NativeMethodAccessorImpl.java:62)
06-Dec-2019 00:26:52         at sun.reflect.DelegatingMethodAccessorImpl.invoke(DelegatingMethodAccessorImpl.java:43)
06-Dec-2019 00:26:52         at java.lang.reflect.Method.invoke(Method.java:498)
06-Dec-2019 00:26:52         at org.junit.runners.model.FrameworkMethod$1.runReflectiveCall(FrameworkMethod.java:50)
06-Dec-2019 00:26:52         at org.junit.internal.runners.model.ReflectiveCallable.run(ReflectiveCallable.java:12)
06-Dec-2019 00:26:52         at org.junit.runners.model.FrameworkMethod.invokeExplosively(FrameworkMethod.java:47)
06-Dec-2019 00:26:52         at org.junit.internal.runners.statements.InvokeMethod.evaluate(InvokeMethod.java:17)
06-Dec-2019 00:26:52         at org.junit.internal.runners.statements.RunBefores.evaluate(RunBefores.java:26)
06-Dec-2019 00:26:52         at org.springframework.test.context.junit4.statements.RunBeforeTestMethodCallbacks.evaluate(RunBeforeTestMethodCallbacks.java:75)
06-Dec-2019 00:26:52         at org.springframework.test.context.junit4.statements.RunAfterTestMethodCallbacks.evaluate(RunAfterTestMethodCallbacks.java:86)
06-Dec-2019 00:26:52         at org.junit.rules.TestWatcher$1.evaluate(TestWatcher.java:55)
06-Dec-2019 00:26:52         at org.junit.rules.ExternalResource$1.evaluate(ExternalResource.java:48)
06-Dec-2019 00:26:52         at org.junit.rules.RunRules.evaluate(RunRules.java:20)
06-Dec-2019 00:26:52         at org.springframework.test.context.junit4.statements.SpringRepeat.evaluate(SpringRepeat.java:84)
06-Dec-2019 00:26:52         at org.junit.runners.ParentRunner.runLeaf(ParentRunner.java:325)
06-Dec-2019 00:26:52         at org.springframework.test.context.junit4.SpringJUnit4ClassRunner.runChild(SpringJUnit4ClassRunner.java:252)
06-Dec-2019 00:26:52         at org.springframework.test.context.junit4.SpringJUnit4ClassRunner.runChild(SpringJUnit4ClassRunner.java:94)
06-Dec-2019 00:26:52         at org.junit.runners.ParentRunner$3.run(ParentRunner.java:290)
06-Dec-2019 00:26:52         at org.junit.runners.ParentRunner$1.schedule(ParentRunner.java:71)
06-Dec-2019 00:26:52         at org.junit.runners.ParentRunner.runChildren(ParentRunner.java:288)
06-Dec-2019 00:26:52         at org.junit.runners.ParentRunner.access$000(ParentRunner.java:58)
06-Dec-2019 00:26:52         at org.junit.runners.ParentRunner$2.evaluate(ParentRunner.java:268)
06-Dec-2019 00:26:52         at org.springframework.test.context.junit4.statements.RunBeforeTestClassCallbacks.evaluate(RunBeforeTestClassCallbacks.java:61)
06-Dec-2019 00:26:52         at org.springframework.test.context.junit4.statements.RunAfterTestClassCallbacks.evaluate(RunAfterTestClassCallbacks.java:70)
06-Dec-2019 00:26:52         at org.junit.runners.ParentRunner.run(ParentRunner.java:363)
06-Dec-2019 00:26:52         at org.springframework.test.context.junit4.SpringJUnit4ClassRunner.run(SpringJUnit4ClassRunner.java:191)
06-Dec-2019 00:26:52         at org.apache.maven.surefire.junit4.JUnit4Provider.execute(JUnit4Provider.java:283)
06-Dec-2019 00:26:52         at org.apache.maven.surefire.junit4.JUnit4Provider.executeWithRerun(JUnit4Provider.java:173)
06-Dec-2019 00:26:52         at org.apache.maven.surefire.junit4.JUnit4Provider.executeTestSet(JUnit4Provider.java:153)
06-Dec-2019 00:26:52         at org.apache.maven.surefire.junit4.JUnit4Provider.invoke(JUnit4Provider.java:128)
06-Dec-2019 00:26:52         at org.apache.maven.surefire.booter.ForkedBooter.invokeProviderInSameClassLoader(ForkedBooter.java:203)
06-Dec-2019 00:26:52         at org.apache.maven.surefire.booter.ForkedBooter.runSuitesInProcess(ForkedBooter.java:155)
06-Dec-2019 00:26:52         at org.apache.maven.surefire.booter.ForkedBooter.main(ForkedBooter.java:103)
06-Dec-2019 00:26:52
06-Dec-2019 00:26:52 2019-12-06 00:26:52.180  INFO 6646 --- [           main] junit.logTestName                        : Finished Test transformTests(org.springframework.cloud.dataflow.acceptance.test.TransformTests)
06-Dec-2019 00:26:52 2019-12-06 00:26:52.181  INFO 6646 --- [           main] o.s.c.d.acceptance.test.TransformTests   : Destroy all streams
06-Dec-2019 00:26:52 Tests run: 1, Failures: 0, Errors: 1, Skipped: 0, Time elapsed: 0.088 sec <<< FAILURE! - in org.springframework.cloud.dataflow.acceptance.test.TransformTests
06-Dec-2019 00:26:52 transformTests(org.springframework.cloud.dataflow.acceptance.test.TransformTests)  Time elapsed: 0.049 sec  <<< ERROR!
06-Dec-2019 00:26:52 org.springframework.cloud.dataflow.rest.client.DataFlowClientException: I/O error on GET request for "http://localhost:7577/api": Connect to localhost:7577 [localhost/127.0.0.1, localhost/0:0:0:0:0:0:0:1] failed: Connection refused (Connection refused); nested exception is org.apache.http.conn.HttpHostConnectException: Connect to localhost:7577 [localhost/127.0.0.1, localhost/0:0:0:0:0:0:0:1] failed: Connection refused (Connection refused)
06-Dec-2019 00:26:52
06-Dec-2019 00:26:52         at org.springframework.cloud.dataflow.rest.client.VndErrorResponseErrorHandler.handleError(VndErrorResponseErrorHandler.java:63)
06-Dec-2019 00:26:52         at org.springframework.web.client.RestTemplate.handleResponse(RestTemplate.java:667)
06-Dec-2019 00:26:52         at org.springframework.web.client.RestTemplate.doExecute(RestTemplate.java:620)
06-Dec-2019 00:26:52         at org.springframework.web.client.RestTemplate.execute(RestTemplate.java:580)
06-Dec-2019 00:26:52         at org.springframework.web.client.RestTemplate.delete(RestTemplate.java:452)
06-Dec-2019 00:26:52         at org.springframework.cloud.dataflow.rest.client.StreamTemplate.destroyAll(StreamTemplate.java:147)
06-Dec-2019 00:26:52         at org.springframework.cloud.dataflow.acceptance.test.AbstractStreamTests$1.after(AbstractStreamTests.java:119)
06-Dec-2019 00:26:52         at org.junit.rules.ExternalResource$1.evaluate(ExternalResource.java:50)
06-Dec-2019 00:26:52         at org.junit.rules.RunRules.evaluate(RunRules.java:20)
06-Dec-2019 00:26:52         at org.springframework.test.context.junit4.statements.SpringRepeat.evaluate(SpringRepeat.java:84)
06-Dec-2019 00:26:52         at org.junit.runners.ParentRunner.runLeaf(ParentRunner.java:325)
06-Dec-2019 00:26:52         at org.springframework.test.context.junit4.SpringJUnit4ClassRunner.runChild(SpringJUnit4ClassRunner.java:252)
06-Dec-2019 00:26:52         at org.springframework.test.context.junit4.SpringJUnit4ClassRunner.runChild(SpringJUnit4ClassRunner.java:94)
06-Dec-2019 00:26:52         at org.junit.runners.ParentRunner$3.run(ParentRunner.java:290)
06-Dec-2019 00:26:52         at org.junit.runners.ParentRunner$1.schedule(ParentRunner.java:71)
06-Dec-2019 00:26:52         at org.junit.runners.ParentRunner.runChildren(ParentRunner.java:288)
06-Dec-2019 00:26:52         at org.junit.runners.ParentRunner.access$000(ParentRunner.java:58)
06-Dec-2019 00:26:52         at org.junit.runners.ParentRunner$2.evaluate(ParentRunner.java:268)
06-Dec-2019 00:26:52         at org.springframework.test.context.junit4.statements.RunBeforeTestClassCallbacks.evaluate(RunBeforeTestClassCallbacks.java:61)
06-Dec-2019 00:26:52         at org.springframework.test.context.junit4.statements.RunAfterTestClassCallbacks.evaluate(RunAfterTestClassCallbacks.java:70)
06-Dec-2019 00:26:52         at org.junit.runners.ParentRunner.run(ParentRunner.java:363)
06-Dec-2019 00:26:52         at org.springframework.test.context.junit4.SpringJUnit4ClassRunner.run(SpringJUnit4ClassRunner.java:191)
06-Dec-2019 00:26:52         at org.apache.maven.surefire.junit4.JUnit4Provider.execute(JUnit4Provider.java:283)
06-Dec-2019 00:26:52         at org.apache.maven.surefire.junit4.JUnit4Provider.executeWithRerun(JUnit4Provider.java:173)
06-Dec-2019 00:26:52         at org.apache.maven.surefire.junit4.JUnit4Provider.executeTestSet(JUnit4Provider.java:153)
06-Dec-2019 00:26:52         at org.apache.maven.surefire.junit4.JUnit4Provider.invoke(JUnit4Provider.java:128)
06-Dec-2019 00:26:52         at org.apache.maven.surefire.booter.ForkedBooter.invokeProviderInSameClassLoader(ForkedBooter.java:203)
06-Dec-2019 00:26:52         at org.apache.maven.surefire.booter.ForkedBooter.runSuitesInProcess(ForkedBooter.java:155)
06-Dec-2019 00:26:52         at org.apache.maven.surefire.booter.ForkedBooter.main(ForkedBooter.java:103)
06-Dec-2019 00:26:52
06-Dec-2019 00:26:52 Running org.springframework.cloud.dataflow.acceptance.test.SchedulerTests
06-Dec-2019 00:26:52 2019-12-06 00:26:52.275  INFO 6646 --- [           main] s.c.a.AnnotationConfigApplicationContext : Refreshing org.springframework.context.annotation.AnnotationConfigApplicationContext@228bda54: startup date [Fri Dec 06 00:26:52 UTC 2019]; root of context hierarchy
06-Dec-2019 00:26:52 2019-12-06 00:26:52.300  INFO 6646 --- [           main] trationDelegate$BeanPostProcessorChecker : Bean 'configurationPropertiesRebinderAutoConfiguration' of type [class org.springframework.cloud.autoconfigure.ConfigurationPropertiesRebinderAutoConfiguration$$EnhancerBySpringCGLIB$$ed959188] is not eligible for getting processed by all BeanPostProcessors (for example: not eligible for auto-proxying)
06-Dec-2019 00:26:52
06-Dec-2019 00:26:52   .   ____          _            __ _ _
06-Dec-2019 00:26:52 /\\ / ___'_ __ _ _(_)_ __  __ _ \ \ \ \
06-Dec-2019 00:26:52 ( ( )\___ | '_ | '_| | '_ \/ _` | \ \ \ \
06-Dec-2019 00:26:52 \\/  ___)| |_)| | | | | || (_| |  ) ) ) )
06-Dec-2019 00:26:52   '  |____| .__|_| |_|_| |_\__, | / / / /
06-Dec-2019 00:26:52 =========|_|==============|___/=/_/_/_/
06-Dec-2019 00:26:52 :: Spring Boot ::        (v1.4.1.RELEASE)
06-Dec-2019 00:26:52
06-Dec-2019 00:26:52 2019-12-06 00:26:52.423  INFO 6646 --- [           main] c.c.c.ConfigServicePropertySourceLocator : Fetching config from server at: http://localhost:8888
06-Dec-2019 00:26:52 2019-12-06 00:26:52.426  WARN 6646 --- [           main] c.c.c.ConfigServicePropertySourceLocator : Could not locate PropertySource: I/O error on GET request for "http://localhost:8888//blah": Connection refused (Connection refused); nested exception is java.net.ConnectException: Connection refused (Connection refused)
06-Dec-2019 00:26:52 2019-12-06 00:26:52.426  INFO 6646 --- [           main] o.a.maven.surefire.booter.ForkedBooter   : The following profiles are active: blah
06-Dec-2019 00:26:52 2019-12-06 00:26:52.428  INFO 6646 --- [           main] s.c.a.AnnotationConfigApplicationContext : Refreshing org.springframework.context.annotation.AnnotationConfigApplicationContext@53ce2392: startup date [Fri Dec 06 00:26:52 UTC 2019]; parent: org.springframework.context.annotation.AnnotationConfigApplicationContext@228bda54
06-Dec-2019 00:26:52 2019-12-06 00:26:52.491  INFO 6646 --- [           main] o.a.maven.surefire.booter.ForkedBooter   : Started ForkedBooter in 0.288 seconds (JVM running for 164.049)
06-Dec-2019 00:26:52 2019-12-06 00:26:52.491  INFO 6646 --- [           main] s.c.a.AnnotationConfigApplicationContext : Closing org.springframework.context.annotation.AnnotationConfigApplicationContext@53ce2392: startup date [Fri Dec 06 00:26:52 UTC 2019]; parent: org.springframework.context.annotation.AnnotationConfigApplicationContext@228bda54
06-Dec-2019 00:26:52 2019-12-06 00:26:52.492 ERROR 6646 --- [           main] o.s.c.d.a.test.util.SchedulerRule        : SCHEDULER IS NOT AVAILABLE, SKIPPING TESTS
06-Dec-2019 00:26:52
06-Dec-2019 00:26:52 java.lang.IllegalArgumentException: no SchedulerOperations bean is available.  Skipping test.
06-Dec-2019 00:26:52         at org.springframework.util.Assert.notNull(Assert.java:115)
06-Dec-2019 00:26:52         at org.springframework.cloud.dataflow.acceptance.test.util.SchedulerRule.obtainResource(SchedulerRule.java:57)
06-Dec-2019 00:26:52         at org.springframework.cloud.scheduler.spi.junit.AbstractExternalResourceTestSupport.apply(AbstractExternalResourceTestSupport.java:58)
06-Dec-2019 00:26:52         at org.junit.rules.RunRules.applyAll(RunRules.java:26)
06-Dec-2019 00:26:52         at org.junit.rules.RunRules.<init>(RunRules.java:15)
06-Dec-2019 00:26:52         at org.junit.runners.ParentRunner.withClassRules(ParentRunner.java:245)
06-Dec-2019 00:26:52         at org.junit.runners.ParentRunner.classBlock(ParentRunner.java:194)
06-Dec-2019 00:26:52         at org.junit.runners.ParentRunner.run(ParentRunner.java:362)
06-Dec-2019 00:26:52         at org.springframework.test.context.junit4.SpringJUnit4ClassRunner.run(SpringJUnit4ClassRunner.java:191)
06-Dec-2019 00:26:52         at org.apache.maven.surefire.junit4.JUnit4Provider.execute(JUnit4Provider.java:283)
06-Dec-2019 00:26:52         at org.apache.maven.surefire.junit4.JUnit4Provider.executeWithRerun(JUnit4Provider.java:173)
06-Dec-2019 00:26:52         at org.apache.maven.surefire.junit4.JUnit4Provider.executeTestSet(JUnit4Provider.java:153)
06-Dec-2019 00:26:52         at org.apache.maven.surefire.junit4.JUnit4Provider.invoke(JUnit4Provider.java:128)
06-Dec-2019 00:26:52         at org.apache.maven.surefire.booter.ForkedBooter.invokeProviderInSameClassLoader(ForkedBooter.java:203)
06-Dec-2019 00:26:52         at org.apache.maven.surefire.booter.ForkedBooter.runSuitesInProcess(ForkedBooter.java:155)
06-Dec-2019 00:26:52         at org.apache.maven.surefire.booter.ForkedBooter.main(ForkedBooter.java:103)
06-Dec-2019 00:26:52
06-Dec-2019 00:26:52 Tests run: 1, Failures: 0, Errors: 0, Skipped: 1, Time elapsed: 0.288 sec - in org.springframework.cloud.dataflow.acceptance.test.SchedulerTests
06-Dec-2019 00:26:52 Running org.springframework.cloud.dataflow.acceptance.test.NamedChannelTests
06-Dec-2019 00:26:52 2019-12-06 00:26:52.493  INFO 6646 --- [           main] .b.t.c.SpringBootTestContextBootstrapper : Neither @ContextConfiguration nor @ContextHierarchy found for test class [org.springframework.cloud.dataflow.acceptance.test.NamedChannelTests], using SpringBootContextLoader
06-Dec-2019 00:26:52 2019-12-06 00:26:52.497  INFO 6646 --- [           main] .b.t.c.SpringBootTestContextBootstrapper : Loaded default TestExecutionListener class names from location [META-INF/spring.factories]: [org.springframework.boot.test.mock.mockito.MockitoTestExecutionListener, org.springframework.boot.test.mock.mockito.ResetMocksTestExecutionListener, org.springframework.boot.test.autoconfigure.restdocs.RestDocsTestExecutionListener, org.springframework.boot.test.autoconfigure.web.client.MockRestServiceServerResetTestExecutionListener, org.springframework.boot.test.autoconfigure.web.servlet.MockMvcPrintOnlyOnFailureTestExecutionListener, org.springframework.boot.test.autoconfigure.web.servlet.WebDriverTestExecutionListener, org.springframework.test.context.web.ServletTestExecutionListener, org.springframework.test.context.support.DirtiesContextBeforeModesTestExecutionListener, org.springframework.test.context.support.DependencyInjectionTestExecutionListener, org.springframework.test.context.support.DirtiesContextTestExecutionListener, org.springframework.test.context.transaction.TransactionalTestExecutionListener, org.springframework.test.context.jdbc.SqlScriptsTestExecutionListener]
06-Dec-2019 00:26:52 2019-12-06 00:26:52.499  INFO 6646 --- [           main] .b.t.c.SpringBootTestContextBootstrapper : Using TestExecutionListeners: [org.springframework.test.context.web.ServletTestExecutionListener@74834afd, org.springframework.test.context.support.DirtiesContextBeforeModesTestExecutionListener@75fd65c, org.springframework.boot.test.autoconfigure.SpringBootDependencyInjectionTestExecutionListener@d499c13, org.springframework.test.context.support.DirtiesContextTestExecutionListener@2ceca2ef, org.springframework.test.context.transaction.TransactionalTestExecutionListener@42d6c12d, org.springframework.test.context.jdbc.SqlScriptsTestExecutionListener@3b42121d, org.springframework.boot.test.mock.mockito.MockitoTestExecutionListener@7a2ab862, org.springframework.boot.test.autoconfigure.web.servlet.MockMvcPrintOnlyOnFailureTestExecutionListener@33188612, org.springframework.boot.test.autoconfigure.web.client.MockRestServiceServerResetTestExecutionListener@4733f6f5, org.springframework.boot.test.mock.mockito.ResetMocksTestExecutionListener@6ccac6f4, org.springframework.boot.test.autoconfigure.web.servlet.WebDriverTestExecutionListener@438c9aa7, org.springframework.boot.test.autoconfigure.restdocs.RestDocsTestExecutionListener@3453acd2]
06-Dec-2019 00:26:52 2019-12-06 00:26:52.533  INFO 6646 --- [           main] junit.logTestName                        : Starting Test testDestination(org.springframework.cloud.dataflow.acceptance.test.NamedChannelTests)
06-Dec-2019 00:26:52 2019-12-06 00:26:52.534  INFO 6646 --- [           main] o.s.c.d.a.test.NamedChannelTests         : Creating stream 'LOG-DESTINATION-SINK'
06-Dec-2019 00:26:52 2019-12-06 00:26:52.561 ERROR 6646 --- [           main] junit.logTestName                        : !!! Test testDestination(org.springframework.cloud.dataflow.acceptance.test.NamedChannelTests) Failed !!!
06-Dec-2019 00:26:52
06-Dec-2019 00:26:52 org.springframework.cloud.dataflow.rest.client.DataFlowClientException: I/O error on GET request for "http://localhost:7577/api/release/status/LOG-DESTINATION-SINK": Connect to localhost:7577 [localhost/127.0.0.1, localhost/0:0:0:0:0:0:0:1] failed: Connection refused (Connection refused); nested exception is org.apache.http.conn.HttpHostConnectException: Connect to localhost:7577 [localhost/127.0.0.1, localhost/0:0:0:0:0:0:0:1] failed: Connection refused (Connection refused)
06-Dec-2019 00:26:52
06-Dec-2019 00:26:52         at org.springframework.cloud.dataflow.rest.client.VndErrorResponseErrorHandler.handleError(VndErrorResponseErrorHandler.java:63)
06-Dec-2019 00:26:52         at org.springframework.web.client.RestTemplate.handleResponse(RestTemplate.java:667)
06-Dec-2019 00:26:52         at org.springframework.web.client.RestTemplate.doExecute(RestTemplate.java:620)
06-Dec-2019 00:26:52         at org.springframework.web.client.RestTemplate.execute(RestTemplate.java:580)
06-Dec-2019 00:26:52         at org.springframework.web.client.RestTemplate.postForObject(RestTemplate.java:380)
06-Dec-2019 00:26:52         at org.springframework.cloud.dataflow.rest.client.StreamTemplate.createStream(StreamTemplate.java:120)
06-Dec-2019 00:26:52         at org.springframework.cloud.dataflow.acceptance.test.AbstractStreamTests.deployStream(AbstractStreamTests.java:169)
06-Dec-2019 00:26:52         at org.springframework.cloud.dataflow.acceptance.test.NamedChannelTests.deployStream(NamedChannelTests.java:88)
06-Dec-2019 00:26:52         at org.springframework.cloud.dataflow.acceptance.test.NamedChannelTests.deployLog(NamedChannelTests.java:96)
06-Dec-2019 00:26:52         at org.springframework.cloud.dataflow.acceptance.test.NamedChannelTests.testDestination(NamedChannelTests.java:35)
06-Dec-2019 00:26:52         at sun.reflect.NativeMethodAccessorImpl.invoke0(Native Method)
06-Dec-2019 00:26:52         at sun.reflect.NativeMethodAccessorImpl.invoke(NativeMethodAccessorImpl.java:62)
06-Dec-2019 00:26:52         at sun.reflect.DelegatingMethodAccessorImpl.invoke(DelegatingMethodAccessorImpl.java:43)
06-Dec-2019 00:26:52         at java.lang.reflect.Method.invoke(Method.java:498)
06-Dec-2019 00:26:52         at org.junit.runners.model.FrameworkMethod$1.runReflectiveCall(FrameworkMethod.java:50)
06-Dec-2019 00:26:52         at org.junit.internal.runners.model.ReflectiveCallable.run(ReflectiveCallable.java:12)
06-Dec-2019 00:26:52         at org.junit.runners.model.FrameworkMethod.invokeExplosively(FrameworkMethod.java:47)
06-Dec-2019 00:26:52         at org.junit.internal.runners.statements.InvokeMethod.evaluate(InvokeMethod.java:17)
06-Dec-2019 00:26:52         at org.junit.internal.runners.statements.RunBefores.evaluate(RunBefores.java:26)
06-Dec-2019 00:26:52         at org.springframework.test.context.junit4.statements.RunBeforeTestMethodCallbacks.evaluate(RunBeforeTestMethodCallbacks.java:75)
06-Dec-2019 00:26:52         at org.springframework.test.context.junit4.statements.RunAfterTestMethodCallbacks.evaluate(RunAfterTestMethodCallbacks.java:86)
06-Dec-2019 00:26:52         at org.junit.rules.TestWatcher$1.evaluate(TestWatcher.java:55)
06-Dec-2019 00:26:52         at org.junit.rules.ExternalResource$1.evaluate(ExternalResource.java:48)
06-Dec-2019 00:26:52         at org.junit.rules.RunRules.evaluate(RunRules.java:20)
06-Dec-2019 00:26:52         at org.springframework.test.context.junit4.statements.SpringRepeat.evaluate(SpringRepeat.java:84)
06-Dec-2019 00:26:52         at org.junit.runners.ParentRunner.runLeaf(ParentRunner.java:325)
06-Dec-2019 00:26:52         at org.springframework.test.context.junit4.SpringJUnit4ClassRunner.runChild(SpringJUnit4ClassRunner.java:252)
06-Dec-2019 00:26:52         at org.springframework.test.context.junit4.SpringJUnit4ClassRunner.runChild(SpringJUnit4ClassRunner.java:94)
06-Dec-2019 00:26:52         at org.junit.runners.ParentRunner$3.run(ParentRunner.java:290)
06-Dec-2019 00:26:52         at org.junit.runners.ParentRunner$1.schedule(ParentRunner.java:71)
06-Dec-2019 00:26:52         at org.junit.runners.ParentRunner.runChildren(ParentRunner.java:288)
06-Dec-2019 00:26:52         at org.junit.runners.ParentRunner.access$000(ParentRunner.java:58)
06-Dec-2019 00:26:52         at org.junit.runners.ParentRunner$2.evaluate(ParentRunner.java:268)
06-Dec-2019 00:26:52         at org.springframework.test.context.junit4.statements.RunBeforeTestClassCallbacks.evaluate(RunBeforeTestClassCallbacks.java:61)
06-Dec-2019 00:26:52         at org.springframework.test.context.junit4.statements.RunAfterTestClassCallbacks.evaluate(RunAfterTestClassCallbacks.java:70)
06-Dec-2019 00:26:52         at org.junit.runners.ParentRunner.run(ParentRunner.java:363)
06-Dec-2019 00:26:52         at org.springframework.test.context.junit4.SpringJUnit4ClassRunner.run(SpringJUnit4ClassRunner.java:191)
06-Dec-2019 00:26:52         at org.apache.maven.surefire.junit4.JUnit4Provider.execute(JUnit4Provider.java:283)
06-Dec-2019 00:26:52         at org.apache.maven.surefire.junit4.JUnit4Provider.executeWithRerun(JUnit4Provider.java:173)
06-Dec-2019 00:26:52         at org.apache.maven.surefire.junit4.JUnit4Provider.executeTestSet(JUnit4Provider.java:153)
06-Dec-2019 00:26:52         at org.apache.maven.surefire.junit4.JUnit4Provider.invoke(JUnit4Provider.java:128)
06-Dec-2019 00:26:52         at org.apache.maven.surefire.booter.ForkedBooter.invokeProviderInSameClassLoader(ForkedBooter.java:203)
06-Dec-2019 00:26:52         at org.apache.maven.surefire.booter.ForkedBooter.runSuitesInProcess(ForkedBooter.java:155)
06-Dec-2019 00:26:52         at org.apache.maven.surefire.booter.ForkedBooter.main(ForkedBooter.java:103)
06-Dec-2019 00:26:52
06-Dec-2019 00:26:52 2019-12-06 00:26:52.562  INFO 6646 --- [           main] junit.logTestName                        : Finished Test testDestination(org.springframework.cloud.dataflow.acceptance.test.NamedChannelTests)
06-Dec-2019 00:26:52 2019-12-06 00:26:52.563  INFO 6646 --- [           main] o.s.c.d.a.test.NamedChannelTests         : Destroy all streams
06-Dec-2019 00:26:52 2019-12-06 00:26:52.608  INFO 6646 --- [           main] junit.logTestName                        : Starting Test testTap(org.springframework.cloud.dataflow.acceptance.test.NamedChannelTests)
06-Dec-2019 00:26:52 2019-12-06 00:26:52.609  INFO 6646 --- [           main] o.s.c.d.a.test.NamedChannelTests         : Creating stream 'TAPHTTP'
06-Dec-2019 00:26:52 2019-12-06 00:26:52.631 ERROR 6646 --- [           main] junit.logTestName                        : !!! Test testTap(org.springframework.cloud.dataflow.acceptance.test.NamedChannelTests) Failed !!!
06-Dec-2019 00:26:52
06-Dec-2019 00:26:52 org.springframework.cloud.dataflow.rest.client.DataFlowClientException: I/O error on GET request for "http://localhost:7577/api/release/status/TAPHTTP": Connect to localhost:7577 [localhost/127.0.0.1, localhost/0:0:0:0:0:0:0:1] failed: Connection refused (Connection refused); nested exception is org.apache.http.conn.HttpHostConnectException: Connect to localhost:7577 [localhost/127.0.0.1, localhost/0:0:0:0:0:0:0:1] failed: Connection refused (Connection refused)
06-Dec-2019 00:26:52
06-Dec-2019 00:26:52         at org.springframework.cloud.dataflow.rest.client.VndErrorResponseErrorHandler.handleError(VndErrorResponseErrorHandler.java:63)
06-Dec-2019 00:26:52         at org.springframework.web.client.RestTemplate.handleResponse(RestTemplate.java:667)
06-Dec-2019 00:26:52         at org.springframework.web.client.RestTemplate.doExecute(RestTemplate.java:620)
06-Dec-2019 00:26:52         at org.springframework.web.client.RestTemplate.execute(RestTemplate.java:580)
06-Dec-2019 00:26:52         at org.springframework.web.client.RestTemplate.postForObject(RestTemplate.java:380)
06-Dec-2019 00:26:52         at org.springframework.cloud.dataflow.rest.client.StreamTemplate.createStream(StreamTemplate.java:120)
06-Dec-2019 00:26:52         at org.springframework.cloud.dataflow.acceptance.test.AbstractStreamTests.deployStream(AbstractStreamTests.java:169)
06-Dec-2019 00:26:52         at org.springframework.cloud.dataflow.acceptance.test.NamedChannelTests.deployStream(NamedChannelTests.java:88)
06-Dec-2019 00:26:52         at org.springframework.cloud.dataflow.acceptance.test.NamedChannelTests.deployHttp(NamedChannelTests.java:104)
06-Dec-2019 00:26:52         at org.springframework.cloud.dataflow.acceptance.test.NamedChannelTests.testTap(NamedChannelTests.java:45)
06-Dec-2019 00:26:52         at sun.reflect.NativeMethodAccessorImpl.invoke0(Native Method)
06-Dec-2019 00:26:52         at sun.reflect.NativeMethodAccessorImpl.invoke(NativeMethodAccessorImpl.java:62)
06-Dec-2019 00:26:52         at sun.reflect.DelegatingMethodAccessorImpl.invoke(DelegatingMethodAccessorImpl.java:43)
06-Dec-2019 00:26:52         at java.lang.reflect.Method.invoke(Method.java:498)
06-Dec-2019 00:26:52         at org.junit.runners.model.FrameworkMethod$1.runReflectiveCall(FrameworkMethod.java:50)
06-Dec-2019 00:26:52         at org.junit.internal.runners.model.ReflectiveCallable.run(ReflectiveCallable.java:12)
06-Dec-2019 00:26:52         at org.junit.runners.model.FrameworkMethod.invokeExplosively(FrameworkMethod.java:47)
06-Dec-2019 00:26:52         at org.junit.internal.runners.statements.InvokeMethod.evaluate(InvokeMethod.java:17)
06-Dec-2019 00:26:52         at org.junit.internal.runners.statements.RunBefores.evaluate(RunBefores.java:26)
06-Dec-2019 00:26:52         at org.springframework.test.context.junit4.statements.RunBeforeTestMethodCallbacks.evaluate(RunBeforeTestMethodCallbacks.java:75)
06-Dec-2019 00:26:52         at org.springframework.test.context.junit4.statements.RunAfterTestMethodCallbacks.evaluate(RunAfterTestMethodCallbacks.java:86)
06-Dec-2019 00:26:52         at org.junit.rules.TestWatcher$1.evaluate(TestWatcher.java:55)
06-Dec-2019 00:26:52         at org.junit.rules.ExternalResource$1.evaluate(ExternalResource.java:48)
06-Dec-2019 00:26:52         at org.junit.rules.RunRules.evaluate(RunRules.java:20)
06-Dec-2019 00:26:52         at org.springframework.test.context.junit4.statements.SpringRepeat.evaluate(SpringRepeat.java:84)
06-Dec-2019 00:26:52         at org.junit.runners.ParentRunner.runLeaf(ParentRunner.java:325)
06-Dec-2019 00:26:52         at org.springframework.test.context.junit4.SpringJUnit4ClassRunner.runChild(SpringJUnit4ClassRunner.java:252)
06-Dec-2019 00:26:52         at org.springframework.test.context.junit4.SpringJUnit4ClassRunner.runChild(SpringJUnit4ClassRunner.java:94)
06-Dec-2019 00:26:52         at org.junit.runners.ParentRunner$3.run(ParentRunner.java:290)
06-Dec-2019 00:26:52         at org.junit.runners.ParentRunner$1.schedule(ParentRunner.java:71)
06-Dec-2019 00:26:52         at org.junit.runners.ParentRunner.runChildren(ParentRunner.java:288)
06-Dec-2019 00:26:52         at org.junit.runners.ParentRunner.access$000(ParentRunner.java:58)
06-Dec-2019 00:26:52         at org.junit.runners.ParentRunner$2.evaluate(ParentRunner.java:268)
06-Dec-2019 00:26:52         at org.springframework.test.context.junit4.statements.RunBeforeTestClassCallbacks.evaluate(RunBeforeTestClassCallbacks.java:61)
06-Dec-2019 00:26:52         at org.springframework.test.context.junit4.statements.RunAfterTestClassCallbacks.evaluate(RunAfterTestClassCallbacks.java:70)
06-Dec-2019 00:26:52         at org.junit.runners.ParentRunner.run(ParentRunner.java:363)
06-Dec-2019 00:26:52         at org.springframework.test.context.junit4.SpringJUnit4ClassRunner.run(SpringJUnit4ClassRunner.java:191)
06-Dec-2019 00:26:52         at org.apache.maven.surefire.junit4.JUnit4Provider.execute(JUnit4Provider.java:283)
06-Dec-2019 00:26:52         at org.apache.maven.surefire.junit4.JUnit4Provider.executeWithRerun(JUnit4Provider.java:173)
06-Dec-2019 00:26:52         at org.apache.maven.surefire.junit4.JUnit4Provider.executeTestSet(JUnit4Provider.java:153)
06-Dec-2019 00:26:52         at org.apache.maven.surefire.junit4.JUnit4Provider.invoke(JUnit4Provider.java:128)
06-Dec-2019 00:26:52         at org.apache.maven.surefire.booter.ForkedBooter.invokeProviderInSameClassLoader(ForkedBooter.java:203)
06-Dec-2019 00:26:52         at org.apache.maven.surefire.booter.ForkedBooter.runSuitesInProcess(ForkedBooter.java:155)
06-Dec-2019 00:26:52         at org.apache.maven.surefire.booter.ForkedBooter.main(ForkedBooter.java:103)
06-Dec-2019 00:26:52
06-Dec-2019 00:26:52 2019-12-06 00:26:52.632  INFO 6646 --- [           main] junit.logTestName                        : Finished Test testTap(org.springframework.cloud.dataflow.acceptance.test.NamedChannelTests)
06-Dec-2019 00:26:52 2019-12-06 00:26:52.632  INFO 6646 --- [           main] o.s.c.d.a.test.NamedChannelTests         : Destroy all streams
06-Dec-2019 00:26:52 2019-12-06 00:26:52.686  INFO 6646 --- [           main] junit.logTestName                        : Starting Test manyToOneTest(org.springframework.cloud.dataflow.acceptance.test.NamedChannelTests)
06-Dec-2019 00:26:52 2019-12-06 00:26:52.687  INFO 6646 --- [           main] o.s.c.d.a.test.NamedChannelTests         : Creating stream 'MANY-TO-ONE'
06-Dec-2019 00:26:52 2019-12-06 00:26:52.713 ERROR 6646 --- [           main] junit.logTestName                        : !!! Test manyToOneTest(org.springframework.cloud.dataflow.acceptance.test.NamedChannelTests) Failed !!!
06-Dec-2019 00:26:52
06-Dec-2019 00:26:52 org.springframework.cloud.dataflow.rest.client.DataFlowClientException: I/O error on GET request for "http://localhost:7577/api/release/status/MANY-TO-ONE": Connect to localhost:7577 [localhost/127.0.0.1, localhost/0:0:0:0:0:0:0:1] failed: Connection refused (Connection refused); nested exception is org.apache.http.conn.HttpHostConnectException: Connect to localhost:7577 [localhost/127.0.0.1, localhost/0:0:0:0:0:0:0:1] failed: Connection refused (Connection refused)
06-Dec-2019 00:26:52
06-Dec-2019 00:26:52         at org.springframework.cloud.dataflow.rest.client.VndErrorResponseErrorHandler.handleError(VndErrorResponseErrorHandler.java:63)
06-Dec-2019 00:26:52         at org.springframework.web.client.RestTemplate.handleResponse(RestTemplate.java:667)
06-Dec-2019 00:26:52         at org.springframework.web.client.RestTemplate.doExecute(RestTemplate.java:620)
06-Dec-2019 00:26:52         at org.springframework.web.client.RestTemplate.execute(RestTemplate.java:580)
06-Dec-2019 00:26:52         at org.springframework.web.client.RestTemplate.postForObject(RestTemplate.java:380)
06-Dec-2019 00:26:52         at org.springframework.cloud.dataflow.rest.client.StreamTemplate.createStream(StreamTemplate.java:120)
06-Dec-2019 00:26:52         at org.springframework.cloud.dataflow.acceptance.test.AbstractStreamTests.deployStream(AbstractStreamTests.java:169)
06-Dec-2019 00:26:52         at org.springframework.cloud.dataflow.acceptance.test.NamedChannelTests.deployStream(NamedChannelTests.java:88)
06-Dec-2019 00:26:52         at org.springframework.cloud.dataflow.acceptance.test.NamedChannelTests.deployLog(NamedChannelTests.java:96)
06-Dec-2019 00:26:52         at org.springframework.cloud.dataflow.acceptance.test.NamedChannelTests.manyToOneTest(NamedChannelTests.java:58)
06-Dec-2019 00:26:52         at sun.reflect.NativeMethodAccessorImpl.invoke0(Native Method)
06-Dec-2019 00:26:52         at sun.reflect.NativeMethodAccessorImpl.invoke(NativeMethodAccessorImpl.java:62)
06-Dec-2019 00:26:52         at sun.reflect.DelegatingMethodAccessorImpl.invoke(DelegatingMethodAccessorImpl.java:43)
06-Dec-2019 00:26:52         at java.lang.reflect.Method.invoke(Method.java:498)
06-Dec-2019 00:26:52         at org.junit.runners.model.FrameworkMethod$1.runReflectiveCall(FrameworkMethod.java:50)
06-Dec-2019 00:26:52         at org.junit.internal.runners.model.ReflectiveCallable.run(ReflectiveCallable.java:12)
06-Dec-2019 00:26:52         at org.junit.runners.model.FrameworkMethod.invokeExplosively(FrameworkMethod.java:47)
06-Dec-2019 00:26:52         at org.junit.internal.runners.statements.InvokeMethod.evaluate(InvokeMethod.java:17)
06-Dec-2019 00:26:52         at org.junit.internal.runners.statements.RunBefores.evaluate(RunBefores.java:26)
06-Dec-2019 00:26:52         at org.springframework.test.context.junit4.statements.RunBeforeTestMethodCallbacks.evaluate(RunBeforeTestMethodCallbacks.java:75)
06-Dec-2019 00:26:52         at org.springframework.test.context.junit4.statements.RunAfterTestMethodCallbacks.evaluate(RunAfterTestMethodCallbacks.java:86)
06-Dec-2019 00:26:52         at org.junit.rules.TestWatcher$1.evaluate(TestWatcher.java:55)
06-Dec-2019 00:26:52         at org.junit.rules.ExternalResource$1.evaluate(ExternalResource.java:48)
06-Dec-2019 00:26:52         at org.junit.rules.RunRules.evaluate(RunRules.java:20)
06-Dec-2019 00:26:52         at org.springframework.test.context.junit4.statements.SpringRepeat.evaluate(SpringRepeat.java:84)
06-Dec-2019 00:26:52         at org.junit.runners.ParentRunner.runLeaf(ParentRunner.java:325)
06-Dec-2019 00:26:52         at org.springframework.test.context.junit4.SpringJUnit4ClassRunner.runChild(SpringJUnit4ClassRunner.java:252)
06-Dec-2019 00:26:52         at org.springframework.test.context.junit4.SpringJUnit4ClassRunner.runChild(SpringJUnit4ClassRunner.java:94)
06-Dec-2019 00:26:52         at org.junit.runners.ParentRunner$3.run(ParentRunner.java:290)
06-Dec-2019 00:26:52         at org.junit.runners.ParentRunner$1.schedule(ParentRunner.java:71)
06-Dec-2019 00:26:52         at org.junit.runners.ParentRunner.runChildren(ParentRunner.java:288)
06-Dec-2019 00:26:52         at org.junit.runners.ParentRunner.access$000(ParentRunner.java:58)
06-Dec-2019 00:26:52         at org.junit.runners.ParentRunner$2.evaluate(ParentRunner.java:268)
06-Dec-2019 00:26:52         at org.springframework.test.context.junit4.statements.RunBeforeTestClassCallbacks.evaluate(RunBeforeTestClassCallbacks.java:61)
06-Dec-2019 00:26:52         at org.springframework.test.context.junit4.statements.RunAfterTestClassCallbacks.evaluate(RunAfterTestClassCallbacks.java:70)
06-Dec-2019 00:26:52         at org.junit.runners.ParentRunner.run(ParentRunner.java:363)
06-Dec-2019 00:26:52         at org.springframework.test.context.junit4.SpringJUnit4ClassRunner.run(SpringJUnit4ClassRunner.java:191)
06-Dec-2019 00:26:52         at org.apache.maven.surefire.junit4.JUnit4Provider.execute(JUnit4Provider.java:283)
06-Dec-2019 00:26:52         at org.apache.maven.surefire.junit4.JUnit4Provider.executeWithRerun(JUnit4Provider.java:173)
06-Dec-2019 00:26:52         at org.apache.maven.surefire.junit4.JUnit4Provider.executeTestSet(JUnit4Provider.java:153)
06-Dec-2019 00:26:52         at org.apache.maven.surefire.junit4.JUnit4Provider.invoke(JUnit4Provider.java:128)
06-Dec-2019 00:26:52         at org.apache.maven.surefire.booter.ForkedBooter.invokeProviderInSameClassLoader(ForkedBooter.java:203)
06-Dec-2019 00:26:52         at org.apache.maven.surefire.booter.ForkedBooter.runSuitesInProcess(ForkedBooter.java:155)
06-Dec-2019 00:26:52         at org.apache.maven.surefire.booter.ForkedBooter.main(ForkedBooter.java:103)
06-Dec-2019 00:26:52
06-Dec-2019 00:26:52 2019-12-06 00:26:52.713  INFO 6646 --- [           main] junit.logTestName                        : Finished Test manyToOneTest(org.springframework.cloud.dataflow.acceptance.test.NamedChannelTests)
06-Dec-2019 00:26:52 2019-12-06 00:26:52.713  INFO 6646 --- [           main] o.s.c.d.a.test.NamedChannelTests         : Destroy all streams
06-Dec-2019 00:26:52 Tests run: 4, Failures: 0, Errors: 3, Skipped: 1, Time elapsed: 0.227 sec <<< FAILURE! - in org.springframework.cloud.dataflow.acceptance.test.NamedChannelTests
06-Dec-2019 00:26:52 testDestination(org.springframework.cloud.dataflow.acceptance.test.NamedChannelTests)  Time elapsed: 0.038 sec  <<< ERROR!
06-Dec-2019 00:26:52 org.springframework.cloud.dataflow.rest.client.DataFlowClientException: I/O error on GET request for "http://localhost:7577/api": Connect to localhost:7577 [localhost/127.0.0.1, localhost/0:0:0:0:0:0:0:1] failed: Connection refused (Connection refused); nested exception is org.apache.http.conn.HttpHostConnectException: Connect to localhost:7577 [localhost/127.0.0.1, localhost/0:0:0:0:0:0:0:1] failed: Connection refused (Connection refused)
06-Dec-2019 00:26:52
06-Dec-2019 00:26:52         at org.springframework.cloud.dataflow.rest.client.VndErrorResponseErrorHandler.handleError(VndErrorResponseErrorHandler.java:63)
06-Dec-2019 00:26:52         at org.springframework.web.client.RestTemplate.handleResponse(RestTemplate.java:667)
06-Dec-2019 00:26:52         at org.springframework.web.client.RestTemplate.doExecute(RestTemplate.java:620)
06-Dec-2019 00:26:52         at org.springframework.web.client.RestTemplate.execute(RestTemplate.java:580)
06-Dec-2019 00:26:52         at org.springframework.web.client.RestTemplate.delete(RestTemplate.java:452)
06-Dec-2019 00:26:52         at org.springframework.cloud.dataflow.rest.client.StreamTemplate.destroyAll(StreamTemplate.java:147)
06-Dec-2019 00:26:52         at org.springframework.cloud.dataflow.acceptance.test.AbstractStreamTests$1.after(AbstractStreamTests.java:119)
06-Dec-2019 00:26:52         at org.junit.rules.ExternalResource$1.evaluate(ExternalResource.java:50)
06-Dec-2019 00:26:52         at org.junit.rules.RunRules.evaluate(RunRules.java:20)
06-Dec-2019 00:26:52         at org.springframework.test.context.junit4.statements.SpringRepeat.evaluate(SpringRepeat.java:84)
06-Dec-2019 00:26:52         at org.junit.runners.ParentRunner.runLeaf(ParentRunner.java:325)
06-Dec-2019 00:26:52         at org.springframework.test.context.junit4.SpringJUnit4ClassRunner.runChild(SpringJUnit4ClassRunner.java:252)
06-Dec-2019 00:26:52         at org.springframework.test.context.junit4.SpringJUnit4ClassRunner.runChild(SpringJUnit4ClassRunner.java:94)
06-Dec-2019 00:26:52         at org.junit.runners.ParentRunner$3.run(ParentRunner.java:290)
06-Dec-2019 00:26:52         at org.junit.runners.ParentRunner$1.schedule(ParentRunner.java:71)
06-Dec-2019 00:26:52         at org.junit.runners.ParentRunner.runChildren(ParentRunner.java:288)
06-Dec-2019 00:26:52         at org.junit.runners.ParentRunner.access$000(ParentRunner.java:58)
06-Dec-2019 00:26:52         at org.junit.runners.ParentRunner$2.evaluate(ParentRunner.java:268)
06-Dec-2019 00:26:52         at org.springframework.test.context.junit4.statements.RunBeforeTestClassCallbacks.evaluate(RunBeforeTestClassCallbacks.java:61)
06-Dec-2019 00:26:52         at org.springframework.test.context.junit4.statements.RunAfterTestClassCallbacks.evaluate(RunAfterTestClassCallbacks.java:70)
06-Dec-2019 00:26:52         at org.junit.runners.ParentRunner.run(ParentRunner.java:363)
06-Dec-2019 00:26:52         at org.springframework.test.context.junit4.SpringJUnit4ClassRunner.run(SpringJUnit4ClassRunner.java:191)
06-Dec-2019 00:26:52         at org.apache.maven.surefire.junit4.JUnit4Provider.execute(JUnit4Provider.java:283)
06-Dec-2019 00:26:52         at org.apache.maven.surefire.junit4.JUnit4Provider.executeWithRerun(JUnit4Provider.java:173)
06-Dec-2019 00:26:52         at org.apache.maven.surefire.junit4.JUnit4Provider.executeTestSet(JUnit4Provider.java:153)
06-Dec-2019 00:26:52         at org.apache.maven.surefire.junit4.JUnit4Provider.invoke(JUnit4Provider.java:128)
06-Dec-2019 00:26:52         at org.apache.maven.surefire.booter.ForkedBooter.invokeProviderInSameClassLoader(ForkedBooter.java:203)
06-Dec-2019 00:26:52         at org.apache.maven.surefire.booter.ForkedBooter.runSuitesInProcess(ForkedBooter.java:155)
06-Dec-2019 00:26:52         at org.apache.maven.surefire.booter.ForkedBooter.main(ForkedBooter.java:103)
06-Dec-2019 00:26:52
06-Dec-2019 00:26:52 testTap(org.springframework.cloud.dataflow.acceptance.test.NamedChannelTests)  Time elapsed: 0.031 sec  <<< ERROR!
06-Dec-2019 00:26:52 org.springframework.cloud.dataflow.rest.client.DataFlowClientException: I/O error on GET request for "http://localhost:7577/api": Connect to localhost:7577 [localhost/127.0.0.1, localhost/0:0:0:0:0:0:0:1] failed: Connection refused (Connection refused); nested exception is org.apache.http.conn.HttpHostConnectException: Connect to localhost:7577 [localhost/127.0.0.1, localhost/0:0:0:0:0:0:0:1] failed: Connection refused (Connection refused)
06-Dec-2019 00:26:52
06-Dec-2019 00:26:52         at org.springframework.cloud.dataflow.rest.client.VndErrorResponseErrorHandler.handleError(VndErrorResponseErrorHandler.java:63)
06-Dec-2019 00:26:52         at org.springframework.web.client.RestTemplate.handleResponse(RestTemplate.java:667)
06-Dec-2019 00:26:52         at org.springframework.web.client.RestTemplate.doExecute(RestTemplate.java:620)
06-Dec-2019 00:26:52         at org.springframework.web.client.RestTemplate.execute(RestTemplate.java:580)
06-Dec-2019 00:26:52         at org.springframework.web.client.RestTemplate.delete(RestTemplate.java:452)
06-Dec-2019 00:26:52         at org.springframework.cloud.dataflow.rest.client.StreamTemplate.destroyAll(StreamTemplate.java:147)
06-Dec-2019 00:26:52         at org.springframework.cloud.dataflow.acceptance.test.AbstractStreamTests$1.after(AbstractStreamTests.java:119)
06-Dec-2019 00:26:52         at org.junit.rules.ExternalResource$1.evaluate(ExternalResource.java:50)
06-Dec-2019 00:26:52         at org.junit.rules.RunRules.evaluate(RunRules.java:20)
06-Dec-2019 00:26:52         at org.springframework.test.context.junit4.statements.SpringRepeat.evaluate(SpringRepeat.java:84)
06-Dec-2019 00:26:52         at org.junit.runners.ParentRunner.runLeaf(ParentRunner.java:325)
06-Dec-2019 00:26:52         at org.springframework.test.context.junit4.SpringJUnit4ClassRunner.runChild(SpringJUnit4ClassRunner.java:252)
06-Dec-2019 00:26:52         at org.springframework.test.context.junit4.SpringJUnit4ClassRunner.runChild(SpringJUnit4ClassRunner.java:94)
06-Dec-2019 00:26:52         at org.junit.runners.ParentRunner$3.run(ParentRunner.java:290)
06-Dec-2019 00:26:52         at org.junit.runners.ParentRunner$1.schedule(ParentRunner.java:71)
06-Dec-2019 00:26:52         at org.junit.runners.ParentRunner.runChildren(ParentRunner.java:288)
06-Dec-2019 00:26:52         at org.junit.runners.ParentRunner.access$000(ParentRunner.java:58)
06-Dec-2019 00:26:52         at org.junit.runners.ParentRunner$2.evaluate(ParentRunner.java:268)
06-Dec-2019 00:26:52         at org.springframework.test.context.junit4.statements.RunBeforeTestClassCallbacks.evaluate(RunBeforeTestClassCallbacks.java:61)
06-Dec-2019 00:26:52         at org.springframework.test.context.junit4.statements.RunAfterTestClassCallbacks.evaluate(RunAfterTestClassCallbacks.java:70)
06-Dec-2019 00:26:52         at org.junit.runners.ParentRunner.run(ParentRunner.java:363)
06-Dec-2019 00:26:52         at org.springframework.test.context.junit4.SpringJUnit4ClassRunner.run(SpringJUnit4ClassRunner.java:191)
06-Dec-2019 00:26:52         at org.apache.maven.surefire.junit4.JUnit4Provider.execute(JUnit4Provider.java:283)
06-Dec-2019 00:26:52         at org.apache.maven.surefire.junit4.JUnit4Provider.executeWithRerun(JUnit4Provider.java:173)
06-Dec-2019 00:26:52         at org.apache.maven.surefire.junit4.JUnit4Provider.executeTestSet(JUnit4Provider.java:153)
06-Dec-2019 00:26:52         at org.apache.maven.surefire.junit4.JUnit4Provider.invoke(JUnit4Provider.java:128)
06-Dec-2019 00:26:52         at org.apache.maven.surefire.booter.ForkedBooter.invokeProviderInSameClassLoader(ForkedBooter.java:203)
06-Dec-2019 00:26:52         at org.apache.maven.surefire.booter.ForkedBooter.runSuitesInProcess(ForkedBooter.java:155)
06-Dec-2019 00:26:52         at org.apache.maven.surefire.booter.ForkedBooter.main(ForkedBooter.java:103)
06-Dec-2019 00:26:52
06-Dec-2019 00:26:52 manyToOneTest(org.springframework.cloud.dataflow.acceptance.test.NamedChannelTests)  Time elapsed: 0.039 sec  <<< ERROR!
06-Dec-2019 00:26:52 org.springframework.cloud.dataflow.rest.client.DataFlowClientException: I/O error on GET request for "http://localhost:7577/api": Connect to localhost:7577 [localhost/127.0.0.1, localhost/0:0:0:0:0:0:0:1] failed: Connection refused (Connection refused); nested exception is org.apache.http.conn.HttpHostConnectException: Connect to localhost:7577 [localhost/127.0.0.1, localhost/0:0:0:0:0:0:0:1] failed: Connection refused (Connection refused)
06-Dec-2019 00:26:52
06-Dec-2019 00:26:52         at org.springframework.cloud.dataflow.rest.client.VndErrorResponseErrorHandler.handleError(VndErrorResponseErrorHandler.java:63)
06-Dec-2019 00:26:52         at org.springframework.web.client.RestTemplate.handleResponse(RestTemplate.java:667)
06-Dec-2019 00:26:52         at org.springframework.web.client.RestTemplate.doExecute(RestTemplate.java:620)
06-Dec-2019 00:26:52         at org.springframework.web.client.RestTemplate.execute(RestTemplate.java:580)
06-Dec-2019 00:26:52         at org.springframework.web.client.RestTemplate.delete(RestTemplate.java:452)
06-Dec-2019 00:26:52         at org.springframework.cloud.dataflow.rest.client.StreamTemplate.destroyAll(StreamTemplate.java:147)
06-Dec-2019 00:26:52         at org.springframework.cloud.dataflow.acceptance.test.AbstractStreamTests$1.after(AbstractStreamTests.java:119)
06-Dec-2019 00:26:52         at org.junit.rules.ExternalResource$1.evaluate(ExternalResource.java:50)
06-Dec-2019 00:26:52         at org.junit.rules.RunRules.evaluate(RunRules.java:20)
06-Dec-2019 00:26:52         at org.springframework.test.context.junit4.statements.SpringRepeat.evaluate(SpringRepeat.java:84)
06-Dec-2019 00:26:52         at org.junit.runners.ParentRunner.runLeaf(ParentRunner.java:325)
06-Dec-2019 00:26:52         at org.springframework.test.context.junit4.SpringJUnit4ClassRunner.runChild(SpringJUnit4ClassRunner.java:252)
06-Dec-2019 00:26:52         at org.springframework.test.context.junit4.SpringJUnit4ClassRunner.runChild(SpringJUnit4ClassRunner.java:94)
06-Dec-2019 00:26:52         at org.junit.runners.ParentRunner$3.run(ParentRunner.java:290)
06-Dec-2019 00:26:52         at org.junit.runners.ParentRunner$1.schedule(ParentRunner.java:71)
06-Dec-2019 00:26:52         at org.junit.runners.ParentRunner.runChildren(ParentRunner.java:288)
06-Dec-2019 00:26:52         at org.junit.runners.ParentRunner.access$000(ParentRunner.java:58)
06-Dec-2019 00:26:52         at org.junit.runners.ParentRunner$2.evaluate(ParentRunner.java:268)
06-Dec-2019 00:26:52         at org.springframework.test.context.junit4.statements.RunBeforeTestClassCallbacks.evaluate(RunBeforeTestClassCallbacks.java:61)
06-Dec-2019 00:26:52         at org.springframework.test.context.junit4.statements.RunAfterTestClassCallbacks.evaluate(RunAfterTestClassCallbacks.java:70)
06-Dec-2019 00:26:52         at org.junit.runners.ParentRunner.run(ParentRunner.java:363)
06-Dec-2019 00:26:52         at org.springframework.test.context.junit4.SpringJUnit4ClassRunner.run(SpringJUnit4ClassRunner.java:191)
06-Dec-2019 00:26:52         at org.apache.maven.surefire.junit4.JUnit4Provider.execute(JUnit4Provider.java:283)
06-Dec-2019 00:26:52         at org.apache.maven.surefire.junit4.JUnit4Provider.executeWithRerun(JUnit4Provider.java:173)
06-Dec-2019 00:26:52         at org.apache.maven.surefire.junit4.JUnit4Provider.executeTestSet(JUnit4Provider.java:153)
06-Dec-2019 00:26:52         at org.apache.maven.surefire.junit4.JUnit4Provider.invoke(JUnit4Provider.java:128)
06-Dec-2019 00:26:52         at org.apache.maven.surefire.booter.ForkedBooter.invokeProviderInSameClassLoader(ForkedBooter.java:203)
06-Dec-2019 00:26:52         at org.apache.maven.surefire.booter.ForkedBooter.runSuitesInProcess(ForkedBooter.java:155)
06-Dec-2019 00:26:52         at org.apache.maven.surefire.booter.ForkedBooter.main(ForkedBooter.java:103)
06-Dec-2019 00:26:52
06-Dec-2019 00:26:52 Running org.springframework.cloud.dataflow.acceptance.test.util.PlatformHelperTests
06-Dec-2019 00:26:52 Tests run: 3, Failures: 0, Errors: 0, Skipped: 0, Time elapsed: 0.056 sec - in org.springframework.cloud.dataflow.acceptance.test.util.PlatformHelperTests
06-Dec-2019 00:26:52 Running org.springframework.cloud.dataflow.acceptance.test.util.ApplicationTests
06-Dec-2019 00:26:52 Tests run: 2, Failures: 0, Errors: 0, Skipped: 0, Time elapsed: 0.002 sec - in org.springframework.cloud.dataflow.acceptance.test.util.ApplicationTests
06-Dec-2019 00:26:52 2019-12-06 00:26:52.810  INFO 6646 --- [       Thread-6] o.s.c.support.GenericApplicationContext  : Closing org.springframework.context.support.GenericApplicationContext@2bfb6b49: startup date [Fri Dec 06 00:24:13 UTC 2019]; root of context hierarchy
06-Dec-2019 00:26:52
06-Dec-2019 00:26:52 Results :
06-Dec-2019 00:26:52
06-Dec-2019 00:26:52 Tests in error:
06-Dec-2019 00:26:52   HttpSourceTests.httpSourceTests » DataFlowClient I/O error on GET request for ...
06-Dec-2019 00:26:52   NamedChannelTests.manyToOneTest » DataFlowClient I/O error on GET request for ...
06-Dec-2019 00:26:52   NamedChannelTests.testDestination » DataFlowClient I/O error on GET request fo...
06-Dec-2019 00:26:52   NamedChannelTests.testTap » DataFlowClient I/O error on GET request for "http:...
06-Dec-2019 00:26:52   TickTockTests.tickTockTests » DataFlowClient I/O error on GET request for "htt...
06-Dec-2019 00:26:52   TickTockTests.tickTockTestsFromConfigServer » DataFlowClient I/O error on GET ...
06-Dec-2019 00:26:52   TickTockTests.tickTockUpdateRollbackTests » DataFlowClient I/O error on GET re...
06-Dec-2019 00:26:52   TransformTests.transformTests » DataFlowClient I/O error on GET request for "h...
06-Dec-2019 00:26:52   WoodChuckTests.testPartitioning » DataFlowClient I/O error on GET request for ...
06-Dec-2019 00:26:52
06-Dec-2019 00:26:52 Tests run: 22, Failures: 0, Errors: 9, Skipped: 3
06-Dec-2019 00:26:52
06-Dec-2019 00:26:52 [INFO] ------------------------------------------------------------------------
06-Dec-2019 00:26:52 [INFO] BUILD FAILURE
06-Dec-2019 00:26:52 [INFO] ------------------------------------------------------------------------
06-Dec-2019 00:26:52 [INFO] Total time: 02:49 min
06-Dec-2019 00:26:52 [INFO] Finished at: 2019-12-06T00:26:52+00:00
06-Dec-2019 00:26:53 [INFO] Final Memory: 54M/450M
06-Dec-2019 00:26:53 [INFO] ------------------------------------------------------------------------
06-Dec-2019 00:26:53 [ERROR] Failed to execute goal org.apache.maven.plugins:maven-surefire-plugin:2.18.1:test (default-test) on project spring-cloud-dataflow-acceptance-tests: There are test failures.
06-Dec-2019 00:26:53 [ERROR]
06-Dec-2019 00:26:53 [ERROR] Please refer to /opt/bamboo-home/xml-data/build-dir/SCDT-LOCAL20XSKIPPER20X-RABBIT/target/surefire-reports for the individual test results.
06-Dec-2019 00:26:53 [ERROR] -> [Help 1]
06-Dec-2019 00:26:53 [ERROR]
06-Dec-2019 00:26:53 [ERROR] To see the full stack trace of the errors, re-run Maven with the -e switch.
06-Dec-2019 00:26:53 [ERROR] Re-run Maven using the -X switch to enable full debug logging.
06-Dec-2019 00:26:53 [ERROR]
06-Dec-2019 00:26:53 [ERROR] For more information about the errors and possible solutions, please read the following articles:
06-Dec-2019 00:26:53 [ERROR] [Help 1] http://cwiki.apache.org/confluence/display/MAVEN/MojoFailureException
06-Dec-2019 00:26:53 Clean up, clean up, everybody everywhere; clean up clean up, everybody do your share!
06-Dec-2019 00:26:53 Clean up servers
06-Dec-2019 00:26:53 Killing process PID [6529]
06-Dec-2019 00:26:53 No stopped containers
06-Dec-2019 00:26:54 Stopping mysql_mysql_1 ...
06-Dec-2019 00:26:55
06-Dec-2019 00:26:55 Stopping mysql_mysql_1 ... done
06-Dec-2019 00:26:56 Removing mysql_mysql_1 ...
06-Dec-2019 00:26:56
06-Dec-2019 00:26:56 Removing mysql_mysql_1 ... done
06-Dec-2019 00:26:56 Going to remove mysql_mysql_1
06-Dec-2019 00:26:57 No stopped containers
06-Dec-2019 00:26:57
06-Dec-2019 00:26:57 Finished task 'Execute Acceptance Tests' with result: Success
06-Dec-2019 00:26:57 Starting task 'JUnit Parser' of type 'com.atlassian.bamboo.plugins.testresultparser:task.testresultparser.junit'
06-Dec-2019 00:26:57 Parsing test results under /opt/bamboo-home/xml-data/build-dir/SCDT-LOCAL20XSKIPPER20X-RABBIT...
06-Dec-2019 00:26:57 Failing task since 9 failing test cases were found.
06-Dec-2019 00:26:57 Finished task 'JUnit Parser' with result: Failed
06-Dec-2019 00:26:57 Starting task 'clean up' of type 'com.atlassian.bamboo.plugins.scripttask:task.builder.script'
06-Dec-2019 00:26:57
Beginning to execute external process for build 'Spring Cloud Data Flow Acceptance Tests - Local + SCDF-2.0.4.BS + Skipper 2.0.4.BS (12 am) - Run Data Flow Acceptance Tests for Rabbit #188 (SCDT-LOCAL20XSKIPPER20X-RABBIT-188)'
... running command line:
/opt/bamboo-home/temp/SCDT-LOCAL20XSKIPPER20X-RABBIT-188-ScriptBuildTask-5612928308364707703.sh
... in: /opt/bamboo-home/xml-data/build-dir/SCDT-LOCAL20XSKIPPER20X-RABBIT
... using extra environment variables:
bamboo_planRepository_1_branch=master
bamboo_********_username_password=********
bamboo_signing_store_password=********
bamboo_capability_system_builder_ant_Ant_1_9=/opt/ant-1.9
bamboo_capability_system_builder_ant_Ant_1_8=/opt/ant-1.8
bamboo_planRepository_1_branchDisplayName=master
bamboo_repository_274694331_git_username=spring-buildmaster
bamboo_artifactory_override_resolve_repo=libs-milestone
bamboo_capability_system_builder_node_Node_js_10_16=/opt/node-10.16/bin/node
bamboo_repository_revision_number=ccc77f664d11e18a3b7f2fa17f012d09d08432a9
bamboo_RIAK_BIN=/usr/sbin/riak
bamboo_buildKey=SCDT-LOCAL20XSKIPPER20X-RABBIT
bamboo_repository_274694331_branch_name=master
bamboo_ge_cache_username=ci
bamboo_bintray_password=********
bamboo_sonar_token_password=********
bamboo_shortJobName=Run Data Flow Acceptance Tests for Rabbit
bamboo_artifactory_override_resolver_password=********
bamboo_sonatype_token=RSJChaox
bamboo_capability_system_builder_gradle___gradlew=./gradlew
bamboo_buildResultsUrl=https://build.spring.io/browse/SCDT-LOCAL20XSKIPPER20X-RABBIT-188
bamboo_capability_system_builder_mvn3_Maven_3_3=/opt/maven-3.3
bamboo_capability_system_builder_mvn3_Maven_3_2=/opt/maven-3.2
bamboo_capability_system_builder_mvn3_Maven_3_1=/opt/maven-3.1
bamboo_planRepository_repositoryUrl=https://github.com/spring-cloud/spring-cloud-dataflow-acceptance-tests.git
bamboo_capability_system_builder_mvn3_Maven_3_6=/opt/maven-3.6
bamboo_agentId=286195713
bamboo_capability_system_builder_mvn3_Maven_3_5=/opt/maven-3.5
bamboo_capability_system_builder_mvn3_Maven_3_0=/opt/maven-3.0
bamboo_planRepository_revision=ccc77f664d11e18a3b7f2fa17f012d09d08432a9
bamboo_planRepository_previousRevision=ccc77f664d11e18a3b7f2fa17f012d09d08432a9
bamboo_capability_remote_build=true
bamboo_repository_branch_name=master
bamboo_sonatype_token_password=********
bamboo_sonatype_user=springsource
bamboo_repository_274694331_name=Git
bamboo_scdf_acceptance_tests_password=********
bamboo_APPLE_AC_PASSWORD=********
bamboo_repository_274694331_git_branch=master
bamboo_planRepository_branch=master
bamboo_capability_system_jdk_JDK_13=/opt/jdk-13
bamboo_planRepository_1_type=gitv2
bamboo_planRepository_branchName=master
bamboo_capability_system_jdk_JDK_12=/opt/jdk-12
bamboo_capability_system_builder_gradlew_gradlew=./
bamboo_capability_system_builder_ant_Ant_1_10=/opt/ant-1.10
bamboo_sonar_password=********
bamboo_hg_cache_directory=/opt/bamboo-home/xml-data/build-dir/_hg-repositories-cache
bamboo_planRepository_1_username=spring-buildmaster
bamboo_repository_274694331_git_repositoryUrl=https://github.com/spring-cloud/spring-cloud-dataflow-acceptance-tests.git
bamboo_planRepository_type=gitv2
bamboo_git_cache_directory=/opt/bamboo-home/xml-data/build-dir/_git-repositories-cache
bamboo_artifactory_username=buildmaster
bamboo_tmp_directory=/opt/bamboo-home/temp
bamboo_planKey=SCDT-LOCAL20XSKIPPER20X
bamboo_planRepository_username=spring-buildmaster
bamboo_JDK8_HOME=/opt/jdk-8
bamboo_repository_274694331_previous_revision_number=ccc77f664d11e18a3b7f2fa17f012d09d08432a9
bamboo_planRepository_1_branchName=master
bamboo_sonar_version=6.7.7
bamboo_sonar_jdbc_password=********
bamboo_bintray_api_key_password=********
bamboo_capability_system_jdk_JDK_1_11=/opt/jdk-11
bamboo_resultsUrl=https://build.spring.io/browse/SCDT-LOCAL20XSKIPPER20X-RABBIT-188
bamboo_APPLE_AC_USERNAME_PASSWORD=********
bamboo_capability_system_jdk_JDK_1_10=/opt/jdk-10
bamboo_build_working_directory=/opt/bamboo-home/xml-data/build-dir/SCDT-LOCAL20XSKIPPER20X-RABBIT
bamboo_planRepository_1_name=Git
bamboo_capability_system_os=ubuntu1804
bamboo_nexusPush_stagingProfile=buildmaster
bamboo_shortPlanName=Local + SCDF-2.0.4.BS + Skipper 2.0.4.BS (12 am)
bamboo_planRepository_name=Git
bamboo_buildNumber=188
bamboo_planName=Spring Cloud Data Flow Acceptance Tests - Local + SCDF-2.0.4.BS + Skipper 2.0.4.BS (12 am)
bamboo_JDK7_HOME=/opt/jdk-7
bamboo_build_commandline_com_atlassian_bamboo_plugins_scripttask_task_builder_script_7=/opt/bamboo-home/temp/SCDT-LOCAL20XSKIPPER20X-RABBIT-188-ScriptBuildTask-8355299785658788333.sh
bamboo_shortPlanKey=LOCAL20XSKIPPER20X
bamboo_shortJobKey=RABBIT
bamboo_artifactory_password=********
bamboo_buildTimeStamp=2019-12-06T00:18:06.601Z
bamboo_repository_previous_revision_number=ccc77f664d11e18a3b7f2fa17f012d09d08432a9
bamboo_sonar_username=buildmaster
bamboo_********_password=********
bamboo_repository_git_branch=master
bamboo_buildResultKey=SCDT-LOCAL20XSKIPPER20X-RABBIT-188
bamboo_nexusPush_close=true
bamboo_artifactory_override_resolver_username=buildmaster
bamboo_buildPlanName=Spring Cloud Data Flow Acceptance Tests - Local + SCDF-2.0.4.BS + Skipper 2.0.4.BS (12 am) - Run Data Flow Acceptance Tests for Rabbit
bamboo_repository_274694331_revision_number=ccc77f664d11e18a3b7f2fa17f012d09d08432a9
bamboo_planRepository_1_revision=ccc77f664d11e18a3b7f2fa17f012d09d08432a9
bamboo_repository_name=Git
bamboo_signing_key_password=********
bamboo_capability_system_builder_groovy_Groovy_2_5=/opt/groovy-2.5
bamboo_buildFailed=true
bamboo_capability_system_docker_executable=/usr/bin/docker
bamboo_capability_system_jdk_OpenJDK_7=/opt/jdk-7
bamboo_capability_system_builder_groovy_Groovy_2_4=/opt/groovy-2.4
bamboo_artifactory_override_deployer_username=buildmaster
bamboo_capability_system_builder_command_Bash=/bin/bash
bamboo_jobFailed=true
bamboo_agentWorkingDirectory=/opt/bamboo-home/xml-data/build-dir
bamboo_capability_system_git_executable=/usr/bin/git
bamboo_repository_git_username=spring-buildmaster
bamboo_planRepository_1_previousRevision=ccc77f664d11e18a3b7f2fa17f012d09d08432a9
bamboo_capability_os_family=unix
bamboo_planRepository_branchDisplayName=master
bamboo_capability_system_builder_maven_Artifactory_Maven_3_6=/opt/maven-3.6
bamboo_capability_system_builder_maven_Artifactory_Maven_3_5=/opt/maven-3.5
bamboo_capability_system_builder_maven_Artifactory_Maven_3_3=/opt/maven-3.3
bamboo_capability_system_builder_maven_Artifactory_Maven_3_2=/opt/maven-3.2
bamboo_s3_properties=/home/bamboo/tools/s3.properties
bamboo_capability_system_builder_maven_Artifactory_Maven_3_1=/opt/maven-3.1
bamboo_artifactory_override_deploy_repo=libs-snapshot-local
bamboo_capability_system_builder_maven_Artifactory_Maven_3_0=/opt/maven-3.0
bamboo_plan_storageTag=plan-274497908
bamboo_bintray_username_password=********
bamboo_repository_git_repositoryUrl=https://github.com/spring-cloud/spring-cloud-dataflow-acceptance-tests.git
bamboo_working_directory=/opt/bamboo-home/xml-data/build-dir/SCDT-LOCAL20XSKIPPER20X-RABBIT
bamboo_planRepository_1_repositoryUrl=https://github.com/spring-cloud/spring-cloud-dataflow-acceptance-tests.git
bamboo_capability_system_jdk_JDK_1_8=/opt/jdk-8
bamboo_artifactory_override_deployer_password=********
bamboo_capability_system_jdk_JDK_1_9=/opt/jdk-9
bamboo_capability_system_jdk_JDK_1_6=/opt/jdk-6
bamboo_sonatype_password=********
bamboo_capability_system_jdk_JDK_1_7=/opt/jdk-7
bamboo_sonar_ip=10.194.6.9
bamboo_ge_cache_password=********
06-Dec-2019 00:26:57 CLEANING UP RESOURCES AFTER RUNNING TESTS
06-Dec-2019 00:26:57 Environment variable JAVA_HOME must be set
06-Dec-2019 00:26:57 FINISHED CLEANING UP RESOURCES
06-Dec-2019 00:26:57 Finished task 'clean up' with result: Success
06-Dec-2019 00:26:57 Running post build plugin 'Docker Container Cleanup'
06-Dec-2019 00:26:57 Running post build plugin 'NCover Results Collector'
06-Dec-2019 00:26:57 Running post build plugin 'Artifactory Release Management Staging'
06-Dec-2019 00:26:57 Running post build plugin 'Artifactory Build Info Copier'
06-Dec-2019 00:26:57 Running post build plugin 'Artifactory Gradle Properties Info Copier'
06-Dec-2019 00:26:57 Running post build plugin 'Clover Results Collector'
06-Dec-2019 00:26:57 Running post build plugin 'npm Cache Cleanup'
06-Dec-2019 00:26:57 Running post build plugin 'Artifact Copier'
06-Dec-2019 00:26:57 Publishing an artifact: App and Server Logs
06-Dec-2019 00:26:57 Finished publishing of artifact Non required job artifact: [App and Server Logs], pattern: [**/*.log] anchored at: [local] in 24.49 ms
06-Dec-2019 00:26:57 Publishing an artifact: Test Results
06-Dec-2019 00:26:57 Finished publishing of artifact Non required job artifact: [Test Results], pattern: [**/target/surefire-reports/**/*.*] in 38.53 ms
06-Dec-2019 00:26:57 Successfully removed working directory at '/opt/bamboo-home/xml-data/build-dir/SCDT-LOCAL20XSKIPPER20X-RABBIT'
06-Dec-2019 00:26:57 Finalising the build...
06-Dec-2019 00:26:57 Stopping timer.
06-Dec-2019 00:26:57 Build SCDT-LOCAL20XSKIPPER20X-RABBIT-188 completed.
06-Dec-2019 00:26:57 Running on server: post build plugin 'NCover Results Collector'
06-Dec-2019 00:26:57 Running on server: post build plugin 'Build Hanging Detection Configuration'
06-Dec-2019 00:26:57 Running on server: post build plugin 'Bamboo project link creator'
06-Dec-2019 00:26:57 Running on server: post build plugin 'Clover Delta Calculator'
06-Dec-2019 00:26:57 Running on server: post build plugin 'Maven Dependencies Postprocessor'
06-Dec-2019 00:26:57 All post build plugins have finished
06-Dec-2019 00:26:57 Generating build results summary...
06-Dec-2019 00:26:57 Saving build results to disk...
06-Dec-2019 00:26:57 Logging substituted variables...
06-Dec-2019 00:26:57 Indexing build results...
06-Dec-2019 00:26:57 Finished building SCDT-LOCAL20XSKIPPER20X-RABBIT-188.