Build: #193 failed

Job: Run Data Flow Acceptance Tests for Rabbit failed

Stages & jobs

  1. Test Stage - Kafka

  2. Test Stage - Rabbit

Build log

The build generated 1,197 lines of output.The output is too long and has been truncated to the last 1,000 lines. Download or view full build log

11-Dec-2019 00:26:30                 "platformType": "Local",
11-Dec-2019 00:26:30                 "springBootVersion": "2.1.3.RELEASE",
11-Dec-2019 00:26:30                 "springVersion": "5.1.5.RELEASE"
11-Dec-2019 00:26:30             }
11-Dec-2019 00:26:30         ]
11-Dec-2019 00:26:30     },
11-Dec-2019 00:26:30     "securityInfo": {
11-Dec-2019 00:26:30         "authenticated": false,
11-Dec-2019 00:26:30         "authenticationEnabled": false,
11-Dec-2019 00:26:30         "roles": [],
11-Dec-2019 00:26:30         "username": null
11-Dec-2019 00:26:30     },
11-Dec-2019 00:26:30     "versionInfo": {
11-Dec-2019 00:26:30         "core": {
11-Dec-2019 00:26:30             "name": "Spring Cloud Data Flow Core",
11-Dec-2019 00:26:30             "version": "2.0.4.BUILD-SNAPSHOT"
11-Dec-2019 00:26:30         },
11-Dec-2019 00:26:30         "dashboard": {
11-Dec-2019 00:26:30             "name": "Spring Cloud Dataflow UI",
11-Dec-2019 00:26:30             "version": "2.0.3.RELEASE"
11-Dec-2019 00:26:30         },
11-Dec-2019 00:26:30         "implementation": {
11-Dec-2019 00:26:30             "name": "spring-cloud-dataflow-server",
11-Dec-2019 00:26:30             "version": "2.0.4.BUILD-SNAPSHOT"
11-Dec-2019 00:26:30         },
11-Dec-2019 00:26:30         "shell": {
11-Dec-2019 00:26:30             "name": "Spring Cloud Data Flow Shell",
11-Dec-2019 00:26:30             "url": "https://repo.spring.io/libs-snapshot/org/springframework/cloud/spring-cloud-dataflow-shell/2.0.4.BUILD-SNAPSHOT/spring-cloud-dataflow-shell-2.0.4.BUILD-SNAPSHOT.jar",
11-Dec-2019 00:26:30             "version": "2.0.4.BUILD-SNAPSHOT"
11-Dec-2019 00:26:30         }
11-Dec-2019 00:26:30     }
11-Dec-2019 00:26:30 }
11-Dec-2019 00:26:30 SKIPPER SERVER ABOUT:
11-Dec-2019 00:26:30 --2019-12-11 00:26:30--  http://localhost:7577/api/about
11-Dec-2019 00:26:30 Resolving localhost (localhost)... ::1, 127.0.0.1
11-Dec-2019 00:26:30 Connecting to localhost (localhost)|::1|:7577... failed: Connection refused.
11-Dec-2019 00:26:30 Connecting to localhost (localhost)|127.0.0.1|:7577... failed: Connection refused.
11-Dec-2019 00:26:30 No JSON object could be decoded
11-Dec-2019 00:26:30 [INFO] Scanning for projects...
11-Dec-2019 00:26:31 [INFO]                                                                         
11-Dec-2019 00:26:31 [INFO] ------------------------------------------------------------------------
11-Dec-2019 00:26:31 [INFO] Building Data Flow Acceptance Tests 1.1.0.BUILD-SNAPSHOT
11-Dec-2019 00:26:31 [INFO] ------------------------------------------------------------------------
11-Dec-2019 00:26:31 [INFO]
11-Dec-2019 00:26:31 [INFO] --- maven-checkstyle-plugin:2.17:check (checkstyle-validation) @ spring-cloud-dataflow-acceptance-tests ---
11-Dec-2019 00:26:32 [INFO]
11-Dec-2019 00:26:32 [INFO] --- maven-resources-plugin:2.6:resources (default-resources) @ spring-cloud-dataflow-acceptance-tests ---
11-Dec-2019 00:26:32 [INFO] Using 'UTF-8' encoding to copy filtered resources.
11-Dec-2019 00:26:32 [INFO] skip non existing resourceDirectory /opt/bamboo-home/xml-data/build-dir/SCDT-LOCAL20XSKIPPER20X-RABBIT/src/main/resources
11-Dec-2019 00:26:32 [INFO] skip non existing resourceDirectory /opt/bamboo-home/xml-data/build-dir/SCDT-LOCAL20XSKIPPER20X-RABBIT/src/main/resources
11-Dec-2019 00:26:32 [INFO]
11-Dec-2019 00:26:32 [INFO] --- maven-compiler-plugin:3.1:compile (default-compile) @ spring-cloud-dataflow-acceptance-tests ---
11-Dec-2019 00:26:32 [INFO] Changes detected - recompiling the module!
11-Dec-2019 00:26:32 [INFO] Compiling 8 source files to /opt/bamboo-home/xml-data/build-dir/SCDT-LOCAL20XSKIPPER20X-RABBIT/target/classes
11-Dec-2019 00:26:33 [INFO]
11-Dec-2019 00:26:33 [INFO] --- maven-resources-plugin:2.6:testResources (default-testResources) @ spring-cloud-dataflow-acceptance-tests ---
11-Dec-2019 00:26:33 [INFO] Using 'UTF-8' encoding to copy filtered resources.
11-Dec-2019 00:26:33 [INFO] Copying 1 resource
11-Dec-2019 00:26:33 [INFO]
11-Dec-2019 00:26:33 [INFO] --- maven-compiler-plugin:3.1:testCompile (default-testCompile) @ spring-cloud-dataflow-acceptance-tests ---
11-Dec-2019 00:26:33 [INFO] Changes detected - recompiling the module!
11-Dec-2019 00:26:33 [INFO] Compiling 16 source files to /opt/bamboo-home/xml-data/build-dir/SCDT-LOCAL20XSKIPPER20X-RABBIT/target/test-classes
11-Dec-2019 00:26:33 [WARNING] /opt/bamboo-home/xml-data/build-dir/SCDT-LOCAL20XSKIPPER20X-RABBIT/src/test/java/org/springframework/cloud/dataflow/acceptance/test/AbstractTaskTests.java: Some input files use unchecked or unsafe operations.
11-Dec-2019 00:26:33 [WARNING] /opt/bamboo-home/xml-data/build-dir/SCDT-LOCAL20XSKIPPER20X-RABBIT/src/test/java/org/springframework/cloud/dataflow/acceptance/test/AbstractTaskTests.java: Recompile with -Xlint:unchecked for details.
11-Dec-2019 00:26:33 [INFO]
11-Dec-2019 00:26:33 [INFO] --- maven-surefire-plugin:2.18.1:test (default-test) @ spring-cloud-dataflow-acceptance-tests ---
11-Dec-2019 00:26:33 [INFO] Surefire report directory: /opt/bamboo-home/xml-data/build-dir/SCDT-LOCAL20XSKIPPER20X-RABBIT/target/surefire-reports
11-Dec-2019 00:26:33
11-Dec-2019 00:26:33 -------------------------------------------------------
11-Dec-2019 00:26:33 T E S T S
11-Dec-2019 00:26:33 -------------------------------------------------------
11-Dec-2019 00:26:34 2019-12-11 00:26:34.325  INFO   --- [           main] .b.t.c.SpringBootTestContextBootstrapper : Neither @ContextConfiguration nor @ContextHierarchy found for test class [org.springframework.cloud.dataflow.acceptance.test.AnalyticsTests], using SpringBootContextLoader
11-Dec-2019 00:26:34 2019-12-11 00:26:34.368  INFO   --- [           main] .b.t.c.SpringBootTestContextBootstrapper : Loaded default TestExecutionListener class names from location [META-INF/spring.factories]: [org.springframework.boot.test.mock.mockito.MockitoTestExecutionListener, org.springframework.boot.test.mock.mockito.ResetMocksTestExecutionListener, org.springframework.boot.test.autoconfigure.restdocs.RestDocsTestExecutionListener, org.springframework.boot.test.autoconfigure.web.client.MockRestServiceServerResetTestExecutionListener, org.springframework.boot.test.autoconfigure.web.servlet.MockMvcPrintOnlyOnFailureTestExecutionListener, org.springframework.boot.test.autoconfigure.web.servlet.WebDriverTestExecutionListener, org.springframework.test.context.web.ServletTestExecutionListener, org.springframework.test.context.support.DirtiesContextBeforeModesTestExecutionListener, org.springframework.test.context.support.DependencyInjectionTestExecutionListener, org.springframework.test.context.support.DirtiesContextTestExecutionListener, org.springframework.test.context.transaction.TransactionalTestExecutionListener, org.springframework.test.context.jdbc.SqlScriptsTestExecutionListener]
11-Dec-2019 00:26:34 2019-12-11 00:26:34.384  INFO   --- [           main] .b.t.c.SpringBootTestContextBootstrapper : Using TestExecutionListeners: [org.springframework.test.context.web.ServletTestExecutionListener@4b5d6a01, org.springframework.test.context.support.DirtiesContextBeforeModesTestExecutionListener@4a22f9e2, org.springframework.boot.test.autoconfigure.SpringBootDependencyInjectionTestExecutionListener@3c419631, org.springframework.test.context.support.DirtiesContextTestExecutionListener@418e7838, org.springframework.test.context.transaction.TransactionalTestExecutionListener@61230f6a, org.springframework.test.context.jdbc.SqlScriptsTestExecutionListener@3c130745, org.springframework.boot.test.mock.mockito.MockitoTestExecutionListener@cd3fee8, org.springframework.boot.test.autoconfigure.web.servlet.MockMvcPrintOnlyOnFailureTestExecutionListener@3e2e18f2, org.springframework.boot.test.autoconfigure.web.client.MockRestServiceServerResetTestExecutionListener@470f1802, org.springframework.boot.test.mock.mockito.ResetMocksTestExecutionListener@63021689, org.springframework.boot.test.autoconfigure.web.servlet.WebDriverTestExecutionListener@703580bf, org.springframework.boot.test.autoconfigure.restdocs.RestDocsTestExecutionListener@3e92efc3]
11-Dec-2019 00:26:34 2019-12-11 00:26:34.386  INFO   --- [           main] .b.t.c.SpringBootTestContextBootstrapper : Neither @ContextConfiguration nor @ContextHierarchy found for test class [org.springframework.cloud.dataflow.acceptance.test.WoodChuckTests], using SpringBootContextLoader
11-Dec-2019 00:26:34 2019-12-11 00:26:34.397  INFO   --- [           main] .b.t.c.SpringBootTestContextBootstrapper : Loaded default TestExecutionListener class names from location [META-INF/spring.factories]: [org.springframework.boot.test.mock.mockito.MockitoTestExecutionListener, org.springframework.boot.test.mock.mockito.ResetMocksTestExecutionListener, org.springframework.boot.test.autoconfigure.restdocs.RestDocsTestExecutionListener, org.springframework.boot.test.autoconfigure.web.client.MockRestServiceServerResetTestExecutionListener, org.springframework.boot.test.autoconfigure.web.servlet.MockMvcPrintOnlyOnFailureTestExecutionListener, org.springframework.boot.test.autoconfigure.web.servlet.WebDriverTestExecutionListener, org.springframework.test.context.web.ServletTestExecutionListener, org.springframework.test.context.support.DirtiesContextBeforeModesTestExecutionListener, org.springframework.test.context.support.DependencyInjectionTestExecutionListener, org.springframework.test.context.support.DirtiesContextTestExecutionListener, org.springframework.test.context.transaction.TransactionalTestExecutionListener, org.springframework.test.context.jdbc.SqlScriptsTestExecutionListener]
11-Dec-2019 00:26:34 2019-12-11 00:26:34.400  INFO   --- [           main] .b.t.c.SpringBootTestContextBootstrapper : Using TestExecutionListeners: [org.springframework.test.context.web.ServletTestExecutionListener@7ec7ffd3, org.springframework.test.context.support.DirtiesContextBeforeModesTestExecutionListener@5b239d7d, org.springframework.boot.test.autoconfigure.SpringBootDependencyInjectionTestExecutionListener@6572421, org.springframework.test.context.support.DirtiesContextTestExecutionListener@6b81ce95, org.springframework.test.context.transaction.TransactionalTestExecutionListener@2a798d51, org.springframework.test.context.jdbc.SqlScriptsTestExecutionListener@6d763516, org.springframework.boot.test.mock.mockito.MockitoTestExecutionListener@52bf72b5, org.springframework.boot.test.autoconfigure.web.servlet.MockMvcPrintOnlyOnFailureTestExecutionListener@37afeb11, org.springframework.boot.test.autoconfigure.web.client.MockRestServiceServerResetTestExecutionListener@515aebb0, org.springframework.boot.test.mock.mockito.ResetMocksTestExecutionListener@dd8ba08, org.springframework.boot.test.autoconfigure.web.servlet.WebDriverTestExecutionListener@245b4bdc, org.springframework.boot.test.autoconfigure.restdocs.RestDocsTestExecutionListener@6c64cb25]
11-Dec-2019 00:26:34 2019-12-11 00:26:34.401  INFO   --- [           main] .b.t.c.SpringBootTestContextBootstrapper : Neither @ContextConfiguration nor @ContextHierarchy found for test class [org.springframework.cloud.dataflow.acceptance.test.HttpSourceTests], using SpringBootContextLoader
11-Dec-2019 00:26:34 2019-12-11 00:26:34.410  INFO   --- [           main] .b.t.c.SpringBootTestContextBootstrapper : Loaded default TestExecutionListener class names from location [META-INF/spring.factories]: [org.springframework.boot.test.mock.mockito.MockitoTestExecutionListener, org.springframework.boot.test.mock.mockito.ResetMocksTestExecutionListener, org.springframework.boot.test.autoconfigure.restdocs.RestDocsTestExecutionListener, org.springframework.boot.test.autoconfigure.web.client.MockRestServiceServerResetTestExecutionListener, org.springframework.boot.test.autoconfigure.web.servlet.MockMvcPrintOnlyOnFailureTestExecutionListener, org.springframework.boot.test.autoconfigure.web.servlet.WebDriverTestExecutionListener, org.springframework.test.context.web.ServletTestExecutionListener, org.springframework.test.context.support.DirtiesContextBeforeModesTestExecutionListener, org.springframework.test.context.support.DependencyInjectionTestExecutionListener, org.springframework.test.context.support.DirtiesContextTestExecutionListener, org.springframework.test.context.transaction.TransactionalTestExecutionListener, org.springframework.test.context.jdbc.SqlScriptsTestExecutionListener]
11-Dec-2019 00:26:34 2019-12-11 00:26:34.413  INFO   --- [           main] .b.t.c.SpringBootTestContextBootstrapper : Using TestExecutionListeners: [org.springframework.test.context.web.ServletTestExecutionListener@40a4337a, org.springframework.test.context.support.DirtiesContextBeforeModesTestExecutionListener@6025e1b6, org.springframework.boot.test.autoconfigure.SpringBootDependencyInjectionTestExecutionListener@22ff4249, org.springframework.test.context.support.DirtiesContextTestExecutionListener@2d1ef81a, org.springframework.test.context.transaction.TransactionalTestExecutionListener@4c402120, org.springframework.test.context.jdbc.SqlScriptsTestExecutionListener@327514f, org.springframework.boot.test.mock.mockito.MockitoTestExecutionListener@5b12b668, org.springframework.boot.test.autoconfigure.web.servlet.MockMvcPrintOnlyOnFailureTestExecutionListener@1165b38, org.springframework.boot.test.autoconfigure.web.client.MockRestServiceServerResetTestExecutionListener@4c12331b, org.springframework.boot.test.mock.mockito.ResetMocksTestExecutionListener@7586beff, org.springframework.boot.test.autoconfigure.web.servlet.WebDriverTestExecutionListener@3b69e7d1, org.springframework.boot.test.autoconfigure.restdocs.RestDocsTestExecutionListener@815b41f]
11-Dec-2019 00:26:34 2019-12-11 00:26:34.429  INFO   --- [           main] .b.t.c.SpringBootTestContextBootstrapper : Neither @ContextConfiguration nor @ContextHierarchy found for test class [org.springframework.cloud.dataflow.acceptance.test.TickTockTests], using SpringBootContextLoader
11-Dec-2019 00:26:34 2019-12-11 00:26:34.437  INFO   --- [           main] .b.t.c.SpringBootTestContextBootstrapper : Loaded default TestExecutionListener class names from location [META-INF/spring.factories]: [org.springframework.boot.test.mock.mockito.MockitoTestExecutionListener, org.springframework.boot.test.mock.mockito.ResetMocksTestExecutionListener, org.springframework.boot.test.autoconfigure.restdocs.RestDocsTestExecutionListener, org.springframework.boot.test.autoconfigure.web.client.MockRestServiceServerResetTestExecutionListener, org.springframework.boot.test.autoconfigure.web.servlet.MockMvcPrintOnlyOnFailureTestExecutionListener, org.springframework.boot.test.autoconfigure.web.servlet.WebDriverTestExecutionListener, org.springframework.test.context.web.ServletTestExecutionListener, org.springframework.test.context.support.DirtiesContextBeforeModesTestExecutionListener, org.springframework.test.context.support.DependencyInjectionTestExecutionListener, org.springframework.test.context.support.DirtiesContextTestExecutionListener, org.springframework.test.context.transaction.TransactionalTestExecutionListener, org.springframework.test.context.jdbc.SqlScriptsTestExecutionListener]
11-Dec-2019 00:26:34 2019-12-11 00:26:34.440  INFO   --- [           main] .b.t.c.SpringBootTestContextBootstrapper : Using TestExecutionListeners: [org.springframework.test.context.web.ServletTestExecutionListener@55b53d44, org.springframework.test.context.support.DirtiesContextBeforeModesTestExecutionListener@482bce4f, org.springframework.boot.test.autoconfigure.SpringBootDependencyInjectionTestExecutionListener@366647c2, org.springframework.test.context.support.DirtiesContextTestExecutionListener@6a6afff2, org.springframework.test.context.transaction.TransactionalTestExecutionListener@1649b0e6, org.springframework.test.context.jdbc.SqlScriptsTestExecutionListener@865dd6, org.springframework.boot.test.mock.mockito.MockitoTestExecutionListener@4da4253, org.springframework.boot.test.autoconfigure.web.servlet.MockMvcPrintOnlyOnFailureTestExecutionListener@3972a855, org.springframework.boot.test.autoconfigure.web.client.MockRestServiceServerResetTestExecutionListener@62e7f11d, org.springframework.boot.test.mock.mockito.ResetMocksTestExecutionListener@503d687a, org.springframework.boot.test.autoconfigure.web.servlet.WebDriverTestExecutionListener@6a370f4, org.springframework.boot.test.autoconfigure.restdocs.RestDocsTestExecutionListener@2abf4075]
11-Dec-2019 00:26:34 2019-12-11 00:26:34.447  INFO   --- [           main] .b.t.c.SpringBootTestContextBootstrapper : Neither @ContextConfiguration nor @ContextHierarchy found for test class [org.springframework.cloud.dataflow.acceptance.test.TransformTests], using SpringBootContextLoader
11-Dec-2019 00:26:34 2019-12-11 00:26:34.455  INFO   --- [           main] .b.t.c.SpringBootTestContextBootstrapper : Loaded default TestExecutionListener class names from location [META-INF/spring.factories]: [org.springframework.boot.test.mock.mockito.MockitoTestExecutionListener, org.springframework.boot.test.mock.mockito.ResetMocksTestExecutionListener, org.springframework.boot.test.autoconfigure.restdocs.RestDocsTestExecutionListener, org.springframework.boot.test.autoconfigure.web.client.MockRestServiceServerResetTestExecutionListener, org.springframework.boot.test.autoconfigure.web.servlet.MockMvcPrintOnlyOnFailureTestExecutionListener, org.springframework.boot.test.autoconfigure.web.servlet.WebDriverTestExecutionListener, org.springframework.test.context.web.ServletTestExecutionListener, org.springframework.test.context.support.DirtiesContextBeforeModesTestExecutionListener, org.springframework.test.context.support.DependencyInjectionTestExecutionListener, org.springframework.test.context.support.DirtiesContextTestExecutionListener, org.springframework.test.context.transaction.TransactionalTestExecutionListener, org.springframework.test.context.jdbc.SqlScriptsTestExecutionListener]
11-Dec-2019 00:26:34 2019-12-11 00:26:34.458  INFO   --- [           main] .b.t.c.SpringBootTestContextBootstrapper : Using TestExecutionListeners: [org.springframework.test.context.web.ServletTestExecutionListener@51e69659, org.springframework.test.context.support.DirtiesContextBeforeModesTestExecutionListener@47e2e487, org.springframework.boot.test.autoconfigure.SpringBootDependencyInjectionTestExecutionListener@201a4587, org.springframework.test.context.support.DirtiesContextTestExecutionListener@61001b64, org.springframework.test.context.transaction.TransactionalTestExecutionListener@4310d43, org.springframework.test.context.jdbc.SqlScriptsTestExecutionListener@54a7079e, org.springframework.boot.test.mock.mockito.MockitoTestExecutionListener@26e356f0, org.springframework.boot.test.autoconfigure.web.servlet.MockMvcPrintOnlyOnFailureTestExecutionListener@47d9a273, org.springframework.boot.test.autoconfigure.web.client.MockRestServiceServerResetTestExecutionListener@4b8ee4de, org.springframework.boot.test.mock.mockito.ResetMocksTestExecutionListener@27f981c6, org.springframework.boot.test.autoconfigure.web.servlet.WebDriverTestExecutionListener@1b11171f, org.springframework.boot.test.autoconfigure.restdocs.RestDocsTestExecutionListener@1151e434]
11-Dec-2019 00:26:34 2019-12-11 00:26:34.469  INFO   --- [           main] .b.t.c.SpringBootTestContextBootstrapper : Neither @ContextConfiguration nor @ContextHierarchy found for test class [org.springframework.cloud.dataflow.acceptance.test.NamedChannelTests], using SpringBootContextLoader
11-Dec-2019 00:26:34 2019-12-11 00:26:34.476  INFO   --- [           main] .b.t.c.SpringBootTestContextBootstrapper : Loaded default TestExecutionListener class names from location [META-INF/spring.factories]: [org.springframework.boot.test.mock.mockito.MockitoTestExecutionListener, org.springframework.boot.test.mock.mockito.ResetMocksTestExecutionListener, org.springframework.boot.test.autoconfigure.restdocs.RestDocsTestExecutionListener, org.springframework.boot.test.autoconfigure.web.client.MockRestServiceServerResetTestExecutionListener, org.springframework.boot.test.autoconfigure.web.servlet.MockMvcPrintOnlyOnFailureTestExecutionListener, org.springframework.boot.test.autoconfigure.web.servlet.WebDriverTestExecutionListener, org.springframework.test.context.web.ServletTestExecutionListener, org.springframework.test.context.support.DirtiesContextBeforeModesTestExecutionListener, org.springframework.test.context.support.DependencyInjectionTestExecutionListener, org.springframework.test.context.support.DirtiesContextTestExecutionListener, org.springframework.test.context.transaction.TransactionalTestExecutionListener, org.springframework.test.context.jdbc.SqlScriptsTestExecutionListener]
11-Dec-2019 00:26:34 2019-12-11 00:26:34.479  INFO   --- [           main] .b.t.c.SpringBootTestContextBootstrapper : Using TestExecutionListeners: [org.springframework.test.context.web.ServletTestExecutionListener@70cf32e3, org.springframework.test.context.support.DirtiesContextBeforeModesTestExecutionListener@5a59ca5e, org.springframework.boot.test.autoconfigure.SpringBootDependencyInjectionTestExecutionListener@4bdeaabb, org.springframework.test.context.support.DirtiesContextTestExecutionListener@6c4906d3, org.springframework.test.context.transaction.TransactionalTestExecutionListener@65987993, org.springframework.test.context.jdbc.SqlScriptsTestExecutionListener@71075444, org.springframework.boot.test.mock.mockito.MockitoTestExecutionListener@4f32a3ad, org.springframework.boot.test.autoconfigure.web.servlet.MockMvcPrintOnlyOnFailureTestExecutionListener@6b695b06, org.springframework.boot.test.autoconfigure.web.client.MockRestServiceServerResetTestExecutionListener@4d1bf319, org.springframework.boot.test.mock.mockito.ResetMocksTestExecutionListener@6f53b8a, org.springframework.boot.test.autoconfigure.web.servlet.WebDriverTestExecutionListener@5c80cf32, org.springframework.boot.test.autoconfigure.restdocs.RestDocsTestExecutionListener@7d900ecf]
11-Dec-2019 00:26:34 Running org.springframework.cloud.dataflow.acceptance.test.AnalyticsTests
11-Dec-2019 00:26:34 2019-12-11 00:26:34.500  INFO   --- [           main] .b.t.c.SpringBootTestContextBootstrapper : Neither @ContextConfiguration nor @ContextHierarchy found for test class [org.springframework.cloud.dataflow.acceptance.test.AnalyticsTests], using SpringBootContextLoader
11-Dec-2019 00:26:34 2019-12-11 00:26:34.516  INFO   --- [           main] .b.t.c.SpringBootTestContextBootstrapper : Loaded default TestExecutionListener class names from location [META-INF/spring.factories]: [org.springframework.boot.test.mock.mockito.MockitoTestExecutionListener, org.springframework.boot.test.mock.mockito.ResetMocksTestExecutionListener, org.springframework.boot.test.autoconfigure.restdocs.RestDocsTestExecutionListener, org.springframework.boot.test.autoconfigure.web.client.MockRestServiceServerResetTestExecutionListener, org.springframework.boot.test.autoconfigure.web.servlet.MockMvcPrintOnlyOnFailureTestExecutionListener, org.springframework.boot.test.autoconfigure.web.servlet.WebDriverTestExecutionListener, org.springframework.test.context.web.ServletTestExecutionListener, org.springframework.test.context.support.DirtiesContextBeforeModesTestExecutionListener, org.springframework.test.context.support.DependencyInjectionTestExecutionListener, org.springframework.test.context.support.DirtiesContextTestExecutionListener, org.springframework.test.context.transaction.TransactionalTestExecutionListener, org.springframework.test.context.jdbc.SqlScriptsTestExecutionListener]
11-Dec-2019 00:26:34 2019-12-11 00:26:34.519  INFO   --- [           main] .b.t.c.SpringBootTestContextBootstrapper : Using TestExecutionListeners: [org.springframework.test.context.web.ServletTestExecutionListener@77659b30, org.springframework.test.context.support.DirtiesContextBeforeModesTestExecutionListener@456d6c1e, org.springframework.boot.test.autoconfigure.SpringBootDependencyInjectionTestExecutionListener@1e13529a, org.springframework.test.context.support.DirtiesContextTestExecutionListener@1ec9bd38, org.springframework.test.context.transaction.TransactionalTestExecutionListener@452e19ca, org.springframework.test.context.jdbc.SqlScriptsTestExecutionListener@6b0d80ed, org.springframework.boot.test.mock.mockito.MockitoTestExecutionListener@6f8e8894, org.springframework.boot.test.autoconfigure.web.servlet.MockMvcPrintOnlyOnFailureTestExecutionListener@3cfdd820, org.springframework.boot.test.autoconfigure.web.client.MockRestServiceServerResetTestExecutionListener@928763c, org.springframework.boot.test.mock.mockito.ResetMocksTestExecutionListener@e25951c, org.springframework.boot.test.autoconfigure.web.servlet.WebDriverTestExecutionListener@15f47664, org.springframework.boot.test.autoconfigure.restdocs.RestDocsTestExecutionListener@471a9022]
11-Dec-2019 00:26:35 2019-12-11 00:26:35.073  INFO 15206 --- [           main] s.c.a.AnnotationConfigApplicationContext : Refreshing org.springframework.context.annotation.AnnotationConfigApplicationContext@2fa7ae9: startup date [Wed Dec 11 00:26:35 UTC 2019]; root of context hierarchy
11-Dec-2019 00:26:35 2019-12-11 00:26:35.295  INFO 15206 --- [           main] trationDelegate$BeanPostProcessorChecker : Bean 'configurationPropertiesRebinderAutoConfiguration' of type [class org.springframework.cloud.autoconfigure.ConfigurationPropertiesRebinderAutoConfiguration$$EnhancerBySpringCGLIB$$219d8b3d] is not eligible for getting processed by all BeanPostProcessors (for example: not eligible for auto-proxying)
11-Dec-2019 00:26:35
11-Dec-2019 00:26:35   .   ____          _            __ _ _
11-Dec-2019 00:26:35 /\\ / ___'_ __ _ _(_)_ __  __ _ \ \ \ \
11-Dec-2019 00:26:35 ( ( )\___ | '_ | '_| | '_ \/ _` | \ \ \ \
11-Dec-2019 00:26:35 \\/  ___)| |_)| | | | | || (_| |  ) ) ) )
11-Dec-2019 00:26:35   '  |____| .__|_| |_|_| |_\__, | / / / /
11-Dec-2019 00:26:35 =========|_|==============|___/=/_/_/_/
11-Dec-2019 00:26:35 :: Spring Boot ::        (v1.4.1.RELEASE)
11-Dec-2019 00:26:35
11-Dec-2019 00:26:35 2019-12-11 00:26:35.592  INFO 15206 --- [           main] c.c.c.ConfigServicePropertySourceLocator : Fetching config from server at: http://localhost:8888
11-Dec-2019 00:26:35 2019-12-11 00:26:35.671  WARN 15206 --- [           main] c.c.c.ConfigServicePropertySourceLocator : Could not locate PropertySource: I/O error on GET request for "http://localhost:8888//blah": Connection refused (Connection refused); nested exception is java.net.ConnectException: Connection refused (Connection refused)
11-Dec-2019 00:26:35 2019-12-11 00:26:35.678  INFO 15206 --- [           main] o.s.c.d.acceptance.test.AnalyticsTests   : The following profiles are active: blah
11-Dec-2019 00:26:35 2019-12-11 00:26:35.878  INFO 15206 --- [           main] o.s.c.d.acceptance.test.AnalyticsTests   : Started AnalyticsTests in 1.3 seconds (JVM running for 1.965)
11-Dec-2019 00:26:36 2019-12-11 00:26:36.087  INFO 15206 --- [           main] junit.logTestName                        : Starting Test analyticsTest(org.springframework.cloud.dataflow.acceptance.test.AnalyticsTests)
11-Dec-2019 00:26:36 2019-12-11 00:26:36.092  INFO 15206 --- [           main] o.s.c.d.acceptance.test.AnalyticsTests   : Importing stream apps from uri resource: https://dataflow.spring.io/rabbitmq-maven-latest
11-Dec-2019 00:26:38 2019-12-11 00:26:38.283  INFO 15206 --- [           main] junit.logTestName                        : Finished Test analyticsTest(org.springframework.cloud.dataflow.acceptance.test.AnalyticsTests)
11-Dec-2019 00:26:38 2019-12-11 00:26:38.283  INFO 15206 --- [           main] o.s.c.d.acceptance.test.AnalyticsTests   : Destroy all streams
11-Dec-2019 00:26:38 Tests run: 1, Failures: 0, Errors: 0, Skipped: 1, Time elapsed: 3.8 sec - in org.springframework.cloud.dataflow.acceptance.test.AnalyticsTests
11-Dec-2019 00:26:38 Running org.springframework.cloud.dataflow.acceptance.test.WoodChuckTests
11-Dec-2019 00:26:38 2019-12-11 00:26:38.300  INFO 15206 --- [           main] .b.t.c.SpringBootTestContextBootstrapper : Neither @ContextConfiguration nor @ContextHierarchy found for test class [org.springframework.cloud.dataflow.acceptance.test.WoodChuckTests], using SpringBootContextLoader
11-Dec-2019 00:26:38 2019-12-11 00:26:38.307  INFO 15206 --- [           main] .b.t.c.SpringBootTestContextBootstrapper : Loaded default TestExecutionListener class names from location [META-INF/spring.factories]: [org.springframework.boot.test.mock.mockito.MockitoTestExecutionListener, org.springframework.boot.test.mock.mockito.ResetMocksTestExecutionListener, org.springframework.boot.test.autoconfigure.restdocs.RestDocsTestExecutionListener, org.springframework.boot.test.autoconfigure.web.client.MockRestServiceServerResetTestExecutionListener, org.springframework.boot.test.autoconfigure.web.servlet.MockMvcPrintOnlyOnFailureTestExecutionListener, org.springframework.boot.test.autoconfigure.web.servlet.WebDriverTestExecutionListener, org.springframework.test.context.web.ServletTestExecutionListener, org.springframework.test.context.support.DirtiesContextBeforeModesTestExecutionListener, org.springframework.test.context.support.DependencyInjectionTestExecutionListener, org.springframework.test.context.support.DirtiesContextTestExecutionListener, org.springframework.test.context.transaction.TransactionalTestExecutionListener, org.springframework.test.context.jdbc.SqlScriptsTestExecutionListener]
11-Dec-2019 00:26:38 2019-12-11 00:26:38.309  INFO 15206 --- [           main] .b.t.c.SpringBootTestContextBootstrapper : Using TestExecutionListeners: [org.springframework.test.context.web.ServletTestExecutionListener@3968bc60, org.springframework.test.context.support.DirtiesContextBeforeModesTestExecutionListener@26f46fa6, org.springframework.boot.test.autoconfigure.SpringBootDependencyInjectionTestExecutionListener@227a47, org.springframework.test.context.support.DirtiesContextTestExecutionListener@9596ce8, org.springframework.test.context.transaction.TransactionalTestExecutionListener@75ae4a1f, org.springframework.test.context.jdbc.SqlScriptsTestExecutionListener@70228253, org.springframework.boot.test.mock.mockito.MockitoTestExecutionListener@63c12e52, org.springframework.boot.test.autoconfigure.web.servlet.MockMvcPrintOnlyOnFailureTestExecutionListener@21bd20ee, org.springframework.boot.test.autoconfigure.web.client.MockRestServiceServerResetTestExecutionListener@26c47874, org.springframework.boot.test.mock.mockito.ResetMocksTestExecutionListener@421056e5, org.springframework.boot.test.autoconfigure.web.servlet.WebDriverTestExecutionListener@2849434b, org.springframework.boot.test.autoconfigure.restdocs.RestDocsTestExecutionListener@60bbacfc]
11-Dec-2019 00:26:38 2019-12-11 00:26:38.369  INFO 15206 --- [           main] junit.logTestName                        : Starting Test testPartitioning(org.springframework.cloud.dataflow.acceptance.test.WoodChuckTests)
11-Dec-2019 00:26:38 2019-12-11 00:26:38.381  INFO 15206 --- [           main] o.s.c.d.acceptance.test.WoodChuckTests   : Creating stream 'WOODCHUCK-TEST'
11-Dec-2019 00:26:38 2019-12-11 00:26:38.471 ERROR 15206 --- [           main] junit.logTestName                        : !!! Test testPartitioning(org.springframework.cloud.dataflow.acceptance.test.WoodChuckTests) Failed !!!
11-Dec-2019 00:26:38
11-Dec-2019 00:26:38 org.springframework.cloud.dataflow.rest.client.DataFlowClientException: I/O error on GET request for "http://localhost:7577/api/release/status/WOODCHUCK-TEST": Connect to localhost:7577 [localhost/127.0.0.1, localhost/0:0:0:0:0:0:0:1] failed: Connection refused (Connection refused); nested exception is org.apache.http.conn.HttpHostConnectException: Connect to localhost:7577 [localhost/127.0.0.1, localhost/0:0:0:0:0:0:0:1] failed: Connection refused (Connection refused)
11-Dec-2019 00:26:38
11-Dec-2019 00:26:38         at org.springframework.cloud.dataflow.rest.client.VndErrorResponseErrorHandler.handleError(VndErrorResponseErrorHandler.java:63)
11-Dec-2019 00:26:38         at org.springframework.web.client.RestTemplate.handleResponse(RestTemplate.java:667)
11-Dec-2019 00:26:38         at org.springframework.web.client.RestTemplate.doExecute(RestTemplate.java:620)
11-Dec-2019 00:26:38         at org.springframework.web.client.RestTemplate.execute(RestTemplate.java:580)
11-Dec-2019 00:26:38         at org.springframework.web.client.RestTemplate.postForObject(RestTemplate.java:380)
11-Dec-2019 00:26:38         at org.springframework.cloud.dataflow.rest.client.StreamTemplate.createStream(StreamTemplate.java:120)
11-Dec-2019 00:26:38         at org.springframework.cloud.dataflow.acceptance.test.AbstractStreamTests.deployStream(AbstractStreamTests.java:169)
11-Dec-2019 00:26:38         at org.springframework.cloud.dataflow.acceptance.test.WoodChuckTests.testPartitioning(WoodChuckTests.java:43)
11-Dec-2019 00:26:38         at sun.reflect.NativeMethodAccessorImpl.invoke0(Native Method)
11-Dec-2019 00:26:38         at sun.reflect.NativeMethodAccessorImpl.invoke(NativeMethodAccessorImpl.java:62)
11-Dec-2019 00:26:38         at sun.reflect.DelegatingMethodAccessorImpl.invoke(DelegatingMethodAccessorImpl.java:43)
11-Dec-2019 00:26:38         at java.lang.reflect.Method.invoke(Method.java:498)
11-Dec-2019 00:26:38         at org.junit.runners.model.FrameworkMethod$1.runReflectiveCall(FrameworkMethod.java:50)
11-Dec-2019 00:26:38         at org.junit.internal.runners.model.ReflectiveCallable.run(ReflectiveCallable.java:12)
11-Dec-2019 00:26:38         at org.junit.runners.model.FrameworkMethod.invokeExplosively(FrameworkMethod.java:47)
11-Dec-2019 00:26:38         at org.junit.internal.runners.statements.InvokeMethod.evaluate(InvokeMethod.java:17)
11-Dec-2019 00:26:38         at org.junit.internal.runners.statements.RunBefores.evaluate(RunBefores.java:26)
11-Dec-2019 00:26:38         at org.springframework.test.context.junit4.statements.RunBeforeTestMethodCallbacks.evaluate(RunBeforeTestMethodCallbacks.java:75)
11-Dec-2019 00:26:38         at org.springframework.test.context.junit4.statements.RunAfterTestMethodCallbacks.evaluate(RunAfterTestMethodCallbacks.java:86)
11-Dec-2019 00:26:38         at org.junit.rules.TestWatcher$1.evaluate(TestWatcher.java:55)
11-Dec-2019 00:26:38         at org.junit.rules.ExternalResource$1.evaluate(ExternalResource.java:48)
11-Dec-2019 00:26:38         at org.junit.rules.RunRules.evaluate(RunRules.java:20)
11-Dec-2019 00:26:38         at org.springframework.test.context.junit4.statements.SpringRepeat.evaluate(SpringRepeat.java:84)
11-Dec-2019 00:26:38         at org.junit.runners.ParentRunner.runLeaf(ParentRunner.java:325)
11-Dec-2019 00:26:38         at org.springframework.test.context.junit4.SpringJUnit4ClassRunner.runChild(SpringJUnit4ClassRunner.java:252)
11-Dec-2019 00:26:38         at org.springframework.test.context.junit4.SpringJUnit4ClassRunner.runChild(SpringJUnit4ClassRunner.java:94)
11-Dec-2019 00:26:38         at org.junit.runners.ParentRunner$3.run(ParentRunner.java:290)
11-Dec-2019 00:26:38         at org.junit.runners.ParentRunner$1.schedule(ParentRunner.java:71)
11-Dec-2019 00:26:38         at org.junit.runners.ParentRunner.runChildren(ParentRunner.java:288)
11-Dec-2019 00:26:38         at org.junit.runners.ParentRunner.access$000(ParentRunner.java:58)
11-Dec-2019 00:26:38         at org.junit.runners.ParentRunner$2.evaluate(ParentRunner.java:268)
11-Dec-2019 00:26:38         at org.springframework.test.context.junit4.statements.RunBeforeTestClassCallbacks.evaluate(RunBeforeTestClassCallbacks.java:61)
11-Dec-2019 00:26:38         at org.springframework.test.context.junit4.statements.RunAfterTestClassCallbacks.evaluate(RunAfterTestClassCallbacks.java:70)
11-Dec-2019 00:26:38         at org.junit.runners.ParentRunner.run(ParentRunner.java:363)
11-Dec-2019 00:26:38         at org.springframework.test.context.junit4.SpringJUnit4ClassRunner.run(SpringJUnit4ClassRunner.java:191)
11-Dec-2019 00:26:38         at org.apache.maven.surefire.junit4.JUnit4Provider.execute(JUnit4Provider.java:283)
11-Dec-2019 00:26:38         at org.apache.maven.surefire.junit4.JUnit4Provider.executeWithRerun(JUnit4Provider.java:173)
11-Dec-2019 00:26:38         at org.apache.maven.surefire.junit4.JUnit4Provider.executeTestSet(JUnit4Provider.java:153)
11-Dec-2019 00:26:38         at org.apache.maven.surefire.junit4.JUnit4Provider.invoke(JUnit4Provider.java:128)
11-Dec-2019 00:26:38         at org.apache.maven.surefire.booter.ForkedBooter.invokeProviderInSameClassLoader(ForkedBooter.java:203)
11-Dec-2019 00:26:38         at org.apache.maven.surefire.booter.ForkedBooter.runSuitesInProcess(ForkedBooter.java:155)
11-Dec-2019 00:26:38         at org.apache.maven.surefire.booter.ForkedBooter.main(ForkedBooter.java:103)
11-Dec-2019 00:26:38
11-Dec-2019 00:26:38 2019-12-11 00:26:38.471  INFO 15206 --- [           main] junit.logTestName                        : Finished Test testPartitioning(org.springframework.cloud.dataflow.acceptance.test.WoodChuckTests)
11-Dec-2019 00:26:38 2019-12-11 00:26:38.472  INFO 15206 --- [           main] o.s.c.d.acceptance.test.WoodChuckTests   : Destroy all streams
11-Dec-2019 00:26:38 Tests run: 1, Failures: 0, Errors: 1, Skipped: 0, Time elapsed: 0.109 sec <<< FAILURE! - in org.springframework.cloud.dataflow.acceptance.test.WoodChuckTests
11-Dec-2019 00:26:38 testPartitioning(org.springframework.cloud.dataflow.acceptance.test.WoodChuckTests)  Time elapsed: 0.109 sec  <<< ERROR!
11-Dec-2019 00:26:38 org.springframework.cloud.dataflow.rest.client.DataFlowClientException: I/O error on GET request for "http://localhost:7577/api": Connect to localhost:7577 [localhost/127.0.0.1, localhost/0:0:0:0:0:0:0:1] failed: Connection refused (Connection refused); nested exception is org.apache.http.conn.HttpHostConnectException: Connect to localhost:7577 [localhost/127.0.0.1, localhost/0:0:0:0:0:0:0:1] failed: Connection refused (Connection refused)
11-Dec-2019 00:26:38
11-Dec-2019 00:26:38         at org.springframework.cloud.dataflow.rest.client.VndErrorResponseErrorHandler.handleError(VndErrorResponseErrorHandler.java:63)
11-Dec-2019 00:26:38         at org.springframework.web.client.RestTemplate.handleResponse(RestTemplate.java:667)
11-Dec-2019 00:26:38         at org.springframework.web.client.RestTemplate.doExecute(RestTemplate.java:620)
11-Dec-2019 00:26:38         at org.springframework.web.client.RestTemplate.execute(RestTemplate.java:580)
11-Dec-2019 00:26:38         at org.springframework.web.client.RestTemplate.delete(RestTemplate.java:452)
11-Dec-2019 00:26:38         at org.springframework.cloud.dataflow.rest.client.StreamTemplate.destroyAll(StreamTemplate.java:147)
11-Dec-2019 00:26:38         at org.springframework.cloud.dataflow.acceptance.test.AbstractStreamTests$1.after(AbstractStreamTests.java:119)
11-Dec-2019 00:26:38         at org.junit.rules.ExternalResource$1.evaluate(ExternalResource.java:50)
11-Dec-2019 00:26:38         at org.junit.rules.RunRules.evaluate(RunRules.java:20)
11-Dec-2019 00:26:38         at org.springframework.test.context.junit4.statements.SpringRepeat.evaluate(SpringRepeat.java:84)
11-Dec-2019 00:26:38         at org.junit.runners.ParentRunner.runLeaf(ParentRunner.java:325)
11-Dec-2019 00:26:38         at org.springframework.test.context.junit4.SpringJUnit4ClassRunner.runChild(SpringJUnit4ClassRunner.java:252)
11-Dec-2019 00:26:38         at org.springframework.test.context.junit4.SpringJUnit4ClassRunner.runChild(SpringJUnit4ClassRunner.java:94)
11-Dec-2019 00:26:38         at org.junit.runners.ParentRunner$3.run(ParentRunner.java:290)
11-Dec-2019 00:26:38         at org.junit.runners.ParentRunner$1.schedule(ParentRunner.java:71)
11-Dec-2019 00:26:38         at org.junit.runners.ParentRunner.runChildren(ParentRunner.java:288)
11-Dec-2019 00:26:38         at org.junit.runners.ParentRunner.access$000(ParentRunner.java:58)
11-Dec-2019 00:26:38         at org.junit.runners.ParentRunner$2.evaluate(ParentRunner.java:268)
11-Dec-2019 00:26:38         at org.springframework.test.context.junit4.statements.RunBeforeTestClassCallbacks.evaluate(RunBeforeTestClassCallbacks.java:61)
11-Dec-2019 00:26:38         at org.springframework.test.context.junit4.statements.RunAfterTestClassCallbacks.evaluate(RunAfterTestClassCallbacks.java:70)
11-Dec-2019 00:26:38         at org.junit.runners.ParentRunner.run(ParentRunner.java:363)
11-Dec-2019 00:26:38         at org.springframework.test.context.junit4.SpringJUnit4ClassRunner.run(SpringJUnit4ClassRunner.java:191)
11-Dec-2019 00:26:38         at org.apache.maven.surefire.junit4.JUnit4Provider.execute(JUnit4Provider.java:283)
11-Dec-2019 00:26:38         at org.apache.maven.surefire.junit4.JUnit4Provider.executeWithRerun(JUnit4Provider.java:173)
11-Dec-2019 00:26:38         at org.apache.maven.surefire.junit4.JUnit4Provider.executeTestSet(JUnit4Provider.java:153)
11-Dec-2019 00:26:38         at org.apache.maven.surefire.junit4.JUnit4Provider.invoke(JUnit4Provider.java:128)
11-Dec-2019 00:26:38         at org.apache.maven.surefire.booter.ForkedBooter.invokeProviderInSameClassLoader(ForkedBooter.java:203)
11-Dec-2019 00:26:38         at org.apache.maven.surefire.booter.ForkedBooter.runSuitesInProcess(ForkedBooter.java:155)
11-Dec-2019 00:26:38         at org.apache.maven.surefire.booter.ForkedBooter.main(ForkedBooter.java:103)
11-Dec-2019 00:26:38
11-Dec-2019 00:26:38 Running org.springframework.cloud.dataflow.acceptance.test.HttpSourceTests
11-Dec-2019 00:26:38 2019-12-11 00:26:38.490  INFO 15206 --- [           main] .b.t.c.SpringBootTestContextBootstrapper : Neither @ContextConfiguration nor @ContextHierarchy found for test class [org.springframework.cloud.dataflow.acceptance.test.HttpSourceTests], using SpringBootContextLoader
11-Dec-2019 00:26:38 2019-12-11 00:26:38.499  INFO 15206 --- [           main] .b.t.c.SpringBootTestContextBootstrapper : Loaded default TestExecutionListener class names from location [META-INF/spring.factories]: [org.springframework.boot.test.mock.mockito.MockitoTestExecutionListener, org.springframework.boot.test.mock.mockito.ResetMocksTestExecutionListener, org.springframework.boot.test.autoconfigure.restdocs.RestDocsTestExecutionListener, org.springframework.boot.test.autoconfigure.web.client.MockRestServiceServerResetTestExecutionListener, org.springframework.boot.test.autoconfigure.web.servlet.MockMvcPrintOnlyOnFailureTestExecutionListener, org.springframework.boot.test.autoconfigure.web.servlet.WebDriverTestExecutionListener, org.springframework.test.context.web.ServletTestExecutionListener, org.springframework.test.context.support.DirtiesContextBeforeModesTestExecutionListener, org.springframework.test.context.support.DependencyInjectionTestExecutionListener, org.springframework.test.context.support.DirtiesContextTestExecutionListener, org.springframework.test.context.transaction.TransactionalTestExecutionListener, org.springframework.test.context.jdbc.SqlScriptsTestExecutionListener]
11-Dec-2019 00:26:38 2019-12-11 00:26:38.501  INFO 15206 --- [           main] .b.t.c.SpringBootTestContextBootstrapper : Using TestExecutionListeners: [org.springframework.test.context.web.ServletTestExecutionListener@58f39564, org.springframework.test.context.support.DirtiesContextBeforeModesTestExecutionListener@7b948f3e, org.springframework.boot.test.autoconfigure.SpringBootDependencyInjectionTestExecutionListener@2f4c2cd4, org.springframework.test.context.support.DirtiesContextTestExecutionListener@77a074b4, org.springframework.test.context.transaction.TransactionalTestExecutionListener@333c8791, org.springframework.test.context.jdbc.SqlScriptsTestExecutionListener@6c0e13b7, org.springframework.boot.test.mock.mockito.MockitoTestExecutionListener@22eaa86e, org.springframework.boot.test.autoconfigure.web.servlet.MockMvcPrintOnlyOnFailureTestExecutionListener@561b7d53, org.springframework.boot.test.autoconfigure.web.client.MockRestServiceServerResetTestExecutionListener@1cc680e, org.springframework.boot.test.mock.mockito.ResetMocksTestExecutionListener@1dc3502b, org.springframework.boot.test.autoconfigure.web.servlet.WebDriverTestExecutionListener@6a1d3225, org.springframework.boot.test.autoconfigure.restdocs.RestDocsTestExecutionListener@67e13bd0]
11-Dec-2019 00:26:38 2019-12-11 00:26:38.547  INFO 15206 --- [           main] junit.logTestName                        : Starting Test httpSourceTests(org.springframework.cloud.dataflow.acceptance.test.HttpSourceTests)
11-Dec-2019 00:26:38 2019-12-11 00:26:38.549  INFO 15206 --- [           main] o.s.c.d.acceptance.test.HttpSourceTests  : Creating stream 'HTTP-TEST'
11-Dec-2019 00:26:38 2019-12-11 00:26:38.575 ERROR 15206 --- [           main] junit.logTestName                        : !!! Test httpSourceTests(org.springframework.cloud.dataflow.acceptance.test.HttpSourceTests) Failed !!!
11-Dec-2019 00:26:38
11-Dec-2019 00:26:38 org.springframework.cloud.dataflow.rest.client.DataFlowClientException: I/O error on GET request for "http://localhost:7577/api/release/status/HTTP-TEST": Connect to localhost:7577 [localhost/127.0.0.1, localhost/0:0:0:0:0:0:0:1] failed: Connection refused (Connection refused); nested exception is org.apache.http.conn.HttpHostConnectException: Connect to localhost:7577 [localhost/127.0.0.1, localhost/0:0:0:0:0:0:0:1] failed: Connection refused (Connection refused)
11-Dec-2019 00:26:38
11-Dec-2019 00:26:38         at org.springframework.cloud.dataflow.rest.client.VndErrorResponseErrorHandler.handleError(VndErrorResponseErrorHandler.java:63)
11-Dec-2019 00:26:38         at org.springframework.web.client.RestTemplate.handleResponse(RestTemplate.java:667)
11-Dec-2019 00:26:38         at org.springframework.web.client.RestTemplate.doExecute(RestTemplate.java:620)
11-Dec-2019 00:26:38         at org.springframework.web.client.RestTemplate.execute(RestTemplate.java:580)
11-Dec-2019 00:26:38         at org.springframework.web.client.RestTemplate.postForObject(RestTemplate.java:380)
11-Dec-2019 00:26:38         at org.springframework.cloud.dataflow.rest.client.StreamTemplate.createStream(StreamTemplate.java:120)
11-Dec-2019 00:26:38         at org.springframework.cloud.dataflow.acceptance.test.AbstractStreamTests.deployStream(AbstractStreamTests.java:169)
11-Dec-2019 00:26:38         at org.springframework.cloud.dataflow.acceptance.test.HttpSourceTests.httpSourceTests(HttpSourceTests.java:41)
11-Dec-2019 00:26:38         at sun.reflect.NativeMethodAccessorImpl.invoke0(Native Method)
11-Dec-2019 00:26:38         at sun.reflect.NativeMethodAccessorImpl.invoke(NativeMethodAccessorImpl.java:62)
11-Dec-2019 00:26:38         at sun.reflect.DelegatingMethodAccessorImpl.invoke(DelegatingMethodAccessorImpl.java:43)
11-Dec-2019 00:26:38         at java.lang.reflect.Method.invoke(Method.java:498)
11-Dec-2019 00:26:38         at org.junit.runners.model.FrameworkMethod$1.runReflectiveCall(FrameworkMethod.java:50)
11-Dec-2019 00:26:38         at org.junit.internal.runners.model.ReflectiveCallable.run(ReflectiveCallable.java:12)
11-Dec-2019 00:26:38         at org.junit.runners.model.FrameworkMethod.invokeExplosively(FrameworkMethod.java:47)
11-Dec-2019 00:26:38         at org.junit.internal.runners.statements.InvokeMethod.evaluate(InvokeMethod.java:17)
11-Dec-2019 00:26:38         at org.junit.internal.runners.statements.RunBefores.evaluate(RunBefores.java:26)
11-Dec-2019 00:26:38         at org.springframework.test.context.junit4.statements.RunBeforeTestMethodCallbacks.evaluate(RunBeforeTestMethodCallbacks.java:75)
11-Dec-2019 00:26:38         at org.springframework.test.context.junit4.statements.RunAfterTestMethodCallbacks.evaluate(RunAfterTestMethodCallbacks.java:86)
11-Dec-2019 00:26:38         at org.junit.rules.TestWatcher$1.evaluate(TestWatcher.java:55)
11-Dec-2019 00:26:38         at org.junit.rules.ExternalResource$1.evaluate(ExternalResource.java:48)
11-Dec-2019 00:26:38         at org.junit.rules.RunRules.evaluate(RunRules.java:20)
11-Dec-2019 00:26:38         at org.springframework.test.context.junit4.statements.SpringRepeat.evaluate(SpringRepeat.java:84)
11-Dec-2019 00:26:38         at org.junit.runners.ParentRunner.runLeaf(ParentRunner.java:325)
11-Dec-2019 00:26:38         at org.springframework.test.context.junit4.SpringJUnit4ClassRunner.runChild(SpringJUnit4ClassRunner.java:252)
11-Dec-2019 00:26:38         at org.springframework.test.context.junit4.SpringJUnit4ClassRunner.runChild(SpringJUnit4ClassRunner.java:94)
11-Dec-2019 00:26:38         at org.junit.runners.ParentRunner$3.run(ParentRunner.java:290)
11-Dec-2019 00:26:38         at org.junit.runners.ParentRunner$1.schedule(ParentRunner.java:71)
11-Dec-2019 00:26:38         at org.junit.runners.ParentRunner.runChildren(ParentRunner.java:288)
11-Dec-2019 00:26:38         at org.junit.runners.ParentRunner.access$000(ParentRunner.java:58)
11-Dec-2019 00:26:38         at org.junit.runners.ParentRunner$2.evaluate(ParentRunner.java:268)
11-Dec-2019 00:26:38         at org.springframework.test.context.junit4.statements.RunBeforeTestClassCallbacks.evaluate(RunBeforeTestClassCallbacks.java:61)
11-Dec-2019 00:26:38         at org.springframework.test.context.junit4.statements.RunAfterTestClassCallbacks.evaluate(RunAfterTestClassCallbacks.java:70)
11-Dec-2019 00:26:38         at org.junit.runners.ParentRunner.run(ParentRunner.java:363)
11-Dec-2019 00:26:38         at org.springframework.test.context.junit4.SpringJUnit4ClassRunner.run(SpringJUnit4ClassRunner.java:191)
11-Dec-2019 00:26:38         at org.apache.maven.surefire.junit4.JUnit4Provider.execute(JUnit4Provider.java:283)
11-Dec-2019 00:26:38         at org.apache.maven.surefire.junit4.JUnit4Provider.executeWithRerun(JUnit4Provider.java:173)
11-Dec-2019 00:26:38         at org.apache.maven.surefire.junit4.JUnit4Provider.executeTestSet(JUnit4Provider.java:153)
11-Dec-2019 00:26:38         at org.apache.maven.surefire.junit4.JUnit4Provider.invoke(JUnit4Provider.java:128)
11-Dec-2019 00:26:38         at org.apache.maven.surefire.booter.ForkedBooter.invokeProviderInSameClassLoader(ForkedBooter.java:203)
11-Dec-2019 00:26:38         at org.apache.maven.surefire.booter.ForkedBooter.runSuitesInProcess(ForkedBooter.java:155)
11-Dec-2019 00:26:38         at org.apache.maven.surefire.booter.ForkedBooter.main(ForkedBooter.java:103)
11-Dec-2019 00:26:38
11-Dec-2019 00:26:38 2019-12-11 00:26:38.577  INFO 15206 --- [           main] junit.logTestName                        : Finished Test httpSourceTests(org.springframework.cloud.dataflow.acceptance.test.HttpSourceTests)
11-Dec-2019 00:26:38 2019-12-11 00:26:38.577  INFO 15206 --- [           main] o.s.c.d.acceptance.test.HttpSourceTests  : Destroy all streams
11-Dec-2019 00:26:38 Tests run: 1, Failures: 0, Errors: 1, Skipped: 0, Time elapsed: 0.084 sec <<< FAILURE! - in org.springframework.cloud.dataflow.acceptance.test.HttpSourceTests
11-Dec-2019 00:26:38 httpSourceTests(org.springframework.cloud.dataflow.acceptance.test.HttpSourceTests)  Time elapsed: 0.04 sec  <<< ERROR!
11-Dec-2019 00:26:38 org.springframework.cloud.dataflow.rest.client.DataFlowClientException: I/O error on GET request for "http://localhost:7577/api": Connect to localhost:7577 [localhost/127.0.0.1, localhost/0:0:0:0:0:0:0:1] failed: Connection refused (Connection refused); nested exception is org.apache.http.conn.HttpHostConnectException: Connect to localhost:7577 [localhost/127.0.0.1, localhost/0:0:0:0:0:0:0:1] failed: Connection refused (Connection refused)
11-Dec-2019 00:26:38
11-Dec-2019 00:26:38         at org.springframework.cloud.dataflow.rest.client.VndErrorResponseErrorHandler.handleError(VndErrorResponseErrorHandler.java:63)
11-Dec-2019 00:26:38         at org.springframework.web.client.RestTemplate.handleResponse(RestTemplate.java:667)
11-Dec-2019 00:26:38         at org.springframework.web.client.RestTemplate.doExecute(RestTemplate.java:620)
11-Dec-2019 00:26:38         at org.springframework.web.client.RestTemplate.execute(RestTemplate.java:580)
11-Dec-2019 00:26:38         at org.springframework.web.client.RestTemplate.delete(RestTemplate.java:452)
11-Dec-2019 00:26:38         at org.springframework.cloud.dataflow.rest.client.StreamTemplate.destroyAll(StreamTemplate.java:147)
11-Dec-2019 00:26:38         at org.springframework.cloud.dataflow.acceptance.test.AbstractStreamTests$1.after(AbstractStreamTests.java:119)
11-Dec-2019 00:26:38         at org.junit.rules.ExternalResource$1.evaluate(ExternalResource.java:50)
11-Dec-2019 00:26:38         at org.junit.rules.RunRules.evaluate(RunRules.java:20)
11-Dec-2019 00:26:38         at org.springframework.test.context.junit4.statements.SpringRepeat.evaluate(SpringRepeat.java:84)
11-Dec-2019 00:26:38         at org.junit.runners.ParentRunner.runLeaf(ParentRunner.java:325)
11-Dec-2019 00:26:38         at org.springframework.test.context.junit4.SpringJUnit4ClassRunner.runChild(SpringJUnit4ClassRunner.java:252)
11-Dec-2019 00:26:38         at org.springframework.test.context.junit4.SpringJUnit4ClassRunner.runChild(SpringJUnit4ClassRunner.java:94)
11-Dec-2019 00:26:38         at org.junit.runners.ParentRunner$3.run(ParentRunner.java:290)
11-Dec-2019 00:26:38         at org.junit.runners.ParentRunner$1.schedule(ParentRunner.java:71)
11-Dec-2019 00:26:38         at org.junit.runners.ParentRunner.runChildren(ParentRunner.java:288)
11-Dec-2019 00:26:38         at org.junit.runners.ParentRunner.access$000(ParentRunner.java:58)
11-Dec-2019 00:26:38         at org.junit.runners.ParentRunner$2.evaluate(ParentRunner.java:268)
11-Dec-2019 00:26:38         at org.springframework.test.context.junit4.statements.RunBeforeTestClassCallbacks.evaluate(RunBeforeTestClassCallbacks.java:61)
11-Dec-2019 00:26:38         at org.springframework.test.context.junit4.statements.RunAfterTestClassCallbacks.evaluate(RunAfterTestClassCallbacks.java:70)
11-Dec-2019 00:26:38         at org.junit.runners.ParentRunner.run(ParentRunner.java:363)
11-Dec-2019 00:26:38         at org.springframework.test.context.junit4.SpringJUnit4ClassRunner.run(SpringJUnit4ClassRunner.java:191)
11-Dec-2019 00:26:38         at org.apache.maven.surefire.junit4.JUnit4Provider.execute(JUnit4Provider.java:283)
11-Dec-2019 00:26:38         at org.apache.maven.surefire.junit4.JUnit4Provider.executeWithRerun(JUnit4Provider.java:173)
11-Dec-2019 00:26:38         at org.apache.maven.surefire.junit4.JUnit4Provider.executeTestSet(JUnit4Provider.java:153)
11-Dec-2019 00:26:38         at org.apache.maven.surefire.junit4.JUnit4Provider.invoke(JUnit4Provider.java:128)
11-Dec-2019 00:26:38         at org.apache.maven.surefire.booter.ForkedBooter.invokeProviderInSameClassLoader(ForkedBooter.java:203)
11-Dec-2019 00:26:38         at org.apache.maven.surefire.booter.ForkedBooter.runSuitesInProcess(ForkedBooter.java:155)
11-Dec-2019 00:26:38         at org.apache.maven.surefire.booter.ForkedBooter.main(ForkedBooter.java:103)
11-Dec-2019 00:26:38
11-Dec-2019 00:26:38 Running org.springframework.cloud.dataflow.acceptance.test.TimestampTaskTests
11-Dec-2019 00:26:38 2019-12-11 00:26:38.595  INFO 15206 --- [           main] o.s.c.support.GenericApplicationContext  : Refreshing org.springframework.context.support.GenericApplicationContext@1a1f5f71: startup date [Wed Dec 11 00:26:38 UTC 2019]; root of context hierarchy
11-Dec-2019 00:26:38 2019-12-11 00:26:38.661  INFO 15206 --- [           main] junit.logTestName                        : Starting Test timeStampTests(org.springframework.cloud.dataflow.acceptance.test.TimestampTaskTests)
11-Dec-2019 00:26:38 2019-12-11 00:26:38.668  INFO 15206 --- [           main] o.s.c.d.a.test.AbstractTaskTests         : Importing task apps from uri resource: https://dataflow.spring.io/task-maven-latest
11-Dec-2019 00:26:39 2019-12-11 00:26:39.162  INFO 15206 --- [           main] o.s.c.d.a.test.AbstractTaskTests         : Done importing task apps.
11-Dec-2019 00:26:44 2019-12-11 00:26:44.653  INFO 15206 --- [           main] junit.logTestName                        : Test timeStampTests(org.springframework.cloud.dataflow.acceptance.test.TimestampTaskTests) Succeeded
11-Dec-2019 00:26:44 2019-12-11 00:26:44.653  INFO 15206 --- [           main] junit.logTestName                        : Finished Test timeStampTests(org.springframework.cloud.dataflow.acceptance.test.TimestampTaskTests)
11-Dec-2019 00:26:44 2019-12-11 00:26:44.684  INFO 15206 --- [           main] junit.logTestName                        : Starting Test timeStampTestsMultipleLaunch(org.springframework.cloud.dataflow.acceptance.test.TimestampTaskTests)
11-Dec-2019 00:26:55 2019-12-11 00:26:55.154  INFO 15206 --- [           main] junit.logTestName                        : Test timeStampTestsMultipleLaunch(org.springframework.cloud.dataflow.acceptance.test.TimestampTaskTests) Succeeded
11-Dec-2019 00:26:55 2019-12-11 00:26:55.154  INFO 15206 --- [           main] junit.logTestName                        : Finished Test timeStampTestsMultipleLaunch(org.springframework.cloud.dataflow.acceptance.test.TimestampTaskTests)
11-Dec-2019 00:26:55 Tests run: 2, Failures: 0, Errors: 0, Skipped: 0, Time elapsed: 16.55 sec - in org.springframework.cloud.dataflow.acceptance.test.TimestampTaskTests
11-Dec-2019 00:26:55 Running org.springframework.cloud.dataflow.acceptance.test.TickTockTests
11-Dec-2019 00:26:55 2019-12-11 00:26:55.155  INFO 15206 --- [           main] .b.t.c.SpringBootTestContextBootstrapper : Neither @ContextConfiguration nor @ContextHierarchy found for test class [org.springframework.cloud.dataflow.acceptance.test.TickTockTests], using SpringBootContextLoader
11-Dec-2019 00:26:55 2019-12-11 00:26:55.160  INFO 15206 --- [           main] .b.t.c.SpringBootTestContextBootstrapper : Loaded default TestExecutionListener class names from location [META-INF/spring.factories]: [org.springframework.boot.test.mock.mockito.MockitoTestExecutionListener, org.springframework.boot.test.mock.mockito.ResetMocksTestExecutionListener, org.springframework.boot.test.autoconfigure.restdocs.RestDocsTestExecutionListener, org.springframework.boot.test.autoconfigure.web.client.MockRestServiceServerResetTestExecutionListener, org.springframework.boot.test.autoconfigure.web.servlet.MockMvcPrintOnlyOnFailureTestExecutionListener, org.springframework.boot.test.autoconfigure.web.servlet.WebDriverTestExecutionListener, org.springframework.test.context.web.ServletTestExecutionListener, org.springframework.test.context.support.DirtiesContextBeforeModesTestExecutionListener, org.springframework.test.context.support.DependencyInjectionTestExecutionListener, org.springframework.test.context.support.DirtiesContextTestExecutionListener, org.springframework.test.context.transaction.TransactionalTestExecutionListener, org.springframework.test.context.jdbc.SqlScriptsTestExecutionListener]
11-Dec-2019 00:26:55 2019-12-11 00:26:55.162  INFO 15206 --- [           main] .b.t.c.SpringBootTestContextBootstrapper : Using TestExecutionListeners: [org.springframework.test.context.web.ServletTestExecutionListener@a96d56c, org.springframework.test.context.support.DirtiesContextBeforeModesTestExecutionListener@6ab4a5b, org.springframework.boot.test.autoconfigure.SpringBootDependencyInjectionTestExecutionListener@2abe9173, org.springframework.test.context.support.DirtiesContextTestExecutionListener@235d29d6, org.springframework.test.context.transaction.TransactionalTestExecutionListener@1fdca564, org.springframework.test.context.jdbc.SqlScriptsTestExecutionListener@43f9dd56, org.springframework.boot.test.mock.mockito.MockitoTestExecutionListener@1d12e953, org.springframework.boot.test.autoconfigure.web.servlet.MockMvcPrintOnlyOnFailureTestExecutionListener@57cb70be, org.springframework.boot.test.autoconfigure.web.client.MockRestServiceServerResetTestExecutionListener@2d4608a6, org.springframework.boot.test.mock.mockito.ResetMocksTestExecutionListener@20d87335, org.springframework.boot.test.autoconfigure.web.servlet.WebDriverTestExecutionListener@2a8a4e0c, org.springframework.boot.test.autoconfigure.restdocs.RestDocsTestExecutionListener@26c89563]
11-Dec-2019 00:26:55 2019-12-11 00:26:55.195  INFO 15206 --- [           main] junit.logTestName                        : Starting Test tickTockUpdateRollbackTests(org.springframework.cloud.dataflow.acceptance.test.TickTockTests)
11-Dec-2019 00:26:55 2019-12-11 00:26:55.215 ERROR 15206 --- [           main] junit.logTestName                        : !!! Test tickTockUpdateRollbackTests(org.springframework.cloud.dataflow.acceptance.test.TickTockTests) Failed !!!
11-Dec-2019 00:26:55
11-Dec-2019 00:26:55 org.springframework.cloud.dataflow.rest.client.DataFlowClientException: I/O error on GET request for "http://localhost:7577/api": Connect to localhost:7577 [localhost/127.0.0.1, localhost/0:0:0:0:0:0:0:1] failed: Connection refused (Connection refused); nested exception is org.apache.http.conn.HttpHostConnectException: Connect to localhost:7577 [localhost/127.0.0.1, localhost/0:0:0:0:0:0:0:1] failed: Connection refused (Connection refused)
11-Dec-2019 00:26:55
11-Dec-2019 00:26:55         at org.springframework.cloud.dataflow.rest.client.VndErrorResponseErrorHandler.handleError(VndErrorResponseErrorHandler.java:63)
11-Dec-2019 00:26:55         at org.springframework.web.client.RestTemplate.handleResponse(RestTemplate.java:667)
11-Dec-2019 00:26:55         at org.springframework.web.client.RestTemplate.doExecute(RestTemplate.java:620)
11-Dec-2019 00:26:55         at org.springframework.web.client.RestTemplate.execute(RestTemplate.java:580)
11-Dec-2019 00:26:55         at org.springframework.web.client.RestTemplate.delete(RestTemplate.java:452)
11-Dec-2019 00:26:55         at org.springframework.cloud.dataflow.rest.client.StreamTemplate.destroyAll(StreamTemplate.java:147)
11-Dec-2019 00:26:55         at org.springframework.cloud.dataflow.acceptance.test.TickTockTests.tickTockUpdateRollbackTests(TickTockTests.java:61)
11-Dec-2019 00:26:55         at sun.reflect.NativeMethodAccessorImpl.invoke0(Native Method)
11-Dec-2019 00:26:55         at sun.reflect.NativeMethodAccessorImpl.invoke(NativeMethodAccessorImpl.java:62)
11-Dec-2019 00:26:55         at sun.reflect.DelegatingMethodAccessorImpl.invoke(DelegatingMethodAccessorImpl.java:43)
11-Dec-2019 00:26:55         at java.lang.reflect.Method.invoke(Method.java:498)
11-Dec-2019 00:26:55         at org.junit.runners.model.FrameworkMethod$1.runReflectiveCall(FrameworkMethod.java:50)
11-Dec-2019 00:26:55         at org.junit.internal.runners.model.ReflectiveCallable.run(ReflectiveCallable.java:12)
11-Dec-2019 00:26:55         at org.junit.runners.model.FrameworkMethod.invokeExplosively(FrameworkMethod.java:47)
11-Dec-2019 00:26:55         at org.junit.internal.runners.statements.InvokeMethod.evaluate(InvokeMethod.java:17)
11-Dec-2019 00:26:55         at org.junit.internal.runners.statements.RunBefores.evaluate(RunBefores.java:26)
11-Dec-2019 00:26:55         at org.springframework.test.context.junit4.statements.RunBeforeTestMethodCallbacks.evaluate(RunBeforeTestMethodCallbacks.java:75)
11-Dec-2019 00:26:55         at org.springframework.test.context.junit4.statements.RunAfterTestMethodCallbacks.evaluate(RunAfterTestMethodCallbacks.java:86)
11-Dec-2019 00:26:55         at org.junit.rules.TestWatcher$1.evaluate(TestWatcher.java:55)
11-Dec-2019 00:26:55         at org.junit.rules.ExternalResource$1.evaluate(ExternalResource.java:48)
11-Dec-2019 00:26:55         at org.junit.rules.RunRules.evaluate(RunRules.java:20)
11-Dec-2019 00:26:55         at org.springframework.test.context.junit4.statements.SpringRepeat.evaluate(SpringRepeat.java:84)
11-Dec-2019 00:26:55         at org.junit.runners.ParentRunner.runLeaf(ParentRunner.java:325)
11-Dec-2019 00:26:55         at org.springframework.test.context.junit4.SpringJUnit4ClassRunner.runChild(SpringJUnit4ClassRunner.java:252)
11-Dec-2019 00:26:55         at org.springframework.test.context.junit4.SpringJUnit4ClassRunner.runChild(SpringJUnit4ClassRunner.java:94)
11-Dec-2019 00:26:55         at org.junit.runners.ParentRunner$3.run(ParentRunner.java:290)
11-Dec-2019 00:26:55         at org.junit.runners.ParentRunner$1.schedule(ParentRunner.java:71)
11-Dec-2019 00:26:55         at org.junit.runners.ParentRunner.runChildren(ParentRunner.java:288)
11-Dec-2019 00:26:55         at org.junit.runners.ParentRunner.access$000(ParentRunner.java:58)
11-Dec-2019 00:26:55         at org.junit.runners.ParentRunner$2.evaluate(ParentRunner.java:268)
11-Dec-2019 00:26:55         at org.springframework.test.context.junit4.statements.RunBeforeTestClassCallbacks.evaluate(RunBeforeTestClassCallbacks.java:61)
11-Dec-2019 00:26:55         at org.springframework.test.context.junit4.statements.RunAfterTestClassCallbacks.evaluate(RunAfterTestClassCallbacks.java:70)
11-Dec-2019 00:26:55         at org.junit.runners.ParentRunner.run(ParentRunner.java:363)
11-Dec-2019 00:26:55         at org.springframework.test.context.junit4.SpringJUnit4ClassRunner.run(SpringJUnit4ClassRunner.java:191)
11-Dec-2019 00:26:55         at org.apache.maven.surefire.junit4.JUnit4Provider.execute(JUnit4Provider.java:283)
11-Dec-2019 00:26:55         at org.apache.maven.surefire.junit4.JUnit4Provider.executeWithRerun(JUnit4Provider.java:173)
11-Dec-2019 00:26:55         at org.apache.maven.surefire.junit4.JUnit4Provider.executeTestSet(JUnit4Provider.java:153)
11-Dec-2019 00:26:55         at org.apache.maven.surefire.junit4.JUnit4Provider.invoke(JUnit4Provider.java:128)
11-Dec-2019 00:26:55         at org.apache.maven.surefire.booter.ForkedBooter.invokeProviderInSameClassLoader(ForkedBooter.java:203)
11-Dec-2019 00:26:55         at org.apache.maven.surefire.booter.ForkedBooter.runSuitesInProcess(ForkedBooter.java:155)
11-Dec-2019 00:26:55         at org.apache.maven.surefire.booter.ForkedBooter.main(ForkedBooter.java:103)
11-Dec-2019 00:26:55
11-Dec-2019 00:26:55 2019-12-11 00:26:55.217  INFO 15206 --- [           main] junit.logTestName                        : Finished Test tickTockUpdateRollbackTests(org.springframework.cloud.dataflow.acceptance.test.TickTockTests)
11-Dec-2019 00:26:55 2019-12-11 00:26:55.217  INFO 15206 --- [           main] o.s.c.d.acceptance.test.TickTockTests    : Destroy all streams
11-Dec-2019 00:26:55 2019-12-11 00:26:55.275  INFO 15206 --- [           main] junit.logTestName                        : Starting Test tickTockTests(org.springframework.cloud.dataflow.acceptance.test.TickTockTests)
11-Dec-2019 00:26:55 2019-12-11 00:26:55.277  INFO 15206 --- [           main] o.s.c.d.acceptance.test.TickTockTests    : Creating stream 'TICKTOCK'
11-Dec-2019 00:26:55 2019-12-11 00:26:55.307 ERROR 15206 --- [           main] junit.logTestName                        : !!! Test tickTockTests(org.springframework.cloud.dataflow.acceptance.test.TickTockTests) Failed !!!
11-Dec-2019 00:26:55
11-Dec-2019 00:26:55 org.springframework.cloud.dataflow.rest.client.DataFlowClientException: I/O error on GET request for "http://localhost:7577/api/release/status/TICKTOCK": Connect to localhost:7577 [localhost/127.0.0.1, localhost/0:0:0:0:0:0:0:1] failed: Connection refused (Connection refused); nested exception is org.apache.http.conn.HttpHostConnectException: Connect to localhost:7577 [localhost/127.0.0.1, localhost/0:0:0:0:0:0:0:1] failed: Connection refused (Connection refused)
11-Dec-2019 00:26:55
11-Dec-2019 00:26:55         at org.springframework.cloud.dataflow.rest.client.VndErrorResponseErrorHandler.handleError(VndErrorResponseErrorHandler.java:63)
11-Dec-2019 00:26:55         at org.springframework.web.client.RestTemplate.handleResponse(RestTemplate.java:667)
11-Dec-2019 00:26:55         at org.springframework.web.client.RestTemplate.doExecute(RestTemplate.java:620)
11-Dec-2019 00:26:55         at org.springframework.web.client.RestTemplate.execute(RestTemplate.java:580)
11-Dec-2019 00:26:55         at org.springframework.web.client.RestTemplate.postForObject(RestTemplate.java:380)
11-Dec-2019 00:26:55         at org.springframework.cloud.dataflow.rest.client.StreamTemplate.createStream(StreamTemplate.java:120)
11-Dec-2019 00:26:55         at org.springframework.cloud.dataflow.acceptance.test.AbstractStreamTests.deployStream(AbstractStreamTests.java:169)
11-Dec-2019 00:26:55         at org.springframework.cloud.dataflow.acceptance.test.TickTockTests.tickTockTests(TickTockTests.java:47)
11-Dec-2019 00:26:55         at sun.reflect.NativeMethodAccessorImpl.invoke0(Native Method)
11-Dec-2019 00:26:55         at sun.reflect.NativeMethodAccessorImpl.invoke(NativeMethodAccessorImpl.java:62)
11-Dec-2019 00:26:55         at sun.reflect.DelegatingMethodAccessorImpl.invoke(DelegatingMethodAccessorImpl.java:43)
11-Dec-2019 00:26:55         at java.lang.reflect.Method.invoke(Method.java:498)
11-Dec-2019 00:26:55         at org.junit.runners.model.FrameworkMethod$1.runReflectiveCall(FrameworkMethod.java:50)
11-Dec-2019 00:26:55         at org.junit.internal.runners.model.ReflectiveCallable.run(ReflectiveCallable.java:12)
11-Dec-2019 00:26:55         at org.junit.runners.model.FrameworkMethod.invokeExplosively(FrameworkMethod.java:47)
11-Dec-2019 00:26:55         at org.junit.internal.runners.statements.InvokeMethod.evaluate(InvokeMethod.java:17)
11-Dec-2019 00:26:55         at org.junit.internal.runners.statements.RunBefores.evaluate(RunBefores.java:26)
11-Dec-2019 00:26:55         at org.springframework.test.context.junit4.statements.RunBeforeTestMethodCallbacks.evaluate(RunBeforeTestMethodCallbacks.java:75)
11-Dec-2019 00:26:55         at org.springframework.test.context.junit4.statements.RunAfterTestMethodCallbacks.evaluate(RunAfterTestMethodCallbacks.java:86)
11-Dec-2019 00:26:55         at org.junit.rules.TestWatcher$1.evaluate(TestWatcher.java:55)
11-Dec-2019 00:26:55         at org.junit.rules.ExternalResource$1.evaluate(ExternalResource.java:48)
11-Dec-2019 00:26:55         at org.junit.rules.RunRules.evaluate(RunRules.java:20)
11-Dec-2019 00:26:55         at org.springframework.test.context.junit4.statements.SpringRepeat.evaluate(SpringRepeat.java:84)
11-Dec-2019 00:26:55         at org.junit.runners.ParentRunner.runLeaf(ParentRunner.java:325)
11-Dec-2019 00:26:55         at org.springframework.test.context.junit4.SpringJUnit4ClassRunner.runChild(SpringJUnit4ClassRunner.java:252)
11-Dec-2019 00:26:55         at org.springframework.test.context.junit4.SpringJUnit4ClassRunner.runChild(SpringJUnit4ClassRunner.java:94)
11-Dec-2019 00:26:55         at org.junit.runners.ParentRunner$3.run(ParentRunner.java:290)
11-Dec-2019 00:26:55         at org.junit.runners.ParentRunner$1.schedule(ParentRunner.java:71)
11-Dec-2019 00:26:55         at org.junit.runners.ParentRunner.runChildren(ParentRunner.java:288)
11-Dec-2019 00:26:55         at org.junit.runners.ParentRunner.access$000(ParentRunner.java:58)
11-Dec-2019 00:26:55         at org.junit.runners.ParentRunner$2.evaluate(ParentRunner.java:268)
11-Dec-2019 00:26:55         at org.springframework.test.context.junit4.statements.RunBeforeTestClassCallbacks.evaluate(RunBeforeTestClassCallbacks.java:61)
11-Dec-2019 00:26:55         at org.springframework.test.context.junit4.statements.RunAfterTestClassCallbacks.evaluate(RunAfterTestClassCallbacks.java:70)
11-Dec-2019 00:26:55         at org.junit.runners.ParentRunner.run(ParentRunner.java:363)
11-Dec-2019 00:26:55         at org.springframework.test.context.junit4.SpringJUnit4ClassRunner.run(SpringJUnit4ClassRunner.java:191)
11-Dec-2019 00:26:55         at org.apache.maven.surefire.junit4.JUnit4Provider.execute(JUnit4Provider.java:283)
11-Dec-2019 00:26:55         at org.apache.maven.surefire.junit4.JUnit4Provider.executeWithRerun(JUnit4Provider.java:173)
11-Dec-2019 00:26:55         at org.apache.maven.surefire.junit4.JUnit4Provider.executeTestSet(JUnit4Provider.java:153)
11-Dec-2019 00:26:55         at org.apache.maven.surefire.junit4.JUnit4Provider.invoke(JUnit4Provider.java:128)
11-Dec-2019 00:26:55         at org.apache.maven.surefire.booter.ForkedBooter.invokeProviderInSameClassLoader(ForkedBooter.java:203)
11-Dec-2019 00:26:55         at org.apache.maven.surefire.booter.ForkedBooter.runSuitesInProcess(ForkedBooter.java:155)
11-Dec-2019 00:26:55         at org.apache.maven.surefire.booter.ForkedBooter.main(ForkedBooter.java:103)
11-Dec-2019 00:26:55
11-Dec-2019 00:26:55 2019-12-11 00:26:55.308  INFO 15206 --- [           main] junit.logTestName                        : Finished Test tickTockTests(org.springframework.cloud.dataflow.acceptance.test.TickTockTests)
11-Dec-2019 00:26:55 2019-12-11 00:26:55.309  INFO 15206 --- [           main] o.s.c.d.acceptance.test.TickTockTests    : Destroy all streams
11-Dec-2019 00:26:55 2019-12-11 00:26:55.369  INFO 15206 --- [           main] junit.logTestName                        : Starting Test tickTockTestsFromConfigServer(org.springframework.cloud.dataflow.acceptance.test.TickTockTests)
11-Dec-2019 00:26:55 2019-12-11 00:26:55.383  INFO 15206 --- [           main] junit.logTestName                        : Finished Test tickTockTestsFromConfigServer(org.springframework.cloud.dataflow.acceptance.test.TickTockTests)
11-Dec-2019 00:26:55 2019-12-11 00:26:55.383  INFO 15206 --- [           main] o.s.c.d.acceptance.test.TickTockTests    : Destroy all streams
11-Dec-2019 00:26:55 Tests run: 3, Failures: 0, Errors: 3, Skipped: 0, Time elapsed: 0.232 sec <<< FAILURE! - in org.springframework.cloud.dataflow.acceptance.test.TickTockTests
11-Dec-2019 00:26:55 tickTockUpdateRollbackTests(org.springframework.cloud.dataflow.acceptance.test.TickTockTests)  Time elapsed: 0.03 sec  <<< ERROR!
11-Dec-2019 00:26:55 org.springframework.cloud.dataflow.rest.client.DataFlowClientException: I/O error on GET request for "http://localhost:7577/api": Connect to localhost:7577 [localhost/127.0.0.1, localhost/0:0:0:0:0:0:0:1] failed: Connection refused (Connection refused); nested exception is org.apache.http.conn.HttpHostConnectException: Connect to localhost:7577 [localhost/127.0.0.1, localhost/0:0:0:0:0:0:0:1] failed: Connection refused (Connection refused)
11-Dec-2019 00:26:55
11-Dec-2019 00:26:55         at org.springframework.cloud.dataflow.rest.client.VndErrorResponseErrorHandler.handleError(VndErrorResponseErrorHandler.java:63)
11-Dec-2019 00:26:55         at org.springframework.web.client.RestTemplate.handleResponse(RestTemplate.java:667)
11-Dec-2019 00:26:55         at org.springframework.web.client.RestTemplate.doExecute(RestTemplate.java:620)
11-Dec-2019 00:26:55         at org.springframework.web.client.RestTemplate.execute(RestTemplate.java:580)
11-Dec-2019 00:26:55         at org.springframework.web.client.RestTemplate.delete(RestTemplate.java:452)
11-Dec-2019 00:26:55         at org.springframework.cloud.dataflow.rest.client.StreamTemplate.destroyAll(StreamTemplate.java:147)
11-Dec-2019 00:26:55         at org.springframework.cloud.dataflow.acceptance.test.AbstractStreamTests$1.after(AbstractStreamTests.java:119)
11-Dec-2019 00:26:55         at org.junit.rules.ExternalResource$1.evaluate(ExternalResource.java:50)
11-Dec-2019 00:26:55         at org.junit.rules.RunRules.evaluate(RunRules.java:20)
11-Dec-2019 00:26:55         at org.springframework.test.context.junit4.statements.SpringRepeat.evaluate(SpringRepeat.java:84)
11-Dec-2019 00:26:55         at org.junit.runners.ParentRunner.runLeaf(ParentRunner.java:325)
11-Dec-2019 00:26:55         at org.springframework.test.context.junit4.SpringJUnit4ClassRunner.runChild(SpringJUnit4ClassRunner.java:252)
11-Dec-2019 00:26:55         at org.springframework.test.context.junit4.SpringJUnit4ClassRunner.runChild(SpringJUnit4ClassRunner.java:94)
11-Dec-2019 00:26:55         at org.junit.runners.ParentRunner$3.run(ParentRunner.java:290)
11-Dec-2019 00:26:55         at org.junit.runners.ParentRunner$1.schedule(ParentRunner.java:71)
11-Dec-2019 00:26:55         at org.junit.runners.ParentRunner.runChildren(ParentRunner.java:288)
11-Dec-2019 00:26:55         at org.junit.runners.ParentRunner.access$000(ParentRunner.java:58)
11-Dec-2019 00:26:55         at org.junit.runners.ParentRunner$2.evaluate(ParentRunner.java:268)
11-Dec-2019 00:26:55         at org.springframework.test.context.junit4.statements.RunBeforeTestClassCallbacks.evaluate(RunBeforeTestClassCallbacks.java:61)
11-Dec-2019 00:26:55         at org.springframework.test.context.junit4.statements.RunAfterTestClassCallbacks.evaluate(RunAfterTestClassCallbacks.java:70)
11-Dec-2019 00:26:55         at org.junit.runners.ParentRunner.run(ParentRunner.java:363)
11-Dec-2019 00:26:55         at org.springframework.test.context.junit4.SpringJUnit4ClassRunner.run(SpringJUnit4ClassRunner.java:191)
11-Dec-2019 00:26:55         at org.apache.maven.surefire.junit4.JUnit4Provider.execute(JUnit4Provider.java:283)
11-Dec-2019 00:26:55         at org.apache.maven.surefire.junit4.JUnit4Provider.executeWithRerun(JUnit4Provider.java:173)
11-Dec-2019 00:26:55         at org.apache.maven.surefire.junit4.JUnit4Provider.executeTestSet(JUnit4Provider.java:153)
11-Dec-2019 00:26:55         at org.apache.maven.surefire.junit4.JUnit4Provider.invoke(JUnit4Provider.java:128)
11-Dec-2019 00:26:55         at org.apache.maven.surefire.booter.ForkedBooter.invokeProviderInSameClassLoader(ForkedBooter.java:203)
11-Dec-2019 00:26:55         at org.apache.maven.surefire.booter.ForkedBooter.runSuitesInProcess(ForkedBooter.java:155)
11-Dec-2019 00:26:55         at org.apache.maven.surefire.booter.ForkedBooter.main(ForkedBooter.java:103)
11-Dec-2019 00:26:55
11-Dec-2019 00:26:55 tickTockTests(org.springframework.cloud.dataflow.acceptance.test.TickTockTests)  Time elapsed: 0.043 sec  <<< ERROR!
11-Dec-2019 00:26:55 org.springframework.cloud.dataflow.rest.client.DataFlowClientException: I/O error on GET request for "http://localhost:7577/api": Connect to localhost:7577 [localhost/127.0.0.1, localhost/0:0:0:0:0:0:0:1] failed: Connection refused (Connection refused); nested exception is org.apache.http.conn.HttpHostConnectException: Connect to localhost:7577 [localhost/127.0.0.1, localhost/0:0:0:0:0:0:0:1] failed: Connection refused (Connection refused)
11-Dec-2019 00:26:55
11-Dec-2019 00:26:55         at org.springframework.cloud.dataflow.rest.client.VndErrorResponseErrorHandler.handleError(VndErrorResponseErrorHandler.java:63)
11-Dec-2019 00:26:55         at org.springframework.web.client.RestTemplate.handleResponse(RestTemplate.java:667)
11-Dec-2019 00:26:55         at org.springframework.web.client.RestTemplate.doExecute(RestTemplate.java:620)
11-Dec-2019 00:26:55         at org.springframework.web.client.RestTemplate.execute(RestTemplate.java:580)
11-Dec-2019 00:26:55         at org.springframework.web.client.RestTemplate.delete(RestTemplate.java:452)
11-Dec-2019 00:26:55         at org.springframework.cloud.dataflow.rest.client.StreamTemplate.destroyAll(StreamTemplate.java:147)
11-Dec-2019 00:26:55         at org.springframework.cloud.dataflow.acceptance.test.AbstractStreamTests$1.after(AbstractStreamTests.java:119)
11-Dec-2019 00:26:55         at org.junit.rules.ExternalResource$1.evaluate(ExternalResource.java:50)
11-Dec-2019 00:26:55         at org.junit.rules.RunRules.evaluate(RunRules.java:20)
11-Dec-2019 00:26:55         at org.springframework.test.context.junit4.statements.SpringRepeat.evaluate(SpringRepeat.java:84)
11-Dec-2019 00:26:55         at org.junit.runners.ParentRunner.runLeaf(ParentRunner.java:325)
11-Dec-2019 00:26:55         at org.springframework.test.context.junit4.SpringJUnit4ClassRunner.runChild(SpringJUnit4ClassRunner.java:252)
11-Dec-2019 00:26:55         at org.springframework.test.context.junit4.SpringJUnit4ClassRunner.runChild(SpringJUnit4ClassRunner.java:94)
11-Dec-2019 00:26:55         at org.junit.runners.ParentRunner$3.run(ParentRunner.java:290)
11-Dec-2019 00:26:55         at org.junit.runners.ParentRunner$1.schedule(ParentRunner.java:71)
11-Dec-2019 00:26:55         at org.junit.runners.ParentRunner.runChildren(ParentRunner.java:288)
11-Dec-2019 00:26:55         at org.junit.runners.ParentRunner.access$000(ParentRunner.java:58)
11-Dec-2019 00:26:55         at org.junit.runners.ParentRunner$2.evaluate(ParentRunner.java:268)
11-Dec-2019 00:26:55         at org.springframework.test.context.junit4.statements.RunBeforeTestClassCallbacks.evaluate(RunBeforeTestClassCallbacks.java:61)
11-Dec-2019 00:26:55         at org.springframework.test.context.junit4.statements.RunAfterTestClassCallbacks.evaluate(RunAfterTestClassCallbacks.java:70)
11-Dec-2019 00:26:55         at org.junit.runners.ParentRunner.run(ParentRunner.java:363)
11-Dec-2019 00:26:55         at org.springframework.test.context.junit4.SpringJUnit4ClassRunner.run(SpringJUnit4ClassRunner.java:191)
11-Dec-2019 00:26:55         at org.apache.maven.surefire.junit4.JUnit4Provider.execute(JUnit4Provider.java:283)
11-Dec-2019 00:26:55         at org.apache.maven.surefire.junit4.JUnit4Provider.executeWithRerun(JUnit4Provider.java:173)
11-Dec-2019 00:26:55         at org.apache.maven.surefire.junit4.JUnit4Provider.executeTestSet(JUnit4Provider.java:153)
11-Dec-2019 00:26:55         at org.apache.maven.surefire.junit4.JUnit4Provider.invoke(JUnit4Provider.java:128)
11-Dec-2019 00:26:55         at org.apache.maven.surefire.booter.ForkedBooter.invokeProviderInSameClassLoader(ForkedBooter.java:203)
11-Dec-2019 00:26:55         at org.apache.maven.surefire.booter.ForkedBooter.runSuitesInProcess(ForkedBooter.java:155)
11-Dec-2019 00:26:55         at org.apache.maven.surefire.booter.ForkedBooter.main(ForkedBooter.java:103)
11-Dec-2019 00:26:55
11-Dec-2019 00:26:55 tickTockTestsFromConfigServer(org.springframework.cloud.dataflow.acceptance.test.TickTockTests)  Time elapsed: 0.024 sec  <<< ERROR!
11-Dec-2019 00:26:55 org.springframework.cloud.dataflow.rest.client.DataFlowClientException: I/O error on GET request for "http://localhost:7577/api": Connect to localhost:7577 [localhost/127.0.0.1, localhost/0:0:0:0:0:0:0:1] failed: Connection refused (Connection refused); nested exception is org.apache.http.conn.HttpHostConnectException: Connect to localhost:7577 [localhost/127.0.0.1, localhost/0:0:0:0:0:0:0:1] failed: Connection refused (Connection refused)
11-Dec-2019 00:26:55
11-Dec-2019 00:26:55         at org.springframework.cloud.dataflow.rest.client.VndErrorResponseErrorHandler.handleError(VndErrorResponseErrorHandler.java:63)
11-Dec-2019 00:26:55         at org.springframework.web.client.RestTemplate.handleResponse(RestTemplate.java:667)
11-Dec-2019 00:26:55         at org.springframework.web.client.RestTemplate.doExecute(RestTemplate.java:620)
11-Dec-2019 00:26:55         at org.springframework.web.client.RestTemplate.execute(RestTemplate.java:580)
11-Dec-2019 00:26:55         at org.springframework.web.client.RestTemplate.delete(RestTemplate.java:452)
11-Dec-2019 00:26:55         at org.springframework.cloud.dataflow.rest.client.StreamTemplate.destroyAll(StreamTemplate.java:147)
11-Dec-2019 00:26:55         at org.springframework.cloud.dataflow.acceptance.test.AbstractStreamTests$1.after(AbstractStreamTests.java:119)
11-Dec-2019 00:26:55         at org.junit.rules.ExternalResource$1.evaluate(ExternalResource.java:50)
11-Dec-2019 00:26:55         at org.junit.rules.RunRules.evaluate(RunRules.java:20)
11-Dec-2019 00:26:55         at org.springframework.test.context.junit4.statements.SpringRepeat.evaluate(SpringRepeat.java:84)
11-Dec-2019 00:26:55         at org.junit.runners.ParentRunner.runLeaf(ParentRunner.java:325)
11-Dec-2019 00:26:55         at org.springframework.test.context.junit4.SpringJUnit4ClassRunner.runChild(SpringJUnit4ClassRunner.java:252)
11-Dec-2019 00:26:55         at org.springframework.test.context.junit4.SpringJUnit4ClassRunner.runChild(SpringJUnit4ClassRunner.java:94)
11-Dec-2019 00:26:55         at org.junit.runners.ParentRunner$3.run(ParentRunner.java:290)
11-Dec-2019 00:26:55         at org.junit.runners.ParentRunner$1.schedule(ParentRunner.java:71)
11-Dec-2019 00:26:55         at org.junit.runners.ParentRunner.runChildren(ParentRunner.java:288)
11-Dec-2019 00:26:55         at org.junit.runners.ParentRunner.access$000(ParentRunner.java:58)
11-Dec-2019 00:26:55         at org.junit.runners.ParentRunner$2.evaluate(ParentRunner.java:268)
11-Dec-2019 00:26:55         at org.springframework.test.context.junit4.statements.RunBeforeTestClassCallbacks.evaluate(RunBeforeTestClassCallbacks.java:61)
11-Dec-2019 00:26:55         at org.springframework.test.context.junit4.statements.RunAfterTestClassCallbacks.evaluate(RunAfterTestClassCallbacks.java:70)
11-Dec-2019 00:26:55         at org.junit.runners.ParentRunner.run(ParentRunner.java:363)
11-Dec-2019 00:26:55         at org.springframework.test.context.junit4.SpringJUnit4ClassRunner.run(SpringJUnit4ClassRunner.java:191)
11-Dec-2019 00:26:55         at org.apache.maven.surefire.junit4.JUnit4Provider.execute(JUnit4Provider.java:283)
11-Dec-2019 00:26:55         at org.apache.maven.surefire.junit4.JUnit4Provider.executeWithRerun(JUnit4Provider.java:173)
11-Dec-2019 00:26:55         at org.apache.maven.surefire.junit4.JUnit4Provider.executeTestSet(JUnit4Provider.java:153)
11-Dec-2019 00:26:55         at org.apache.maven.surefire.junit4.JUnit4Provider.invoke(JUnit4Provider.java:128)
11-Dec-2019 00:26:55         at org.apache.maven.surefire.booter.ForkedBooter.invokeProviderInSameClassLoader(ForkedBooter.java:203)
11-Dec-2019 00:26:55         at org.apache.maven.surefire.booter.ForkedBooter.runSuitesInProcess(ForkedBooter.java:155)
11-Dec-2019 00:26:55         at org.apache.maven.surefire.booter.ForkedBooter.main(ForkedBooter.java:103)
11-Dec-2019 00:26:55
11-Dec-2019 00:26:55 Running org.springframework.cloud.dataflow.acceptance.test.ComposedTaskTests
11-Dec-2019 00:26:55 2019-12-11 00:26:55.434  INFO 15206 --- [           main] junit.logTestName                        : Starting Test ctrMultipleLaunchWithArguments(org.springframework.cloud.dataflow.acceptance.test.ComposedTaskTests)
11-Dec-2019 00:27:56 2019-12-11 00:27:56.131  INFO 15206 --- [           main] junit.logTestName                        : Test ctrMultipleLaunchWithArguments(org.springframework.cloud.dataflow.acceptance.test.ComposedTaskTests) Succeeded
11-Dec-2019 00:27:56 2019-12-11 00:27:56.131  INFO 15206 --- [           main] junit.logTestName                        : Finished Test ctrMultipleLaunchWithArguments(org.springframework.cloud.dataflow.acceptance.test.ComposedTaskTests)
11-Dec-2019 00:27:56 2019-12-11 00:27:56.157  INFO 15206 --- [           main] junit.logTestName                        : Starting Test ctrMultipleLaunch(org.springframework.cloud.dataflow.acceptance.test.ComposedTaskTests)
11-Dec-2019 00:28:36 2019-12-11 00:28:36.732  INFO 15206 --- [           main] junit.logTestName                        : Test ctrMultipleLaunch(org.springframework.cloud.dataflow.acceptance.test.ComposedTaskTests) Succeeded
11-Dec-2019 00:28:36 2019-12-11 00:28:36.732  INFO 15206 --- [           main] junit.logTestName                        : Finished Test ctrMultipleLaunch(org.springframework.cloud.dataflow.acceptance.test.ComposedTaskTests)
11-Dec-2019 00:28:36 2019-12-11 00:28:36.757  INFO 15206 --- [           main] junit.logTestName                        : Starting Test ctrLaunch(org.springframework.cloud.dataflow.acceptance.test.ComposedTaskTests)
11-Dec-2019 00:29:12 2019-12-11 00:29:12.151  INFO 15206 --- [           main] junit.logTestName                        : Test ctrLaunch(org.springframework.cloud.dataflow.acceptance.test.ComposedTaskTests) Succeeded
11-Dec-2019 00:29:12 2019-12-11 00:29:12.151  INFO 15206 --- [           main] junit.logTestName                        : Finished Test ctrLaunch(org.springframework.cloud.dataflow.acceptance.test.ComposedTaskTests)
11-Dec-2019 00:29:12 Tests run: 3, Failures: 0, Errors: 0, Skipped: 0, Time elapsed: 136.742 sec - in org.springframework.cloud.dataflow.acceptance.test.ComposedTaskTests
11-Dec-2019 00:29:12 Running org.springframework.cloud.dataflow.acceptance.test.TransformTests
11-Dec-2019 00:29:12 2019-12-11 00:29:12.152  INFO 15206 --- [           main] .b.t.c.SpringBootTestContextBootstrapper : Neither @ContextConfiguration nor @ContextHierarchy found for test class [org.springframework.cloud.dataflow.acceptance.test.TransformTests], using SpringBootContextLoader
11-Dec-2019 00:29:12 2019-12-11 00:29:12.160  INFO 15206 --- [           main] .b.t.c.SpringBootTestContextBootstrapper : Loaded default TestExecutionListener class names from location [META-INF/spring.factories]: [org.springframework.boot.test.mock.mockito.MockitoTestExecutionListener, org.springframework.boot.test.mock.mockito.ResetMocksTestExecutionListener, org.springframework.boot.test.autoconfigure.restdocs.RestDocsTestExecutionListener, org.springframework.boot.test.autoconfigure.web.client.MockRestServiceServerResetTestExecutionListener, org.springframework.boot.test.autoconfigure.web.servlet.MockMvcPrintOnlyOnFailureTestExecutionListener, org.springframework.boot.test.autoconfigure.web.servlet.WebDriverTestExecutionListener, org.springframework.test.context.web.ServletTestExecutionListener, org.springframework.test.context.support.DirtiesContextBeforeModesTestExecutionListener, org.springframework.test.context.support.DependencyInjectionTestExecutionListener, org.springframework.test.context.support.DirtiesContextTestExecutionListener, org.springframework.test.context.transaction.TransactionalTestExecutionListener, org.springframework.test.context.jdbc.SqlScriptsTestExecutionListener]
11-Dec-2019 00:29:12 2019-12-11 00:29:12.163  INFO 15206 --- [           main] .b.t.c.SpringBootTestContextBootstrapper : Using TestExecutionListeners: [org.springframework.test.context.web.ServletTestExecutionListener@61a91c9b, org.springframework.test.context.support.DirtiesContextBeforeModesTestExecutionListener@17092fff, org.springframework.boot.test.autoconfigure.SpringBootDependencyInjectionTestExecutionListener@2121d1f9, org.springframework.test.context.support.DirtiesContextTestExecutionListener@31e2232f, org.springframework.test.context.transaction.TransactionalTestExecutionListener@1806bc4c, org.springframework.test.context.jdbc.SqlScriptsTestExecutionListener@462e1e64, org.springframework.boot.test.mock.mockito.MockitoTestExecutionListener@69afa141, org.springframework.boot.test.autoconfigure.web.servlet.MockMvcPrintOnlyOnFailureTestExecutionListener@49f40c00, org.springframework.boot.test.autoconfigure.web.client.MockRestServiceServerResetTestExecutionListener@643d2dae, org.springframework.boot.test.mock.mockito.ResetMocksTestExecutionListener@52d6d273, org.springframework.boot.test.autoconfigure.web.servlet.WebDriverTestExecutionListener@4667c4c1, org.springframework.boot.test.autoconfigure.restdocs.RestDocsTestExecutionListener@2f9a4401]
11-Dec-2019 00:29:12 2019-12-11 00:29:12.196  INFO 15206 --- [           main] junit.logTestName                        : Starting Test transformTests(org.springframework.cloud.dataflow.acceptance.test.TransformTests)
11-Dec-2019 00:29:12 2019-12-11 00:29:12.197  INFO 15206 --- [           main] o.s.c.d.acceptance.test.TransformTests   : Creating stream 'TRANSFORM-TEST'
11-Dec-2019 00:29:12 2019-12-11 00:29:12.222 ERROR 15206 --- [           main] junit.logTestName                        : !!! Test transformTests(org.springframework.cloud.dataflow.acceptance.test.TransformTests) Failed !!!
11-Dec-2019 00:29:12
11-Dec-2019 00:29:12 org.springframework.cloud.dataflow.rest.client.DataFlowClientException: I/O error on GET request for "http://localhost:7577/api/release/status/TRANSFORM-TEST": Connect to localhost:7577 [localhost/127.0.0.1, localhost/0:0:0:0:0:0:0:1] failed: Connection refused (Connection refused); nested exception is org.apache.http.conn.HttpHostConnectException: Connect to localhost:7577 [localhost/127.0.0.1, localhost/0:0:0:0:0:0:0:1] failed: Connection refused (Connection refused)
11-Dec-2019 00:29:12
11-Dec-2019 00:29:12         at org.springframework.cloud.dataflow.rest.client.VndErrorResponseErrorHandler.handleError(VndErrorResponseErrorHandler.java:63)
11-Dec-2019 00:29:12         at org.springframework.web.client.RestTemplate.handleResponse(RestTemplate.java:667)
11-Dec-2019 00:29:12         at org.springframework.web.client.RestTemplate.doExecute(RestTemplate.java:620)
11-Dec-2019 00:29:12         at org.springframework.web.client.RestTemplate.execute(RestTemplate.java:580)
11-Dec-2019 00:29:12         at org.springframework.web.client.RestTemplate.postForObject(RestTemplate.java:380)
11-Dec-2019 00:29:12         at org.springframework.cloud.dataflow.rest.client.StreamTemplate.createStream(StreamTemplate.java:120)
11-Dec-2019 00:29:12         at org.springframework.cloud.dataflow.acceptance.test.AbstractStreamTests.deployStream(AbstractStreamTests.java:169)
11-Dec-2019 00:29:12         at org.springframework.cloud.dataflow.acceptance.test.TransformTests.transformTests(TransformTests.java:39)
11-Dec-2019 00:29:12         at sun.reflect.NativeMethodAccessorImpl.invoke0(Native Method)
11-Dec-2019 00:29:12         at sun.reflect.NativeMethodAccessorImpl.invoke(NativeMethodAccessorImpl.java:62)
11-Dec-2019 00:29:12         at sun.reflect.DelegatingMethodAccessorImpl.invoke(DelegatingMethodAccessorImpl.java:43)
11-Dec-2019 00:29:12         at java.lang.reflect.Method.invoke(Method.java:498)
11-Dec-2019 00:29:12         at org.junit.runners.model.FrameworkMethod$1.runReflectiveCall(FrameworkMethod.java:50)
11-Dec-2019 00:29:12         at org.junit.internal.runners.model.ReflectiveCallable.run(ReflectiveCallable.java:12)
11-Dec-2019 00:29:12         at org.junit.runners.model.FrameworkMethod.invokeExplosively(FrameworkMethod.java:47)
11-Dec-2019 00:29:12         at org.junit.internal.runners.statements.InvokeMethod.evaluate(InvokeMethod.java:17)
11-Dec-2019 00:29:12         at org.junit.internal.runners.statements.RunBefores.evaluate(RunBefores.java:26)
11-Dec-2019 00:29:12         at org.springframework.test.context.junit4.statements.RunBeforeTestMethodCallbacks.evaluate(RunBeforeTestMethodCallbacks.java:75)
11-Dec-2019 00:29:12         at org.springframework.test.context.junit4.statements.RunAfterTestMethodCallbacks.evaluate(RunAfterTestMethodCallbacks.java:86)
11-Dec-2019 00:29:12         at org.junit.rules.TestWatcher$1.evaluate(TestWatcher.java:55)
11-Dec-2019 00:29:12         at org.junit.rules.ExternalResource$1.evaluate(ExternalResource.java:48)
11-Dec-2019 00:29:12         at org.junit.rules.RunRules.evaluate(RunRules.java:20)
11-Dec-2019 00:29:12         at org.springframework.test.context.junit4.statements.SpringRepeat.evaluate(SpringRepeat.java:84)
11-Dec-2019 00:29:12         at org.junit.runners.ParentRunner.runLeaf(ParentRunner.java:325)
11-Dec-2019 00:29:12         at org.springframework.test.context.junit4.SpringJUnit4ClassRunner.runChild(SpringJUnit4ClassRunner.java:252)
11-Dec-2019 00:29:12         at org.springframework.test.context.junit4.SpringJUnit4ClassRunner.runChild(SpringJUnit4ClassRunner.java:94)
11-Dec-2019 00:29:12         at org.junit.runners.ParentRunner$3.run(ParentRunner.java:290)
11-Dec-2019 00:29:12         at org.junit.runners.ParentRunner$1.schedule(ParentRunner.java:71)
11-Dec-2019 00:29:12         at org.junit.runners.ParentRunner.runChildren(ParentRunner.java:288)
11-Dec-2019 00:29:12         at org.junit.runners.ParentRunner.access$000(ParentRunner.java:58)
11-Dec-2019 00:29:12         at org.junit.runners.ParentRunner$2.evaluate(ParentRunner.java:268)
11-Dec-2019 00:29:12         at org.springframework.test.context.junit4.statements.RunBeforeTestClassCallbacks.evaluate(RunBeforeTestClassCallbacks.java:61)
11-Dec-2019 00:29:12         at org.springframework.test.context.junit4.statements.RunAfterTestClassCallbacks.evaluate(RunAfterTestClassCallbacks.java:70)
11-Dec-2019 00:29:12         at org.junit.runners.ParentRunner.run(ParentRunner.java:363)
11-Dec-2019 00:29:12         at org.springframework.test.context.junit4.SpringJUnit4ClassRunner.run(SpringJUnit4ClassRunner.java:191)
11-Dec-2019 00:29:12         at org.apache.maven.surefire.junit4.JUnit4Provider.execute(JUnit4Provider.java:283)
11-Dec-2019 00:29:12         at org.apache.maven.surefire.junit4.JUnit4Provider.executeWithRerun(JUnit4Provider.java:173)
11-Dec-2019 00:29:12         at org.apache.maven.surefire.junit4.JUnit4Provider.executeTestSet(JUnit4Provider.java:153)
11-Dec-2019 00:29:12         at org.apache.maven.surefire.junit4.JUnit4Provider.invoke(JUnit4Provider.java:128)
11-Dec-2019 00:29:12         at org.apache.maven.surefire.booter.ForkedBooter.invokeProviderInSameClassLoader(ForkedBooter.java:203)
11-Dec-2019 00:29:12         at org.apache.maven.surefire.booter.ForkedBooter.runSuitesInProcess(ForkedBooter.java:155)
11-Dec-2019 00:29:12         at org.apache.maven.surefire.booter.ForkedBooter.main(ForkedBooter.java:103)
11-Dec-2019 00:29:12
11-Dec-2019 00:29:12 2019-12-11 00:29:12.223  INFO 15206 --- [           main] junit.logTestName                        : Finished Test transformTests(org.springframework.cloud.dataflow.acceptance.test.TransformTests)
11-Dec-2019 00:29:12 2019-12-11 00:29:12.223  INFO 15206 --- [           main] o.s.c.d.acceptance.test.TransformTests   : Destroy all streams
11-Dec-2019 00:29:12 Tests run: 1, Failures: 0, Errors: 1, Skipped: 0, Time elapsed: 0.082 sec <<< FAILURE! - in org.springframework.cloud.dataflow.acceptance.test.TransformTests
11-Dec-2019 00:29:12 transformTests(org.springframework.cloud.dataflow.acceptance.test.TransformTests)  Time elapsed: 0.041 sec  <<< ERROR!
11-Dec-2019 00:29:12 org.springframework.cloud.dataflow.rest.client.DataFlowClientException: I/O error on GET request for "http://localhost:7577/api": Connect to localhost:7577 [localhost/127.0.0.1, localhost/0:0:0:0:0:0:0:1] failed: Connection refused (Connection refused); nested exception is org.apache.http.conn.HttpHostConnectException: Connect to localhost:7577 [localhost/127.0.0.1, localhost/0:0:0:0:0:0:0:1] failed: Connection refused (Connection refused)
11-Dec-2019 00:29:12
11-Dec-2019 00:29:12         at org.springframework.cloud.dataflow.rest.client.VndErrorResponseErrorHandler.handleError(VndErrorResponseErrorHandler.java:63)
11-Dec-2019 00:29:12         at org.springframework.web.client.RestTemplate.handleResponse(RestTemplate.java:667)
11-Dec-2019 00:29:12         at org.springframework.web.client.RestTemplate.doExecute(RestTemplate.java:620)
11-Dec-2019 00:29:12         at org.springframework.web.client.RestTemplate.execute(RestTemplate.java:580)
11-Dec-2019 00:29:12         at org.springframework.web.client.RestTemplate.delete(RestTemplate.java:452)
11-Dec-2019 00:29:12         at org.springframework.cloud.dataflow.rest.client.StreamTemplate.destroyAll(StreamTemplate.java:147)
11-Dec-2019 00:29:12         at org.springframework.cloud.dataflow.acceptance.test.AbstractStreamTests$1.after(AbstractStreamTests.java:119)
11-Dec-2019 00:29:12         at org.junit.rules.ExternalResource$1.evaluate(ExternalResource.java:50)
11-Dec-2019 00:29:12         at org.junit.rules.RunRules.evaluate(RunRules.java:20)
11-Dec-2019 00:29:12         at org.springframework.test.context.junit4.statements.SpringRepeat.evaluate(SpringRepeat.java:84)
11-Dec-2019 00:29:12         at org.junit.runners.ParentRunner.runLeaf(ParentRunner.java:325)
11-Dec-2019 00:29:12         at org.springframework.test.context.junit4.SpringJUnit4ClassRunner.runChild(SpringJUnit4ClassRunner.java:252)
11-Dec-2019 00:29:12         at org.springframework.test.context.junit4.SpringJUnit4ClassRunner.runChild(SpringJUnit4ClassRunner.java:94)
11-Dec-2019 00:29:12         at org.junit.runners.ParentRunner$3.run(ParentRunner.java:290)
11-Dec-2019 00:29:12         at org.junit.runners.ParentRunner$1.schedule(ParentRunner.java:71)
11-Dec-2019 00:29:12         at org.junit.runners.ParentRunner.runChildren(ParentRunner.java:288)
11-Dec-2019 00:29:12         at org.junit.runners.ParentRunner.access$000(ParentRunner.java:58)
11-Dec-2019 00:29:12         at org.junit.runners.ParentRunner$2.evaluate(ParentRunner.java:268)
11-Dec-2019 00:29:12         at org.springframework.test.context.junit4.statements.RunBeforeTestClassCallbacks.evaluate(RunBeforeTestClassCallbacks.java:61)
11-Dec-2019 00:29:12         at org.springframework.test.context.junit4.statements.RunAfterTestClassCallbacks.evaluate(RunAfterTestClassCallbacks.java:70)
11-Dec-2019 00:29:12         at org.junit.runners.ParentRunner.run(ParentRunner.java:363)
11-Dec-2019 00:29:12         at org.springframework.test.context.junit4.SpringJUnit4ClassRunner.run(SpringJUnit4ClassRunner.java:191)
11-Dec-2019 00:29:12         at org.apache.maven.surefire.junit4.JUnit4Provider.execute(JUnit4Provider.java:283)
11-Dec-2019 00:29:12         at org.apache.maven.surefire.junit4.JUnit4Provider.executeWithRerun(JUnit4Provider.java:173)
11-Dec-2019 00:29:12         at org.apache.maven.surefire.junit4.JUnit4Provider.executeTestSet(JUnit4Provider.java:153)
11-Dec-2019 00:29:12         at org.apache.maven.surefire.junit4.JUnit4Provider.invoke(JUnit4Provider.java:128)
11-Dec-2019 00:29:12         at org.apache.maven.surefire.booter.ForkedBooter.invokeProviderInSameClassLoader(ForkedBooter.java:203)
11-Dec-2019 00:29:12         at org.apache.maven.surefire.booter.ForkedBooter.runSuitesInProcess(ForkedBooter.java:155)
11-Dec-2019 00:29:12         at org.apache.maven.surefire.booter.ForkedBooter.main(ForkedBooter.java:103)
11-Dec-2019 00:29:12
11-Dec-2019 00:29:12 Running org.springframework.cloud.dataflow.acceptance.test.SchedulerTests
11-Dec-2019 00:29:12 2019-12-11 00:29:12.314  INFO 15206 --- [           main] s.c.a.AnnotationConfigApplicationContext : Refreshing org.springframework.context.annotation.AnnotationConfigApplicationContext@611640f0: startup date [Wed Dec 11 00:29:12 UTC 2019]; root of context hierarchy
11-Dec-2019 00:29:12 2019-12-11 00:29:12.339  INFO 15206 --- [           main] trationDelegate$BeanPostProcessorChecker : Bean 'configurationPropertiesRebinderAutoConfiguration' of type [class org.springframework.cloud.autoconfigure.ConfigurationPropertiesRebinderAutoConfiguration$$EnhancerBySpringCGLIB$$219d8b3d] is not eligible for getting processed by all BeanPostProcessors (for example: not eligible for auto-proxying)
11-Dec-2019 00:29:12
11-Dec-2019 00:29:12   .   ____          _            __ _ _
11-Dec-2019 00:29:12 /\\ / ___'_ __ _ _(_)_ __  __ _ \ \ \ \
11-Dec-2019 00:29:12 ( ( )\___ | '_ | '_| | '_ \/ _` | \ \ \ \
11-Dec-2019 00:29:12 \\/  ___)| |_)| | | | | || (_| |  ) ) ) )
11-Dec-2019 00:29:12   '  |____| .__|_| |_|_| |_\__, | / / / /
11-Dec-2019 00:29:12 =========|_|==============|___/=/_/_/_/
11-Dec-2019 00:29:12 :: Spring Boot ::        (v1.4.1.RELEASE)
11-Dec-2019 00:29:12
11-Dec-2019 00:29:12 2019-12-11 00:29:12.459  INFO 15206 --- [           main] c.c.c.ConfigServicePropertySourceLocator : Fetching config from server at: http://localhost:8888
11-Dec-2019 00:29:12 2019-12-11 00:29:12.462  WARN 15206 --- [           main] c.c.c.ConfigServicePropertySourceLocator : Could not locate PropertySource: I/O error on GET request for "http://localhost:8888//blah": Connection refused (Connection refused); nested exception is java.net.ConnectException: Connection refused (Connection refused)
11-Dec-2019 00:29:12 2019-12-11 00:29:12.463  INFO 15206 --- [           main] o.a.maven.surefire.booter.ForkedBooter   : The following profiles are active: blah
11-Dec-2019 00:29:12 2019-12-11 00:29:12.464  INFO 15206 --- [           main] s.c.a.AnnotationConfigApplicationContext : Refreshing org.springframework.context.annotation.AnnotationConfigApplicationContext@3c0e00a8: startup date [Wed Dec 11 00:29:12 UTC 2019]; parent: org.springframework.context.annotation.AnnotationConfigApplicationContext@611640f0
11-Dec-2019 00:29:12 2019-12-11 00:29:12.519  INFO 15206 --- [           main] o.a.maven.surefire.booter.ForkedBooter   : Started ForkedBooter in 0.273 seconds (JVM running for 158.605)
11-Dec-2019 00:29:12 2019-12-11 00:29:12.519  INFO 15206 --- [           main] s.c.a.AnnotationConfigApplicationContext : Closing org.springframework.context.annotation.AnnotationConfigApplicationContext@3c0e00a8: startup date [Wed Dec 11 00:29:12 UTC 2019]; parent: org.springframework.context.annotation.AnnotationConfigApplicationContext@611640f0
11-Dec-2019 00:29:12 2019-12-11 00:29:12.520 ERROR 15206 --- [           main] o.s.c.d.a.test.util.SchedulerRule        : SCHEDULER IS NOT AVAILABLE, SKIPPING TESTS
11-Dec-2019 00:29:12
11-Dec-2019 00:29:12 java.lang.IllegalArgumentException: no SchedulerOperations bean is available.  Skipping test.
11-Dec-2019 00:29:12         at org.springframework.util.Assert.notNull(Assert.java:115)
11-Dec-2019 00:29:12         at org.springframework.cloud.dataflow.acceptance.test.util.SchedulerRule.obtainResource(SchedulerRule.java:57)
11-Dec-2019 00:29:12         at org.springframework.cloud.scheduler.spi.junit.AbstractExternalResourceTestSupport.apply(AbstractExternalResourceTestSupport.java:58)
11-Dec-2019 00:29:12         at org.junit.rules.RunRules.applyAll(RunRules.java:26)
11-Dec-2019 00:29:12         at org.junit.rules.RunRules.<init>(RunRules.java:15)
11-Dec-2019 00:29:12         at org.junit.runners.ParentRunner.withClassRules(ParentRunner.java:245)
11-Dec-2019 00:29:12         at org.junit.runners.ParentRunner.classBlock(ParentRunner.java:194)
11-Dec-2019 00:29:12         at org.junit.runners.ParentRunner.run(ParentRunner.java:362)
11-Dec-2019 00:29:12         at org.springframework.test.context.junit4.SpringJUnit4ClassRunner.run(SpringJUnit4ClassRunner.java:191)
11-Dec-2019 00:29:12         at org.apache.maven.surefire.junit4.JUnit4Provider.execute(JUnit4Provider.java:283)
11-Dec-2019 00:29:12         at org.apache.maven.surefire.junit4.JUnit4Provider.executeWithRerun(JUnit4Provider.java:173)
11-Dec-2019 00:29:12         at org.apache.maven.surefire.junit4.JUnit4Provider.executeTestSet(JUnit4Provider.java:153)
11-Dec-2019 00:29:12         at org.apache.maven.surefire.junit4.JUnit4Provider.invoke(JUnit4Provider.java:128)
11-Dec-2019 00:29:12         at org.apache.maven.surefire.booter.ForkedBooter.invokeProviderInSameClassLoader(ForkedBooter.java:203)
11-Dec-2019 00:29:12         at org.apache.maven.surefire.booter.ForkedBooter.runSuitesInProcess(ForkedBooter.java:155)
11-Dec-2019 00:29:12         at org.apache.maven.surefire.booter.ForkedBooter.main(ForkedBooter.java:103)
11-Dec-2019 00:29:12
11-Dec-2019 00:29:12 Tests run: 1, Failures: 0, Errors: 0, Skipped: 1, Time elapsed: 0.272 sec - in org.springframework.cloud.dataflow.acceptance.test.SchedulerTests
11-Dec-2019 00:29:12 Running org.springframework.cloud.dataflow.acceptance.test.NamedChannelTests
11-Dec-2019 00:29:12 2019-12-11 00:29:12.521  INFO 15206 --- [           main] .b.t.c.SpringBootTestContextBootstrapper : Neither @ContextConfiguration nor @ContextHierarchy found for test class [org.springframework.cloud.dataflow.acceptance.test.NamedChannelTests], using SpringBootContextLoader
11-Dec-2019 00:29:12 2019-12-11 00:29:12.525  INFO 15206 --- [           main] .b.t.c.SpringBootTestContextBootstrapper : Loaded default TestExecutionListener class names from location [META-INF/spring.factories]: [org.springframework.boot.test.mock.mockito.MockitoTestExecutionListener, org.springframework.boot.test.mock.mockito.ResetMocksTestExecutionListener, org.springframework.boot.test.autoconfigure.restdocs.RestDocsTestExecutionListener, org.springframework.boot.test.autoconfigure.web.client.MockRestServiceServerResetTestExecutionListener, org.springframework.boot.test.autoconfigure.web.servlet.MockMvcPrintOnlyOnFailureTestExecutionListener, org.springframework.boot.test.autoconfigure.web.servlet.WebDriverTestExecutionListener, org.springframework.test.context.web.ServletTestExecutionListener, org.springframework.test.context.support.DirtiesContextBeforeModesTestExecutionListener, org.springframework.test.context.support.DependencyInjectionTestExecutionListener, org.springframework.test.context.support.DirtiesContextTestExecutionListener, org.springframework.test.context.transaction.TransactionalTestExecutionListener, org.springframework.test.context.jdbc.SqlScriptsTestExecutionListener]
11-Dec-2019 00:29:12 2019-12-11 00:29:12.527  INFO 15206 --- [           main] .b.t.c.SpringBootTestContextBootstrapper : Using TestExecutionListeners: [org.springframework.test.context.web.ServletTestExecutionListener@33188612, org.springframework.test.context.support.DirtiesContextBeforeModesTestExecutionListener@4733f6f5, org.springframework.boot.test.autoconfigure.SpringBootDependencyInjectionTestExecutionListener@6ccac6f4, org.springframework.test.context.support.DirtiesContextTestExecutionListener@438c9aa7, org.springframework.test.context.transaction.TransactionalTestExecutionListener@3453acd2, org.springframework.test.context.jdbc.SqlScriptsTestExecutionListener@6c8f60f3, org.springframework.boot.test.mock.mockito.MockitoTestExecutionListener@56c8e6f0, org.springframework.boot.test.autoconfigure.web.servlet.MockMvcPrintOnlyOnFailureTestExecutionListener@71b6172c, org.springframework.boot.test.autoconfigure.web.client.MockRestServiceServerResetTestExecutionListener@58aa10f4, org.springframework.boot.test.mock.mockito.ResetMocksTestExecutionListener@4fb56bea, org.springframework.boot.test.autoconfigure.web.servlet.WebDriverTestExecutionListener@5e5beb8a, org.springframework.boot.test.autoconfigure.restdocs.RestDocsTestExecutionListener@1f95881a]
11-Dec-2019 00:29:12 2019-12-11 00:29:12.560  INFO 15206 --- [           main] junit.logTestName                        : Starting Test testDestination(org.springframework.cloud.dataflow.acceptance.test.NamedChannelTests)
11-Dec-2019 00:29:12 2019-12-11 00:29:12.562  INFO 15206 --- [           main] o.s.c.d.a.test.NamedChannelTests         : Creating stream 'LOG-DESTINATION-SINK'
11-Dec-2019 00:29:12 2019-12-11 00:29:12.585 ERROR 15206 --- [           main] junit.logTestName                        : !!! Test testDestination(org.springframework.cloud.dataflow.acceptance.test.NamedChannelTests) Failed !!!
11-Dec-2019 00:29:12
11-Dec-2019 00:29:12 org.springframework.cloud.dataflow.rest.client.DataFlowClientException: I/O error on GET request for "http://localhost:7577/api/release/status/LOG-DESTINATION-SINK": Connect to localhost:7577 [localhost/127.0.0.1, localhost/0:0:0:0:0:0:0:1] failed: Connection refused (Connection refused); nested exception is org.apache.http.conn.HttpHostConnectException: Connect to localhost:7577 [localhost/127.0.0.1, localhost/0:0:0:0:0:0:0:1] failed: Connection refused (Connection refused)
11-Dec-2019 00:29:12
11-Dec-2019 00:29:12         at org.springframework.cloud.dataflow.rest.client.VndErrorResponseErrorHandler.handleError(VndErrorResponseErrorHandler.java:63)
11-Dec-2019 00:29:12         at org.springframework.web.client.RestTemplate.handleResponse(RestTemplate.java:667)
11-Dec-2019 00:29:12         at org.springframework.web.client.RestTemplate.doExecute(RestTemplate.java:620)
11-Dec-2019 00:29:12         at org.springframework.web.client.RestTemplate.execute(RestTemplate.java:580)
11-Dec-2019 00:29:12         at org.springframework.web.client.RestTemplate.postForObject(RestTemplate.java:380)
11-Dec-2019 00:29:12         at org.springframework.cloud.dataflow.rest.client.StreamTemplate.createStream(StreamTemplate.java:120)
11-Dec-2019 00:29:12         at org.springframework.cloud.dataflow.acceptance.test.AbstractStreamTests.deployStream(AbstractStreamTests.java:169)
11-Dec-2019 00:29:12         at org.springframework.cloud.dataflow.acceptance.test.NamedChannelTests.deployStream(NamedChannelTests.java:88)
11-Dec-2019 00:29:12         at org.springframework.cloud.dataflow.acceptance.test.NamedChannelTests.deployLog(NamedChannelTests.java:96)
11-Dec-2019 00:29:12         at org.springframework.cloud.dataflow.acceptance.test.NamedChannelTests.testDestination(NamedChannelTests.java:35)
11-Dec-2019 00:29:12         at sun.reflect.NativeMethodAccessorImpl.invoke0(Native Method)
11-Dec-2019 00:29:12         at sun.reflect.NativeMethodAccessorImpl.invoke(NativeMethodAccessorImpl.java:62)
11-Dec-2019 00:29:12         at sun.reflect.DelegatingMethodAccessorImpl.invoke(DelegatingMethodAccessorImpl.java:43)
11-Dec-2019 00:29:12         at java.lang.reflect.Method.invoke(Method.java:498)
11-Dec-2019 00:29:12         at org.junit.runners.model.FrameworkMethod$1.runReflectiveCall(FrameworkMethod.java:50)
11-Dec-2019 00:29:12         at org.junit.internal.runners.model.ReflectiveCallable.run(ReflectiveCallable.java:12)
11-Dec-2019 00:29:12         at org.junit.runners.model.FrameworkMethod.invokeExplosively(FrameworkMethod.java:47)
11-Dec-2019 00:29:12         at org.junit.internal.runners.statements.InvokeMethod.evaluate(InvokeMethod.java:17)
11-Dec-2019 00:29:12         at org.junit.internal.runners.statements.RunBefores.evaluate(RunBefores.java:26)
11-Dec-2019 00:29:12         at org.springframework.test.context.junit4.statements.RunBeforeTestMethodCallbacks.evaluate(RunBeforeTestMethodCallbacks.java:75)
11-Dec-2019 00:29:12         at org.springframework.test.context.junit4.statements.RunAfterTestMethodCallbacks.evaluate(RunAfterTestMethodCallbacks.java:86)
11-Dec-2019 00:29:12         at org.junit.rules.TestWatcher$1.evaluate(TestWatcher.java:55)
11-Dec-2019 00:29:12         at org.junit.rules.ExternalResource$1.evaluate(ExternalResource.java:48)
11-Dec-2019 00:29:12         at org.junit.rules.RunRules.evaluate(RunRules.java:20)
11-Dec-2019 00:29:12         at org.springframework.test.context.junit4.statements.SpringRepeat.evaluate(SpringRepeat.java:84)
11-Dec-2019 00:29:12         at org.junit.runners.ParentRunner.runLeaf(ParentRunner.java:325)
11-Dec-2019 00:29:12         at org.springframework.test.context.junit4.SpringJUnit4ClassRunner.runChild(SpringJUnit4ClassRunner.java:252)
11-Dec-2019 00:29:12         at org.springframework.test.context.junit4.SpringJUnit4ClassRunner.runChild(SpringJUnit4ClassRunner.java:94)
11-Dec-2019 00:29:12         at org.junit.runners.ParentRunner$3.run(ParentRunner.java:290)
11-Dec-2019 00:29:12         at org.junit.runners.ParentRunner$1.schedule(ParentRunner.java:71)
11-Dec-2019 00:29:12         at org.junit.runners.ParentRunner.runChildren(ParentRunner.java:288)
11-Dec-2019 00:29:12         at org.junit.runners.ParentRunner.access$000(ParentRunner.java:58)
11-Dec-2019 00:29:12         at org.junit.runners.ParentRunner$2.evaluate(ParentRunner.java:268)
11-Dec-2019 00:29:12         at org.springframework.test.context.junit4.statements.RunBeforeTestClassCallbacks.evaluate(RunBeforeTestClassCallbacks.java:61)
11-Dec-2019 00:29:12         at org.springframework.test.context.junit4.statements.RunAfterTestClassCallbacks.evaluate(RunAfterTestClassCallbacks.java:70)
11-Dec-2019 00:29:12         at org.junit.runners.ParentRunner.run(ParentRunner.java:363)
11-Dec-2019 00:29:12         at org.springframework.test.context.junit4.SpringJUnit4ClassRunner.run(SpringJUnit4ClassRunner.java:191)
11-Dec-2019 00:29:12         at org.apache.maven.surefire.junit4.JUnit4Provider.execute(JUnit4Provider.java:283)
11-Dec-2019 00:29:12         at org.apache.maven.surefire.junit4.JUnit4Provider.executeWithRerun(JUnit4Provider.java:173)
11-Dec-2019 00:29:12         at org.apache.maven.surefire.junit4.JUnit4Provider.executeTestSet(JUnit4Provider.java:153)
11-Dec-2019 00:29:12         at org.apache.maven.surefire.junit4.JUnit4Provider.invoke(JUnit4Provider.java:128)
11-Dec-2019 00:29:12         at org.apache.maven.surefire.booter.ForkedBooter.invokeProviderInSameClassLoader(ForkedBooter.java:203)
11-Dec-2019 00:29:12         at org.apache.maven.surefire.booter.ForkedBooter.runSuitesInProcess(ForkedBooter.java:155)
11-Dec-2019 00:29:12         at org.apache.maven.surefire.booter.ForkedBooter.main(ForkedBooter.java:103)
11-Dec-2019 00:29:12
11-Dec-2019 00:29:12 2019-12-11 00:29:12.585  INFO 15206 --- [           main] junit.logTestName                        : Finished Test testDestination(org.springframework.cloud.dataflow.acceptance.test.NamedChannelTests)
11-Dec-2019 00:29:12 2019-12-11 00:29:12.585  INFO 15206 --- [           main] o.s.c.d.a.test.NamedChannelTests         : Destroy all streams
11-Dec-2019 00:29:12 2019-12-11 00:29:12.616  INFO 15206 --- [           main] junit.logTestName                        : Starting Test testTap(org.springframework.cloud.dataflow.acceptance.test.NamedChannelTests)
11-Dec-2019 00:29:12 2019-12-11 00:29:12.617  INFO 15206 --- [           main] o.s.c.d.a.test.NamedChannelTests         : Creating stream 'TAPHTTP'
11-Dec-2019 00:29:12 2019-12-11 00:29:12.642 ERROR 15206 --- [           main] junit.logTestName                        : !!! Test testTap(org.springframework.cloud.dataflow.acceptance.test.NamedChannelTests) Failed !!!
11-Dec-2019 00:29:12
11-Dec-2019 00:29:12 org.springframework.cloud.dataflow.rest.client.DataFlowClientException: I/O error on GET request for "http://localhost:7577/api/release/status/TAPHTTP": Connect to localhost:7577 [localhost/127.0.0.1, localhost/0:0:0:0:0:0:0:1] failed: Connection refused (Connection refused); nested exception is org.apache.http.conn.HttpHostConnectException: Connect to localhost:7577 [localhost/127.0.0.1, localhost/0:0:0:0:0:0:0:1] failed: Connection refused (Connection refused)
11-Dec-2019 00:29:12
11-Dec-2019 00:29:12         at org.springframework.cloud.dataflow.rest.client.VndErrorResponseErrorHandler.handleError(VndErrorResponseErrorHandler.java:63)
11-Dec-2019 00:29:12         at org.springframework.web.client.RestTemplate.handleResponse(RestTemplate.java:667)
11-Dec-2019 00:29:12         at org.springframework.web.client.RestTemplate.doExecute(RestTemplate.java:620)
11-Dec-2019 00:29:12         at org.springframework.web.client.RestTemplate.execute(RestTemplate.java:580)
11-Dec-2019 00:29:12         at org.springframework.web.client.RestTemplate.postForObject(RestTemplate.java:380)
11-Dec-2019 00:29:12         at org.springframework.cloud.dataflow.rest.client.StreamTemplate.createStream(StreamTemplate.java:120)
11-Dec-2019 00:29:12         at org.springframework.cloud.dataflow.acceptance.test.AbstractStreamTests.deployStream(AbstractStreamTests.java:169)
11-Dec-2019 00:29:12         at org.springframework.cloud.dataflow.acceptance.test.NamedChannelTests.deployStream(NamedChannelTests.java:88)
11-Dec-2019 00:29:12         at org.springframework.cloud.dataflow.acceptance.test.NamedChannelTests.deployHttp(NamedChannelTests.java:104)
11-Dec-2019 00:29:12         at org.springframework.cloud.dataflow.acceptance.test.NamedChannelTests.testTap(NamedChannelTests.java:45)
11-Dec-2019 00:29:12         at sun.reflect.NativeMethodAccessorImpl.invoke0(Native Method)
11-Dec-2019 00:29:12         at sun.reflect.NativeMethodAccessorImpl.invoke(NativeMethodAccessorImpl.java:62)
11-Dec-2019 00:29:12         at sun.reflect.DelegatingMethodAccessorImpl.invoke(DelegatingMethodAccessorImpl.java:43)
11-Dec-2019 00:29:12         at java.lang.reflect.Method.invoke(Method.java:498)
11-Dec-2019 00:29:12         at org.junit.runners.model.FrameworkMethod$1.runReflectiveCall(FrameworkMethod.java:50)
11-Dec-2019 00:29:12         at org.junit.internal.runners.model.ReflectiveCallable.run(ReflectiveCallable.java:12)
11-Dec-2019 00:29:12         at org.junit.runners.model.FrameworkMethod.invokeExplosively(FrameworkMethod.java:47)
11-Dec-2019 00:29:12         at org.junit.internal.runners.statements.InvokeMethod.evaluate(InvokeMethod.java:17)
11-Dec-2019 00:29:12         at org.junit.internal.runners.statements.RunBefores.evaluate(RunBefores.java:26)
11-Dec-2019 00:29:12         at org.springframework.test.context.junit4.statements.RunBeforeTestMethodCallbacks.evaluate(RunBeforeTestMethodCallbacks.java:75)
11-Dec-2019 00:29:12         at org.springframework.test.context.junit4.statements.RunAfterTestMethodCallbacks.evaluate(RunAfterTestMethodCallbacks.java:86)
11-Dec-2019 00:29:12         at org.junit.rules.TestWatcher$1.evaluate(TestWatcher.java:55)
11-Dec-2019 00:29:12         at org.junit.rules.ExternalResource$1.evaluate(ExternalResource.java:48)
11-Dec-2019 00:29:12         at org.junit.rules.RunRules.evaluate(RunRules.java:20)
11-Dec-2019 00:29:12         at org.springframework.test.context.junit4.statements.SpringRepeat.evaluate(SpringRepeat.java:84)
11-Dec-2019 00:29:12         at org.junit.runners.ParentRunner.runLeaf(ParentRunner.java:325)
11-Dec-2019 00:29:12         at org.springframework.test.context.junit4.SpringJUnit4ClassRunner.runChild(SpringJUnit4ClassRunner.java:252)
11-Dec-2019 00:29:12         at org.springframework.test.context.junit4.SpringJUnit4ClassRunner.runChild(SpringJUnit4ClassRunner.java:94)
11-Dec-2019 00:29:12         at org.junit.runners.ParentRunner$3.run(ParentRunner.java:290)
11-Dec-2019 00:29:12         at org.junit.runners.ParentRunner$1.schedule(ParentRunner.java:71)
11-Dec-2019 00:29:12         at org.junit.runners.ParentRunner.runChildren(ParentRunner.java:288)
11-Dec-2019 00:29:12         at org.junit.runners.ParentRunner.access$000(ParentRunner.java:58)
11-Dec-2019 00:29:12         at org.junit.runners.ParentRunner$2.evaluate(ParentRunner.java:268)
11-Dec-2019 00:29:12         at org.springframework.test.context.junit4.statements.RunBeforeTestClassCallbacks.evaluate(RunBeforeTestClassCallbacks.java:61)
11-Dec-2019 00:29:12         at org.springframework.test.context.junit4.statements.RunAfterTestClassCallbacks.evaluate(RunAfterTestClassCallbacks.java:70)
11-Dec-2019 00:29:12         at org.junit.runners.ParentRunner.run(ParentRunner.java:363)
11-Dec-2019 00:29:12         at org.springframework.test.context.junit4.SpringJUnit4ClassRunner.run(SpringJUnit4ClassRunner.java:191)
11-Dec-2019 00:29:12         at org.apache.maven.surefire.junit4.JUnit4Provider.execute(JUnit4Provider.java:283)
11-Dec-2019 00:29:12         at org.apache.maven.surefire.junit4.JUnit4Provider.executeWithRerun(JUnit4Provider.java:173)
11-Dec-2019 00:29:12         at org.apache.maven.surefire.junit4.JUnit4Provider.executeTestSet(JUnit4Provider.java:153)
11-Dec-2019 00:29:12         at org.apache.maven.surefire.junit4.JUnit4Provider.invoke(JUnit4Provider.java:128)
11-Dec-2019 00:29:12         at org.apache.maven.surefire.booter.ForkedBooter.invokeProviderInSameClassLoader(ForkedBooter.java:203)
11-Dec-2019 00:29:12         at org.apache.maven.surefire.booter.ForkedBooter.runSuitesInProcess(ForkedBooter.java:155)
11-Dec-2019 00:29:12         at org.apache.maven.surefire.booter.ForkedBooter.main(ForkedBooter.java:103)
11-Dec-2019 00:29:12
11-Dec-2019 00:29:12 2019-12-11 00:29:12.642  INFO 15206 --- [           main] junit.logTestName                        : Finished Test testTap(org.springframework.cloud.dataflow.acceptance.test.NamedChannelTests)
11-Dec-2019 00:29:12 2019-12-11 00:29:12.642  INFO 15206 --- [           main] o.s.c.d.a.test.NamedChannelTests         : Destroy all streams
11-Dec-2019 00:29:12 2019-12-11 00:29:12.676  INFO 15206 --- [           main] junit.logTestName                        : Starting Test manyToOneTest(org.springframework.cloud.dataflow.acceptance.test.NamedChannelTests)
11-Dec-2019 00:29:12 2019-12-11 00:29:12.676  INFO 15206 --- [           main] o.s.c.d.a.test.NamedChannelTests         : Creating stream 'MANY-TO-ONE'
11-Dec-2019 00:29:12 2019-12-11 00:29:12.702 ERROR 15206 --- [           main] junit.logTestName                        : !!! Test manyToOneTest(org.springframework.cloud.dataflow.acceptance.test.NamedChannelTests) Failed !!!
11-Dec-2019 00:29:12
11-Dec-2019 00:29:12 org.springframework.cloud.dataflow.rest.client.DataFlowClientException: I/O error on GET request for "http://localhost:7577/api/release/status/MANY-TO-ONE": Connect to localhost:7577 [localhost/127.0.0.1, localhost/0:0:0:0:0:0:0:1] failed: Connection refused (Connection refused); nested exception is org.apache.http.conn.HttpHostConnectException: Connect to localhost:7577 [localhost/127.0.0.1, localhost/0:0:0:0:0:0:0:1] failed: Connection refused (Connection refused)
11-Dec-2019 00:29:12
11-Dec-2019 00:29:12         at org.springframework.cloud.dataflow.rest.client.VndErrorResponseErrorHandler.handleError(VndErrorResponseErrorHandler.java:63)
11-Dec-2019 00:29:12         at org.springframework.web.client.RestTemplate.handleResponse(RestTemplate.java:667)
11-Dec-2019 00:29:12         at org.springframework.web.client.RestTemplate.doExecute(RestTemplate.java:620)
11-Dec-2019 00:29:12         at org.springframework.web.client.RestTemplate.execute(RestTemplate.java:580)
11-Dec-2019 00:29:12         at org.springframework.web.client.RestTemplate.postForObject(RestTemplate.java:380)
11-Dec-2019 00:29:12         at org.springframework.cloud.dataflow.rest.client.StreamTemplate.createStream(StreamTemplate.java:120)
11-Dec-2019 00:29:12         at org.springframework.cloud.dataflow.acceptance.test.AbstractStreamTests.deployStream(AbstractStreamTests.java:169)
11-Dec-2019 00:29:12         at org.springframework.cloud.dataflow.acceptance.test.NamedChannelTests.deployStream(NamedChannelTests.java:88)
11-Dec-2019 00:29:12         at org.springframework.cloud.dataflow.acceptance.test.NamedChannelTests.deployLog(NamedChannelTests.java:96)
11-Dec-2019 00:29:12         at org.springframework.cloud.dataflow.acceptance.test.NamedChannelTests.manyToOneTest(NamedChannelTests.java:58)
11-Dec-2019 00:29:12         at sun.reflect.NativeMethodAccessorImpl.invoke0(Native Method)
11-Dec-2019 00:29:12         at sun.reflect.NativeMethodAccessorImpl.invoke(NativeMethodAccessorImpl.java:62)
11-Dec-2019 00:29:12         at sun.reflect.DelegatingMethodAccessorImpl.invoke(DelegatingMethodAccessorImpl.java:43)
11-Dec-2019 00:29:12         at java.lang.reflect.Method.invoke(Method.java:498)
11-Dec-2019 00:29:12         at org.junit.runners.model.FrameworkMethod$1.runReflectiveCall(FrameworkMethod.java:50)
11-Dec-2019 00:29:12         at org.junit.internal.runners.model.ReflectiveCallable.run(ReflectiveCallable.java:12)
11-Dec-2019 00:29:12         at org.junit.runners.model.FrameworkMethod.invokeExplosively(FrameworkMethod.java:47)
11-Dec-2019 00:29:12         at org.junit.internal.runners.statements.InvokeMethod.evaluate(InvokeMethod.java:17)
11-Dec-2019 00:29:12         at org.junit.internal.runners.statements.RunBefores.evaluate(RunBefores.java:26)
11-Dec-2019 00:29:12         at org.springframework.test.context.junit4.statements.RunBeforeTestMethodCallbacks.evaluate(RunBeforeTestMethodCallbacks.java:75)
11-Dec-2019 00:29:12         at org.springframework.test.context.junit4.statements.RunAfterTestMethodCallbacks.evaluate(RunAfterTestMethodCallbacks.java:86)
11-Dec-2019 00:29:12         at org.junit.rules.TestWatcher$1.evaluate(TestWatcher.java:55)
11-Dec-2019 00:29:12         at org.junit.rules.ExternalResource$1.evaluate(ExternalResource.java:48)
11-Dec-2019 00:29:12         at org.junit.rules.RunRules.evaluate(RunRules.java:20)
11-Dec-2019 00:29:12         at org.springframework.test.context.junit4.statements.SpringRepeat.evaluate(SpringRepeat.java:84)
11-Dec-2019 00:29:12         at org.junit.runners.ParentRunner.runLeaf(ParentRunner.java:325)
11-Dec-2019 00:29:12         at org.springframework.test.context.junit4.SpringJUnit4ClassRunner.runChild(SpringJUnit4ClassRunner.java:252)
11-Dec-2019 00:29:12         at org.springframework.test.context.junit4.SpringJUnit4ClassRunner.runChild(SpringJUnit4ClassRunner.java:94)
11-Dec-2019 00:29:12         at org.junit.runners.ParentRunner$3.run(ParentRunner.java:290)
11-Dec-2019 00:29:12         at org.junit.runners.ParentRunner$1.schedule(ParentRunner.java:71)
11-Dec-2019 00:29:12         at org.junit.runners.ParentRunner.runChildren(ParentRunner.java:288)
11-Dec-2019 00:29:12         at org.junit.runners.ParentRunner.access$000(ParentRunner.java:58)
11-Dec-2019 00:29:12         at org.junit.runners.ParentRunner$2.evaluate(ParentRunner.java:268)
11-Dec-2019 00:29:12         at org.springframework.test.context.junit4.statements.RunBeforeTestClassCallbacks.evaluate(RunBeforeTestClassCallbacks.java:61)
11-Dec-2019 00:29:12         at org.springframework.test.context.junit4.statements.RunAfterTestClassCallbacks.evaluate(RunAfterTestClassCallbacks.java:70)
11-Dec-2019 00:29:12         at org.junit.runners.ParentRunner.run(ParentRunner.java:363)
11-Dec-2019 00:29:12         at org.springframework.test.context.junit4.SpringJUnit4ClassRunner.run(SpringJUnit4ClassRunner.java:191)
11-Dec-2019 00:29:12         at org.apache.maven.surefire.junit4.JUnit4Provider.execute(JUnit4Provider.java:283)
11-Dec-2019 00:29:12         at org.apache.maven.surefire.junit4.JUnit4Provider.executeWithRerun(JUnit4Provider.java:173)
11-Dec-2019 00:29:12         at org.apache.maven.surefire.junit4.JUnit4Provider.executeTestSet(JUnit4Provider.java:153)
11-Dec-2019 00:29:12         at org.apache.maven.surefire.junit4.JUnit4Provider.invoke(JUnit4Provider.java:128)
11-Dec-2019 00:29:12         at org.apache.maven.surefire.booter.ForkedBooter.invokeProviderInSameClassLoader(ForkedBooter.java:203)
11-Dec-2019 00:29:12         at org.apache.maven.surefire.booter.ForkedBooter.runSuitesInProcess(ForkedBooter.java:155)
11-Dec-2019 00:29:12         at org.apache.maven.surefire.booter.ForkedBooter.main(ForkedBooter.java:103)
11-Dec-2019 00:29:12
11-Dec-2019 00:29:12 2019-12-11 00:29:12.702  INFO 15206 --- [           main] junit.logTestName                        : Finished Test manyToOneTest(org.springframework.cloud.dataflow.acceptance.test.NamedChannelTests)
11-Dec-2019 00:29:12 2019-12-11 00:29:12.702  INFO 15206 --- [           main] o.s.c.d.a.test.NamedChannelTests         : Destroy all streams
11-Dec-2019 00:29:12 Tests run: 4, Failures: 0, Errors: 3, Skipped: 1, Time elapsed: 0.195 sec <<< FAILURE! - in org.springframework.cloud.dataflow.acceptance.test.NamedChannelTests
11-Dec-2019 00:29:12 testDestination(org.springframework.cloud.dataflow.acceptance.test.NamedChannelTests)  Time elapsed: 0.033 sec  <<< ERROR!
11-Dec-2019 00:29:12 org.springframework.cloud.dataflow.rest.client.DataFlowClientException: I/O error on GET request for "http://localhost:7577/api": Connect to localhost:7577 [localhost/127.0.0.1, localhost/0:0:0:0:0:0:0:1] failed: Connection refused (Connection refused); nested exception is org.apache.http.conn.HttpHostConnectException: Connect to localhost:7577 [localhost/127.0.0.1, localhost/0:0:0:0:0:0:0:1] failed: Connection refused (Connection refused)
11-Dec-2019 00:29:12
11-Dec-2019 00:29:12         at org.springframework.cloud.dataflow.rest.client.VndErrorResponseErrorHandler.handleError(VndErrorResponseErrorHandler.java:63)
11-Dec-2019 00:29:12         at org.springframework.web.client.RestTemplate.handleResponse(RestTemplate.java:667)
11-Dec-2019 00:29:12         at org.springframework.web.client.RestTemplate.doExecute(RestTemplate.java:620)
11-Dec-2019 00:29:12         at org.springframework.web.client.RestTemplate.execute(RestTemplate.java:580)
11-Dec-2019 00:29:12         at org.springframework.web.client.RestTemplate.delete(RestTemplate.java:452)
11-Dec-2019 00:29:12         at org.springframework.cloud.dataflow.rest.client.StreamTemplate.destroyAll(StreamTemplate.java:147)
11-Dec-2019 00:29:12         at org.springframework.cloud.dataflow.acceptance.test.AbstractStreamTests$1.after(AbstractStreamTests.java:119)
11-Dec-2019 00:29:12         at org.junit.rules.ExternalResource$1.evaluate(ExternalResource.java:50)
11-Dec-2019 00:29:12         at org.junit.rules.RunRules.evaluate(RunRules.java:20)
11-Dec-2019 00:29:12         at org.springframework.test.context.junit4.statements.SpringRepeat.evaluate(SpringRepeat.java:84)
11-Dec-2019 00:29:12         at org.junit.runners.ParentRunner.runLeaf(ParentRunner.java:325)
11-Dec-2019 00:29:12         at org.springframework.test.context.junit4.SpringJUnit4ClassRunner.runChild(SpringJUnit4ClassRunner.java:252)
11-Dec-2019 00:29:12         at org.springframework.test.context.junit4.SpringJUnit4ClassRunner.runChild(SpringJUnit4ClassRunner.java:94)
11-Dec-2019 00:29:12         at org.junit.runners.ParentRunner$3.run(ParentRunner.java:290)
11-Dec-2019 00:29:12         at org.junit.runners.ParentRunner$1.schedule(ParentRunner.java:71)
11-Dec-2019 00:29:12         at org.junit.runners.ParentRunner.runChildren(ParentRunner.java:288)
11-Dec-2019 00:29:12         at org.junit.runners.ParentRunner.access$000(ParentRunner.java:58)
11-Dec-2019 00:29:12         at org.junit.runners.ParentRunner$2.evaluate(ParentRunner.java:268)
11-Dec-2019 00:29:12         at org.springframework.test.context.junit4.statements.RunBeforeTestClassCallbacks.evaluate(RunBeforeTestClassCallbacks.java:61)
11-Dec-2019 00:29:12         at org.springframework.test.context.junit4.statements.RunAfterTestClassCallbacks.evaluate(RunAfterTestClassCallbacks.java:70)
11-Dec-2019 00:29:12         at org.junit.runners.ParentRunner.run(ParentRunner.java:363)
11-Dec-2019 00:29:12         at org.springframework.test.context.junit4.SpringJUnit4ClassRunner.run(SpringJUnit4ClassRunner.java:191)
11-Dec-2019 00:29:12         at org.apache.maven.surefire.junit4.JUnit4Provider.execute(JUnit4Provider.java:283)
11-Dec-2019 00:29:12         at org.apache.maven.surefire.junit4.JUnit4Provider.executeWithRerun(JUnit4Provider.java:173)
11-Dec-2019 00:29:12         at org.apache.maven.surefire.junit4.JUnit4Provider.executeTestSet(JUnit4Provider.java:153)
11-Dec-2019 00:29:12         at org.apache.maven.surefire.junit4.JUnit4Provider.invoke(JUnit4Provider.java:128)
11-Dec-2019 00:29:12         at org.apache.maven.surefire.booter.ForkedBooter.invokeProviderInSameClassLoader(ForkedBooter.java:203)
11-Dec-2019 00:29:12         at org.apache.maven.surefire.booter.ForkedBooter.runSuitesInProcess(ForkedBooter.java:155)
11-Dec-2019 00:29:12         at org.apache.maven.surefire.booter.ForkedBooter.main(ForkedBooter.java:103)
11-Dec-2019 00:29:12
11-Dec-2019 00:29:12 testTap(org.springframework.cloud.dataflow.acceptance.test.NamedChannelTests)  Time elapsed: 0.033 sec  <<< ERROR!
11-Dec-2019 00:29:12 org.springframework.cloud.dataflow.rest.client.DataFlowClientException: I/O error on GET request for "http://localhost:7577/api": Connect to localhost:7577 [localhost/127.0.0.1, localhost/0:0:0:0:0:0:0:1] failed: Connection refused (Connection refused); nested exception is org.apache.http.conn.HttpHostConnectException: Connect to localhost:7577 [localhost/127.0.0.1, localhost/0:0:0:0:0:0:0:1] failed: Connection refused (Connection refused)
11-Dec-2019 00:29:12
11-Dec-2019 00:29:12         at org.springframework.cloud.dataflow.rest.client.VndErrorResponseErrorHandler.handleError(VndErrorResponseErrorHandler.java:63)
11-Dec-2019 00:29:12         at org.springframework.web.client.RestTemplate.handleResponse(RestTemplate.java:667)
11-Dec-2019 00:29:12         at org.springframework.web.client.RestTemplate.doExecute(RestTemplate.java:620)
11-Dec-2019 00:29:12         at org.springframework.web.client.RestTemplate.execute(RestTemplate.java:580)
11-Dec-2019 00:29:12         at org.springframework.web.client.RestTemplate.delete(RestTemplate.java:452)
11-Dec-2019 00:29:12         at org.springframework.cloud.dataflow.rest.client.StreamTemplate.destroyAll(StreamTemplate.java:147)
11-Dec-2019 00:29:12         at org.springframework.cloud.dataflow.acceptance.test.AbstractStreamTests$1.after(AbstractStreamTests.java:119)
11-Dec-2019 00:29:12         at org.junit.rules.ExternalResource$1.evaluate(ExternalResource.java:50)
11-Dec-2019 00:29:12         at org.junit.rules.RunRules.evaluate(RunRules.java:20)
11-Dec-2019 00:29:12         at org.springframework.test.context.junit4.statements.SpringRepeat.evaluate(SpringRepeat.java:84)
11-Dec-2019 00:29:12         at org.junit.runners.ParentRunner.runLeaf(ParentRunner.java:325)
11-Dec-2019 00:29:12         at org.springframework.test.context.junit4.SpringJUnit4ClassRunner.runChild(SpringJUnit4ClassRunner.java:252)
11-Dec-2019 00:29:12         at org.springframework.test.context.junit4.SpringJUnit4ClassRunner.runChild(SpringJUnit4ClassRunner.java:94)
11-Dec-2019 00:29:12         at org.junit.runners.ParentRunner$3.run(ParentRunner.java:290)
11-Dec-2019 00:29:12         at org.junit.runners.ParentRunner$1.schedule(ParentRunner.java:71)
11-Dec-2019 00:29:12         at org.junit.runners.ParentRunner.runChildren(ParentRunner.java:288)
11-Dec-2019 00:29:12         at org.junit.runners.ParentRunner.access$000(ParentRunner.java:58)
11-Dec-2019 00:29:12         at org.junit.runners.ParentRunner$2.evaluate(ParentRunner.java:268)
11-Dec-2019 00:29:12         at org.springframework.test.context.junit4.statements.RunBeforeTestClassCallbacks.evaluate(RunBeforeTestClassCallbacks.java:61)
11-Dec-2019 00:29:12         at org.springframework.test.context.junit4.statements.RunAfterTestClassCallbacks.evaluate(RunAfterTestClassCallbacks.java:70)
11-Dec-2019 00:29:12         at org.junit.runners.ParentRunner.run(ParentRunner.java:363)
11-Dec-2019 00:29:12         at org.springframework.test.context.junit4.SpringJUnit4ClassRunner.run(SpringJUnit4ClassRunner.java:191)
11-Dec-2019 00:29:12         at org.apache.maven.surefire.junit4.JUnit4Provider.execute(JUnit4Provider.java:283)
11-Dec-2019 00:29:12         at org.apache.maven.surefire.junit4.JUnit4Provider.executeWithRerun(JUnit4Provider.java:173)
11-Dec-2019 00:29:12         at org.apache.maven.surefire.junit4.JUnit4Provider.executeTestSet(JUnit4Provider.java:153)
11-Dec-2019 00:29:12         at org.apache.maven.surefire.junit4.JUnit4Provider.invoke(JUnit4Provider.java:128)
11-Dec-2019 00:29:12         at org.apache.maven.surefire.booter.ForkedBooter.invokeProviderInSameClassLoader(ForkedBooter.java:203)
11-Dec-2019 00:29:12         at org.apache.maven.surefire.booter.ForkedBooter.runSuitesInProcess(ForkedBooter.java:155)
11-Dec-2019 00:29:12         at org.apache.maven.surefire.booter.ForkedBooter.main(ForkedBooter.java:103)
11-Dec-2019 00:29:12
11-Dec-2019 00:29:12 manyToOneTest(org.springframework.cloud.dataflow.acceptance.test.NamedChannelTests)  Time elapsed: 0.046 sec  <<< ERROR!
11-Dec-2019 00:29:12 org.springframework.cloud.dataflow.rest.client.DataFlowClientException: I/O error on GET request for "http://localhost:7577/api": Connect to localhost:7577 [localhost/127.0.0.1, localhost/0:0:0:0:0:0:0:1] failed: Connection refused (Connection refused); nested exception is org.apache.http.conn.HttpHostConnectException: Connect to localhost:7577 [localhost/127.0.0.1, localhost/0:0:0:0:0:0:0:1] failed: Connection refused (Connection refused)
11-Dec-2019 00:29:12
11-Dec-2019 00:29:12         at org.springframework.cloud.dataflow.rest.client.VndErrorResponseErrorHandler.handleError(VndErrorResponseErrorHandler.java:63)
11-Dec-2019 00:29:12         at org.springframework.web.client.RestTemplate.handleResponse(RestTemplate.java:667)
11-Dec-2019 00:29:12         at org.springframework.web.client.RestTemplate.doExecute(RestTemplate.java:620)
11-Dec-2019 00:29:12         at org.springframework.web.client.RestTemplate.execute(RestTemplate.java:580)
11-Dec-2019 00:29:12         at org.springframework.web.client.RestTemplate.delete(RestTemplate.java:452)
11-Dec-2019 00:29:12         at org.springframework.cloud.dataflow.rest.client.StreamTemplate.destroyAll(StreamTemplate.java:147)
11-Dec-2019 00:29:12         at org.springframework.cloud.dataflow.acceptance.test.AbstractStreamTests$1.after(AbstractStreamTests.java:119)
11-Dec-2019 00:29:12         at org.junit.rules.ExternalResource$1.evaluate(ExternalResource.java:50)
11-Dec-2019 00:29:12         at org.junit.rules.RunRules.evaluate(RunRules.java:20)
11-Dec-2019 00:29:12         at org.springframework.test.context.junit4.statements.SpringRepeat.evaluate(SpringRepeat.java:84)
11-Dec-2019 00:29:12         at org.junit.runners.ParentRunner.runLeaf(ParentRunner.java:325)
11-Dec-2019 00:29:12         at org.springframework.test.context.junit4.SpringJUnit4ClassRunner.runChild(SpringJUnit4ClassRunner.java:252)
11-Dec-2019 00:29:12         at org.springframework.test.context.junit4.SpringJUnit4ClassRunner.runChild(SpringJUnit4ClassRunner.java:94)
11-Dec-2019 00:29:12         at org.junit.runners.ParentRunner$3.run(ParentRunner.java:290)
11-Dec-2019 00:29:12         at org.junit.runners.ParentRunner$1.schedule(ParentRunner.java:71)
11-Dec-2019 00:29:12         at org.junit.runners.ParentRunner.runChildren(ParentRunner.java:288)
11-Dec-2019 00:29:12         at org.junit.runners.ParentRunner.access$000(ParentRunner.java:58)
11-Dec-2019 00:29:12         at org.junit.runners.ParentRunner$2.evaluate(ParentRunner.java:268)
11-Dec-2019 00:29:12         at org.springframework.test.context.junit4.statements.RunBeforeTestClassCallbacks.evaluate(RunBeforeTestClassCallbacks.java:61)
11-Dec-2019 00:29:12         at org.springframework.test.context.junit4.statements.RunAfterTestClassCallbacks.evaluate(RunAfterTestClassCallbacks.java:70)
11-Dec-2019 00:29:12         at org.junit.runners.ParentRunner.run(ParentRunner.java:363)
11-Dec-2019 00:29:12         at org.springframework.test.context.junit4.SpringJUnit4ClassRunner.run(SpringJUnit4ClassRunner.java:191)
11-Dec-2019 00:29:12         at org.apache.maven.surefire.junit4.JUnit4Provider.execute(JUnit4Provider.java:283)
11-Dec-2019 00:29:12         at org.apache.maven.surefire.junit4.JUnit4Provider.executeWithRerun(JUnit4Provider.java:173)
11-Dec-2019 00:29:12         at org.apache.maven.surefire.junit4.JUnit4Provider.executeTestSet(JUnit4Provider.java:153)
11-Dec-2019 00:29:12         at org.apache.maven.surefire.junit4.JUnit4Provider.invoke(JUnit4Provider.java:128)
11-Dec-2019 00:29:12         at org.apache.maven.surefire.booter.ForkedBooter.invokeProviderInSameClassLoader(ForkedBooter.java:203)
11-Dec-2019 00:29:12         at org.apache.maven.surefire.booter.ForkedBooter.runSuitesInProcess(ForkedBooter.java:155)
11-Dec-2019 00:29:12         at org.apache.maven.surefire.booter.ForkedBooter.main(ForkedBooter.java:103)
11-Dec-2019 00:29:12
11-Dec-2019 00:29:12 Running org.springframework.cloud.dataflow.acceptance.test.util.PlatformHelperTests
11-Dec-2019 00:29:12 Tests run: 3, Failures: 0, Errors: 0, Skipped: 0, Time elapsed: 0.049 sec - in org.springframework.cloud.dataflow.acceptance.test.util.PlatformHelperTests
11-Dec-2019 00:29:12 Running org.springframework.cloud.dataflow.acceptance.test.util.ApplicationTests
11-Dec-2019 00:29:12 Tests run: 2, Failures: 0, Errors: 0, Skipped: 0, Time elapsed: 0.002 sec - in org.springframework.cloud.dataflow.acceptance.test.util.ApplicationTests
11-Dec-2019 00:29:12 2019-12-11 00:29:12.808  INFO 15206 --- [       Thread-6] o.s.c.support.GenericApplicationContext  : Closing org.springframework.context.support.GenericApplicationContext@1a1f5f71: startup date [Wed Dec 11 00:26:38 UTC 2019]; root of context hierarchy
11-Dec-2019 00:29:12
11-Dec-2019 00:29:12 Results :
11-Dec-2019 00:29:12
11-Dec-2019 00:29:12 Tests in error:
11-Dec-2019 00:29:12   HttpSourceTests.httpSourceTests » DataFlowClient I/O error on GET request for ...
11-Dec-2019 00:29:12   NamedChannelTests.manyToOneTest » DataFlowClient I/O error on GET request for ...
11-Dec-2019 00:29:12   NamedChannelTests.testDestination » DataFlowClient I/O error on GET request fo...
11-Dec-2019 00:29:12   NamedChannelTests.testTap » DataFlowClient I/O error on GET request for "http:...
11-Dec-2019 00:29:12   TickTockTests.tickTockTests » DataFlowClient I/O error on GET request for "htt...
11-Dec-2019 00:29:12   TickTockTests.tickTockTestsFromConfigServer » DataFlowClient I/O error on GET ...
11-Dec-2019 00:29:12   TickTockTests.tickTockUpdateRollbackTests » DataFlowClient I/O error on GET re...
11-Dec-2019 00:29:12   TransformTests.transformTests » DataFlowClient I/O error on GET request for "h...
11-Dec-2019 00:29:12   WoodChuckTests.testPartitioning » DataFlowClient I/O error on GET request for ...
11-Dec-2019 00:29:12
11-Dec-2019 00:29:12 Tests run: 22, Failures: 0, Errors: 9, Skipped: 3
11-Dec-2019 00:29:12
11-Dec-2019 00:29:12 [INFO] ------------------------------------------------------------------------
11-Dec-2019 00:29:12 [INFO] BUILD FAILURE
11-Dec-2019 00:29:12 [INFO] ------------------------------------------------------------------------
11-Dec-2019 00:29:12 [INFO] Total time: 02:41 min
11-Dec-2019 00:29:12 [INFO] Finished at: 2019-12-11T00:29:12+00:00
11-Dec-2019 00:29:13 [INFO] Final Memory: 55M/466M
11-Dec-2019 00:29:13 [INFO] ------------------------------------------------------------------------
11-Dec-2019 00:29:13 [ERROR] Failed to execute goal org.apache.maven.plugins:maven-surefire-plugin:2.18.1:test (default-test) on project spring-cloud-dataflow-acceptance-tests: There are test failures.
11-Dec-2019 00:29:13 [ERROR]
11-Dec-2019 00:29:13 [ERROR] Please refer to /opt/bamboo-home/xml-data/build-dir/SCDT-LOCAL20XSKIPPER20X-RABBIT/target/surefire-reports for the individual test results.
11-Dec-2019 00:29:13 [ERROR] -> [Help 1]
11-Dec-2019 00:29:13 [ERROR]
11-Dec-2019 00:29:13 [ERROR] To see the full stack trace of the errors, re-run Maven with the -e switch.
11-Dec-2019 00:29:13 [ERROR] Re-run Maven using the -X switch to enable full debug logging.
11-Dec-2019 00:29:13 [ERROR]
11-Dec-2019 00:29:13 [ERROR] For more information about the errors and possible solutions, please read the following articles:
11-Dec-2019 00:29:13 [ERROR] [Help 1] http://cwiki.apache.org/confluence/display/MAVEN/MojoFailureException
11-Dec-2019 00:29:13 Clean up, clean up, everybody everywhere; clean up clean up, everybody do your share!
11-Dec-2019 00:29:13 Clean up servers
11-Dec-2019 00:29:13 Killing process PID [15096]
11-Dec-2019 00:29:13 No stopped containers
11-Dec-2019 00:29:14 Stopping mysql_mysql_1 ...
11-Dec-2019 00:29:16
11-Dec-2019 00:29:16 Stopping mysql_mysql_1 ... done
11-Dec-2019 00:29:16 Removing mysql_mysql_1 ...
11-Dec-2019 00:29:16
11-Dec-2019 00:29:16 Removing mysql_mysql_1 ... done
11-Dec-2019 00:29:16 Going to remove mysql_mysql_1
11-Dec-2019 00:29:17 No stopped containers
11-Dec-2019 00:29:17
11-Dec-2019 00:29:17 Finished task 'Execute Acceptance Tests' with result: Success
11-Dec-2019 00:29:17 Starting task 'JUnit Parser' of type 'com.atlassian.bamboo.plugins.testresultparser:task.testresultparser.junit'
11-Dec-2019 00:29:17 Parsing test results under /opt/bamboo-home/xml-data/build-dir/SCDT-LOCAL20XSKIPPER20X-RABBIT...
11-Dec-2019 00:29:17 Failing task since 9 failing test cases were found.
11-Dec-2019 00:29:17 Finished task 'JUnit Parser' with result: Failed
11-Dec-2019 00:29:17 Starting task 'clean up' of type 'com.atlassian.bamboo.plugins.scripttask:task.builder.script'
11-Dec-2019 00:29:17
Beginning to execute external process for build 'Spring Cloud Data Flow Acceptance Tests - Local + SCDF-2.0.4.BS + Skipper 2.0.4.BS (12 am) - Run Data Flow Acceptance Tests for Rabbit #193 (SCDT-LOCAL20XSKIPPER20X-RABBIT-193)'
... running command line:
/opt/bamboo-home/temp/SCDT-LOCAL20XSKIPPER20X-RABBIT-193-ScriptBuildTask-6978287846324951692.sh
... in: /opt/bamboo-home/xml-data/build-dir/SCDT-LOCAL20XSKIPPER20X-RABBIT
... using extra environment variables:
bamboo_planRepository_1_branch=master
bamboo_********_username_password=********
bamboo_signing_store_password=********
bamboo_capability_system_builder_ant_Ant_1_9=/opt/ant-1.9
bamboo_capability_system_builder_ant_Ant_1_8=/opt/ant-1.8
bamboo_planRepository_1_branchDisplayName=master
bamboo_repository_274694331_git_username=spring-buildmaster
bamboo_artifactory_override_resolve_repo=libs-milestone
bamboo_capability_system_builder_node_Node_js_10_16=/opt/node-10.16/bin/node
bamboo_repository_revision_number=ccc77f664d11e18a3b7f2fa17f012d09d08432a9
bamboo_RIAK_BIN=/usr/sbin/riak
bamboo_buildKey=SCDT-LOCAL20XSKIPPER20X-RABBIT
bamboo_repository_274694331_branch_name=master
bamboo_ge_cache_username=ci
bamboo_bintray_password=********
bamboo_sonar_token_password=********
bamboo_shortJobName=Run Data Flow Acceptance Tests for Rabbit
bamboo_artifactory_override_resolver_password=********
bamboo_sonatype_token=RSJChaox
bamboo_capability_system_builder_gradle___gradlew=./gradlew
bamboo_buildResultsUrl=https://build.spring.io/browse/SCDT-LOCAL20XSKIPPER20X-RABBIT-193
bamboo_capability_system_builder_mvn3_Maven_3_3=/opt/maven-3.3
bamboo_capability_system_builder_mvn3_Maven_3_2=/opt/maven-3.2
bamboo_capability_system_builder_mvn3_Maven_3_1=/opt/maven-3.1
bamboo_planRepository_repositoryUrl=https://github.com/spring-cloud/spring-cloud-dataflow-acceptance-tests.git
bamboo_capability_system_builder_mvn3_Maven_3_6=/opt/maven-3.6
bamboo_agentId=286195722
bamboo_capability_system_builder_mvn3_Maven_3_5=/opt/maven-3.5
bamboo_capability_system_builder_mvn3_Maven_3_0=/opt/maven-3.0
bamboo_planRepository_revision=ccc77f664d11e18a3b7f2fa17f012d09d08432a9
bamboo_planRepository_previousRevision=ccc77f664d11e18a3b7f2fa17f012d09d08432a9
bamboo_capability_remote_build=true
bamboo_repository_branch_name=master
bamboo_sonatype_token_password=********
bamboo_sonatype_user=springsource
bamboo_repository_274694331_name=Git
bamboo_scdf_acceptance_tests_password=********
bamboo_APPLE_AC_PASSWORD=********
bamboo_repository_274694331_git_branch=master
bamboo_planRepository_branch=master
bamboo_capability_system_jdk_JDK_13=/opt/jdk-13
bamboo_planRepository_1_type=gitv2
bamboo_planRepository_branchName=master
bamboo_capability_system_jdk_JDK_12=/opt/jdk-12
bamboo_capability_system_builder_gradlew_gradlew=./
bamboo_capability_system_builder_ant_Ant_1_10=/opt/ant-1.10
bamboo_sonar_password=********
bamboo_hg_cache_directory=/opt/bamboo-home/xml-data/build-dir/_hg-repositories-cache
bamboo_planRepository_1_username=spring-buildmaster
bamboo_repository_274694331_git_repositoryUrl=https://github.com/spring-cloud/spring-cloud-dataflow-acceptance-tests.git
bamboo_planRepository_type=gitv2
bamboo_git_cache_directory=/opt/bamboo-home/xml-data/build-dir/_git-repositories-cache
bamboo_artifactory_username=buildmaster
bamboo_tmp_directory=/opt/bamboo-home/temp
bamboo_planKey=SCDT-LOCAL20XSKIPPER20X
bamboo_planRepository_username=spring-buildmaster
bamboo_JDK8_HOME=/opt/jdk-8
bamboo_repository_274694331_previous_revision_number=ccc77f664d11e18a3b7f2fa17f012d09d08432a9
bamboo_planRepository_1_branchName=master
bamboo_sonar_version=6.7.7
bamboo_sonar_jdbc_password=********
bamboo_bintray_api_key_password=********
bamboo_capability_system_jdk_JDK_1_11=/opt/jdk-11
bamboo_resultsUrl=https://build.spring.io/browse/SCDT-LOCAL20XSKIPPER20X-RABBIT-193
bamboo_APPLE_AC_USERNAME_PASSWORD=********
bamboo_capability_system_jdk_JDK_1_10=/opt/jdk-10
bamboo_build_working_directory=/opt/bamboo-home/xml-data/build-dir/SCDT-LOCAL20XSKIPPER20X-RABBIT
bamboo_planRepository_1_name=Git
bamboo_capability_system_os=ubuntu1804
bamboo_nexusPush_stagingProfile=buildmaster
bamboo_shortPlanName=Local + SCDF-2.0.4.BS + Skipper 2.0.4.BS (12 am)
bamboo_planRepository_name=Git
bamboo_buildNumber=193
bamboo_planName=Spring Cloud Data Flow Acceptance Tests - Local + SCDF-2.0.4.BS + Skipper 2.0.4.BS (12 am)
bamboo_JDK7_HOME=/opt/jdk-7
bamboo_build_commandline_com_atlassian_bamboo_plugins_scripttask_task_builder_script_7=/opt/bamboo-home/temp/SCDT-LOCAL20XSKIPPER20X-RABBIT-193-ScriptBuildTask-7047355786577207022.sh
bamboo_shortPlanKey=LOCAL20XSKIPPER20X
bamboo_shortJobKey=RABBIT
bamboo_artifactory_password=********
bamboo_buildTimeStamp=2019-12-11T00:20:57.246Z
bamboo_repository_previous_revision_number=ccc77f664d11e18a3b7f2fa17f012d09d08432a9
bamboo_sonar_username=buildmaster
bamboo_********_password=********
bamboo_repository_git_branch=master
bamboo_buildResultKey=SCDT-LOCAL20XSKIPPER20X-RABBIT-193
bamboo_nexusPush_close=true
bamboo_artifactory_override_resolver_username=buildmaster
bamboo_buildPlanName=Spring Cloud Data Flow Acceptance Tests - Local + SCDF-2.0.4.BS + Skipper 2.0.4.BS (12 am) - Run Data Flow Acceptance Tests for Rabbit
bamboo_repository_274694331_revision_number=ccc77f664d11e18a3b7f2fa17f012d09d08432a9
bamboo_planRepository_1_revision=ccc77f664d11e18a3b7f2fa17f012d09d08432a9
bamboo_repository_name=Git
bamboo_signing_key_password=********
bamboo_capability_system_builder_groovy_Groovy_2_5=/opt/groovy-2.5
bamboo_buildFailed=true
bamboo_capability_system_docker_executable=/usr/bin/docker
bamboo_capability_system_jdk_OpenJDK_7=/opt/jdk-7
bamboo_capability_system_builder_groovy_Groovy_2_4=/opt/groovy-2.4
bamboo_artifactory_override_deployer_username=buildmaster
bamboo_capability_system_builder_command_Bash=/bin/bash
bamboo_jobFailed=true
bamboo_agentWorkingDirectory=/opt/bamboo-home/xml-data/build-dir
bamboo_capability_system_git_executable=/usr/bin/git
bamboo_repository_git_username=spring-buildmaster
bamboo_planRepository_1_previousRevision=ccc77f664d11e18a3b7f2fa17f012d09d08432a9
bamboo_capability_os_family=unix
bamboo_planRepository_branchDisplayName=master
bamboo_capability_system_builder_maven_Artifactory_Maven_3_6=/opt/maven-3.6
bamboo_capability_system_builder_maven_Artifactory_Maven_3_5=/opt/maven-3.5
bamboo_capability_system_builder_maven_Artifactory_Maven_3_3=/opt/maven-3.3
bamboo_capability_system_builder_maven_Artifactory_Maven_3_2=/opt/maven-3.2
bamboo_s3_properties=/home/bamboo/tools/s3.properties
bamboo_capability_system_builder_maven_Artifactory_Maven_3_1=/opt/maven-3.1
bamboo_artifactory_override_deploy_repo=libs-snapshot-local
bamboo_capability_system_builder_maven_Artifactory_Maven_3_0=/opt/maven-3.0
bamboo_plan_storageTag=plan-274497908
bamboo_bintray_username_password=********
bamboo_repository_git_repositoryUrl=https://github.com/spring-cloud/spring-cloud-dataflow-acceptance-tests.git
bamboo_working_directory=/opt/bamboo-home/xml-data/build-dir/SCDT-LOCAL20XSKIPPER20X-RABBIT
bamboo_planRepository_1_repositoryUrl=https://github.com/spring-cloud/spring-cloud-dataflow-acceptance-tests.git
bamboo_capability_system_jdk_JDK_1_8=/opt/jdk-8
bamboo_artifactory_override_deployer_password=********
bamboo_capability_system_jdk_JDK_1_9=/opt/jdk-9
bamboo_capability_system_jdk_JDK_1_6=/opt/jdk-6
bamboo_sonatype_password=********
bamboo_capability_system_jdk_JDK_1_7=/opt/jdk-7
bamboo_sonar_ip=10.194.6.9
bamboo_ge_cache_password=********
11-Dec-2019 00:29:17 CLEANING UP RESOURCES AFTER RUNNING TESTS
11-Dec-2019 00:29:17 Environment variable JAVA_HOME must be set
11-Dec-2019 00:29:17 FINISHED CLEANING UP RESOURCES
11-Dec-2019 00:29:17 Finished task 'clean up' with result: Success
11-Dec-2019 00:29:17 Running post build plugin 'Docker Container Cleanup'
11-Dec-2019 00:29:17 Running post build plugin 'NCover Results Collector'
11-Dec-2019 00:29:17 Running post build plugin 'Artifactory Release Management Staging'
11-Dec-2019 00:29:17 Running post build plugin 'Artifactory Build Info Copier'
11-Dec-2019 00:29:17 Running post build plugin 'Artifactory Gradle Properties Info Copier'
11-Dec-2019 00:29:17 Running post build plugin 'Clover Results Collector'
11-Dec-2019 00:29:17 Running post build plugin 'npm Cache Cleanup'
11-Dec-2019 00:29:17 Running post build plugin 'Artifact Copier'
11-Dec-2019 00:29:17 Publishing an artifact: App and Server Logs
11-Dec-2019 00:29:17 Finished publishing of artifact Non required job artifact: [App and Server Logs], pattern: [**/*.log] anchored at: [local] in 27.34 ms
11-Dec-2019 00:29:17 Publishing an artifact: Test Results
11-Dec-2019 00:29:17 Finished publishing of artifact Non required job artifact: [Test Results], pattern: [**/target/surefire-reports/**/*.*] in 37.47 ms
11-Dec-2019 00:29:17 Successfully removed working directory at '/opt/bamboo-home/xml-data/build-dir/SCDT-LOCAL20XSKIPPER20X-RABBIT'
11-Dec-2019 00:29:17 Finalising the build...
11-Dec-2019 00:29:17 Stopping timer.
11-Dec-2019 00:29:17 Build SCDT-LOCAL20XSKIPPER20X-RABBIT-193 completed.
11-Dec-2019 00:29:17 Running on server: post build plugin 'NCover Results Collector'
11-Dec-2019 00:29:17 Running on server: post build plugin 'Build Hanging Detection Configuration'
11-Dec-2019 00:29:17 Running on server: post build plugin 'Bamboo project link creator'
11-Dec-2019 00:29:17 Running on server: post build plugin 'Clover Delta Calculator'
11-Dec-2019 00:29:17 Running on server: post build plugin 'Maven Dependencies Postprocessor'
11-Dec-2019 00:29:17 All post build plugins have finished
11-Dec-2019 00:29:17 Generating build results summary...
11-Dec-2019 00:29:17 Saving build results to disk...
11-Dec-2019 00:29:17 Logging substituted variables...
11-Dec-2019 00:29:17 Indexing build results...
11-Dec-2019 00:29:17 Finished building SCDT-LOCAL20XSKIPPER20X-RABBIT-193.