Build: #2 did not complete

Job: Run Data Flow Acceptance Tests for Rabbit did not complete

Stages & jobs

  1. Test Stage - Kafka

  2. Test Stage - Rabbit

Build log

The build generated 2,484 lines of output.The output is too long and has been truncated to the last 1,000 lines. Download or view full build log

06-Nov-2018 22:29:25         at org.apache.maven.surefire.junit4.JUnit4Provider.invoke(JUnit4Provider.java:128)
06-Nov-2018 22:29:25         at org.apache.maven.surefire.booter.ForkedBooter.invokeProviderInSameClassLoader(ForkedBooter.java:203)
06-Nov-2018 22:29:25         at org.apache.maven.surefire.booter.ForkedBooter.runSuitesInProcess(ForkedBooter.java:155)
06-Nov-2018 22:29:25         at org.apache.maven.surefire.booter.ForkedBooter.main(ForkedBooter.java:103)
06-Nov-2018 22:29:25 Caused by: org.springframework.beans.BeanInstantiationException: Failed to instantiate [org.springframework.cloud.dataflow.rest.client.DataFlowTemplate]: Factory method 'dataFlowTemplate' threw exception; nested exception is org.springframework.cloud.dataflow.rest.client.DataFlowClientException:
06-Nov-2018 22:29:25         at org.springframework.beans.factory.support.SimpleInstantiationStrategy.instantiate(SimpleInstantiationStrategy.java:189)
06-Nov-2018 22:29:25         at org.springframework.beans.factory.support.ConstructorResolver.instantiateUsingFactoryMethod(ConstructorResolver.java:588)
06-Nov-2018 22:29:25         ... 30 common frames omitted
06-Nov-2018 22:29:25 Caused by: org.springframework.cloud.dataflow.rest.client.DataFlowClientException:
06-Nov-2018 22:29:25         at org.springframework.cloud.dataflow.rest.client.VndErrorResponseErrorHandler.handleError(VndErrorResponseErrorHandler.java:63)
06-Nov-2018 22:29:25         at org.springframework.web.client.RestTemplate.handleResponse(RestTemplate.java:667)
06-Nov-2018 22:29:25         at org.springframework.web.client.RestTemplate.doExecute(RestTemplate.java:620)
06-Nov-2018 22:29:25         at org.springframework.web.client.RestTemplate.execute(RestTemplate.java:580)
06-Nov-2018 22:29:25         at org.springframework.web.client.RestTemplate.getForObject(RestTemplate.java:287)
06-Nov-2018 22:29:25         at org.springframework.cloud.dataflow.rest.client.AboutTemplate.get(AboutTemplate.java:44)
06-Nov-2018 22:29:25         at org.springframework.cloud.dataflow.rest.client.DataFlowTemplate.getVersion(DataFlowTemplate.java:244)
06-Nov-2018 22:29:25         at org.springframework.cloud.dataflow.rest.client.DataFlowTemplate.<init>(DataFlowTemplate.java:191)
06-Nov-2018 22:29:25         at org.springframework.cloud.dataflow.rest.client.DataFlowTemplate.<init>(DataFlowTemplate.java:150)
06-Nov-2018 22:29:25         at org.springframework.cloud.dataflow.acceptance.test.util.SchedulerRule$Config.dataFlowTemplate(SchedulerRule.java:75)
06-Nov-2018 22:29:25         at org.springframework.cloud.dataflow.acceptance.test.util.SchedulerRule$Config$$EnhancerBySpringCGLIB$$7daa59ec.CGLIB$dataFlowTemplate$0(<generated>)
06-Nov-2018 22:29:25         at org.springframework.cloud.dataflow.acceptance.test.util.SchedulerRule$Config$$EnhancerBySpringCGLIB$$7daa59ec$$FastClassBySpringCGLIB$$44671ca8.invoke(<generated>)
06-Nov-2018 22:29:25         at org.springframework.cglib.proxy.MethodProxy.invokeSuper(MethodProxy.java:228)
06-Nov-2018 22:29:25         at org.springframework.context.annotation.ConfigurationClassEnhancer$BeanMethodInterceptor.intercept(ConfigurationClassEnhancer.java:356)
06-Nov-2018 22:29:25         at org.springframework.cloud.dataflow.acceptance.test.util.SchedulerRule$Config$$EnhancerBySpringCGLIB$$7daa59ec.dataFlowTemplate(<generated>)
06-Nov-2018 22:29:25         at sun.reflect.NativeMethodAccessorImpl.invoke0(Native Method)
06-Nov-2018 22:29:25         at sun.reflect.NativeMethodAccessorImpl.invoke(NativeMethodAccessorImpl.java:62)
06-Nov-2018 22:29:25         at sun.reflect.DelegatingMethodAccessorImpl.invoke(DelegatingMethodAccessorImpl.java:43)
06-Nov-2018 22:29:25         at java.lang.reflect.Method.invoke(Method.java:498)
06-Nov-2018 22:29:25         at org.springframework.beans.factory.support.SimpleInstantiationStrategy.instantiate(SimpleInstantiationStrategy.java:162)
06-Nov-2018 22:29:25         ... 31 common frames omitted
06-Nov-2018 22:29:25
06-Nov-2018 22:29:25 2018-11-06 22:29:25.930 ERROR 6439 --- [           main] o.s.c.d.a.test.util.SchedulerRule        : SCHEDULER IS NOT AVAILABLE, SKIPPING TESTS
06-Nov-2018 22:29:25
06-Nov-2018 22:29:25 org.springframework.beans.factory.BeanCreationException: Error creating bean with name 'dataFlowTemplate' defined in org.springframework.cloud.dataflow.acceptance.test.util.SchedulerRule$Config: Bean instantiation via factory method failed; nested exception is org.springframework.beans.BeanInstantiationException: Failed to instantiate [org.springframework.cloud.dataflow.rest.client.DataFlowTemplate]: Factory method 'dataFlowTemplate' threw exception; nested exception is org.springframework.cloud.dataflow.rest.client.DataFlowClientException:
06-Nov-2018 22:29:25         at org.springframework.beans.factory.support.ConstructorResolver.instantiateUsingFactoryMethod(ConstructorResolver.java:599)
06-Nov-2018 22:29:25         at org.springframework.beans.factory.support.AbstractAutowireCapableBeanFactory.instantiateUsingFactoryMethod(AbstractAutowireCapableBeanFactory.java:1128)
06-Nov-2018 22:29:25         at org.springframework.beans.factory.support.AbstractAutowireCapableBeanFactory.createBeanInstance(AbstractAutowireCapableBeanFactory.java:1023)
06-Nov-2018 22:29:25         at org.springframework.beans.factory.support.AbstractAutowireCapableBeanFactory.doCreateBean(AbstractAutowireCapableBeanFactory.java:510)
06-Nov-2018 22:29:25         at org.springframework.beans.factory.support.AbstractAutowireCapableBeanFactory.createBean(AbstractAutowireCapableBeanFactory.java:482)
06-Nov-2018 22:29:25         at org.springframework.beans.factory.support.AbstractBeanFactory$1.getObject(AbstractBeanFactory.java:306)
06-Nov-2018 22:29:25         at org.springframework.beans.factory.support.DefaultSingletonBeanRegistry.getSingleton(DefaultSingletonBeanRegistry.java:230)
06-Nov-2018 22:29:25         at org.springframework.beans.factory.support.AbstractBeanFactory.doGetBean(AbstractBeanFactory.java:302)
06-Nov-2018 22:29:25         at org.springframework.beans.factory.support.AbstractBeanFactory.getBean(AbstractBeanFactory.java:197)
06-Nov-2018 22:29:25         at org.springframework.beans.factory.support.DefaultListableBeanFactory.preInstantiateSingletons(DefaultListableBeanFactory.java:751)
06-Nov-2018 22:29:25         at org.springframework.context.support.AbstractApplicationContext.finishBeanFactoryInitialization(AbstractApplicationContext.java:861)
06-Nov-2018 22:29:25         at org.springframework.context.support.AbstractApplicationContext.refresh(AbstractApplicationContext.java:541)
06-Nov-2018 22:29:25         at org.springframework.boot.SpringApplication.refresh(SpringApplication.java:761)
06-Nov-2018 22:29:25         at org.springframework.boot.SpringApplication.refreshContext(SpringApplication.java:371)
06-Nov-2018 22:29:25         at org.springframework.boot.SpringApplication.run(SpringApplication.java:315)
06-Nov-2018 22:29:25         at org.springframework.boot.builder.SpringApplicationBuilder.run(SpringApplicationBuilder.java:134)
06-Nov-2018 22:29:25         at org.springframework.cloud.dataflow.acceptance.test.util.SchedulerRule.obtainResource(SchedulerRule.java:53)
06-Nov-2018 22:29:25         at org.springframework.cloud.scheduler.spi.junit.AbstractExternalResourceTestSupport.apply(AbstractExternalResourceTestSupport.java:58)
06-Nov-2018 22:29:25         at org.junit.rules.RunRules.applyAll(RunRules.java:26)
06-Nov-2018 22:29:25         at org.junit.rules.RunRules.<init>(RunRules.java:15)
06-Nov-2018 22:29:25         at org.junit.runners.ParentRunner.withClassRules(ParentRunner.java:245)
06-Nov-2018 22:29:25         at org.junit.runners.ParentRunner.classBlock(ParentRunner.java:194)
06-Nov-2018 22:29:25         at org.junit.runners.ParentRunner.run(ParentRunner.java:362)
06-Nov-2018 22:29:25         at org.springframework.test.context.junit4.SpringJUnit4ClassRunner.run(SpringJUnit4ClassRunner.java:191)
06-Nov-2018 22:29:25         at org.apache.maven.surefire.junit4.JUnit4Provider.execute(JUnit4Provider.java:283)
06-Nov-2018 22:29:25         at org.apache.maven.surefire.junit4.JUnit4Provider.executeWithRerun(JUnit4Provider.java:173)
06-Nov-2018 22:29:25         at org.apache.maven.surefire.junit4.JUnit4Provider.executeTestSet(JUnit4Provider.java:153)
06-Nov-2018 22:29:25         at org.apache.maven.surefire.junit4.JUnit4Provider.invoke(JUnit4Provider.java:128)
06-Nov-2018 22:29:25         at org.apache.maven.surefire.booter.ForkedBooter.invokeProviderInSameClassLoader(ForkedBooter.java:203)
06-Nov-2018 22:29:25         at org.apache.maven.surefire.booter.ForkedBooter.runSuitesInProcess(ForkedBooter.java:155)
06-Nov-2018 22:29:25         at org.apache.maven.surefire.booter.ForkedBooter.main(ForkedBooter.java:103)
06-Nov-2018 22:29:25 Caused by: org.springframework.beans.BeanInstantiationException: Failed to instantiate [org.springframework.cloud.dataflow.rest.client.DataFlowTemplate]: Factory method 'dataFlowTemplate' threw exception; nested exception is org.springframework.cloud.dataflow.rest.client.DataFlowClientException:
06-Nov-2018 22:29:25         at org.springframework.beans.factory.support.SimpleInstantiationStrategy.instantiate(SimpleInstantiationStrategy.java:189)
06-Nov-2018 22:29:25         at org.springframework.beans.factory.support.ConstructorResolver.instantiateUsingFactoryMethod(ConstructorResolver.java:588)
06-Nov-2018 22:29:25         ... 30 common frames omitted
06-Nov-2018 22:29:25 Caused by: org.springframework.cloud.dataflow.rest.client.DataFlowClientException:
06-Nov-2018 22:29:25         at org.springframework.cloud.dataflow.rest.client.VndErrorResponseErrorHandler.handleError(VndErrorResponseErrorHandler.java:63)
06-Nov-2018 22:29:25         at org.springframework.web.client.RestTemplate.handleResponse(RestTemplate.java:667)
06-Nov-2018 22:29:25         at org.springframework.web.client.RestTemplate.doExecute(RestTemplate.java:620)
06-Nov-2018 22:29:25         at org.springframework.web.client.RestTemplate.execute(RestTemplate.java:580)
06-Nov-2018 22:29:25         at org.springframework.web.client.RestTemplate.getForObject(RestTemplate.java:287)
06-Nov-2018 22:29:25         at org.springframework.cloud.dataflow.rest.client.AboutTemplate.get(AboutTemplate.java:44)
06-Nov-2018 22:29:25         at org.springframework.cloud.dataflow.rest.client.DataFlowTemplate.getVersion(DataFlowTemplate.java:244)
06-Nov-2018 22:29:25         at org.springframework.cloud.dataflow.rest.client.DataFlowTemplate.<init>(DataFlowTemplate.java:191)
06-Nov-2018 22:29:25         at org.springframework.cloud.dataflow.rest.client.DataFlowTemplate.<init>(DataFlowTemplate.java:150)
06-Nov-2018 22:29:25         at org.springframework.cloud.dataflow.acceptance.test.util.SchedulerRule$Config.dataFlowTemplate(SchedulerRule.java:75)
06-Nov-2018 22:29:25         at org.springframework.cloud.dataflow.acceptance.test.util.SchedulerRule$Config$$EnhancerBySpringCGLIB$$7daa59ec.CGLIB$dataFlowTemplate$0(<generated>)
06-Nov-2018 22:29:25         at org.springframework.cloud.dataflow.acceptance.test.util.SchedulerRule$Config$$EnhancerBySpringCGLIB$$7daa59ec$$FastClassBySpringCGLIB$$44671ca8.invoke(<generated>)
06-Nov-2018 22:29:25         at org.springframework.cglib.proxy.MethodProxy.invokeSuper(MethodProxy.java:228)
06-Nov-2018 22:29:25         at org.springframework.context.annotation.ConfigurationClassEnhancer$BeanMethodInterceptor.intercept(ConfigurationClassEnhancer.java:356)
06-Nov-2018 22:29:25         at org.springframework.cloud.dataflow.acceptance.test.util.SchedulerRule$Config$$EnhancerBySpringCGLIB$$7daa59ec.dataFlowTemplate(<generated>)
06-Nov-2018 22:29:25         at sun.reflect.NativeMethodAccessorImpl.invoke0(Native Method)
06-Nov-2018 22:29:25         at sun.reflect.NativeMethodAccessorImpl.invoke(NativeMethodAccessorImpl.java:62)
06-Nov-2018 22:29:25         at sun.reflect.DelegatingMethodAccessorImpl.invoke(DelegatingMethodAccessorImpl.java:43)
06-Nov-2018 22:29:25         at java.lang.reflect.Method.invoke(Method.java:498)
06-Nov-2018 22:29:25         at org.springframework.beans.factory.support.SimpleInstantiationStrategy.instantiate(SimpleInstantiationStrategy.java:162)
06-Nov-2018 22:29:25         ... 31 common frames omitted
06-Nov-2018 22:29:25
06-Nov-2018 22:29:25 Tests run: 1, Failures: 0, Errors: 0, Skipped: 1, Time elapsed: 0.554 sec - in org.springframework.cloud.dataflow.acceptance.test.SchedulerTests
06-Nov-2018 22:29:25 Running org.springframework.cloud.dataflow.acceptance.test.NamedChannelTests
06-Nov-2018 22:29:25 2018-11-06 22:29:25.933  INFO 6439 --- [           main] .b.t.c.SpringBootTestContextBootstrapper : Neither @ContextConfiguration nor @ContextHierarchy found for test class [org.springframework.cloud.dataflow.acceptance.test.NamedChannelTests], using SpringBootContextLoader
06-Nov-2018 22:29:25 2018-11-06 22:29:25.944  INFO 6439 --- [           main] .b.t.c.SpringBootTestContextBootstrapper : Loaded default TestExecutionListener class names from location [META-INF/spring.factories]: [org.springframework.boot.test.mock.mockito.MockitoTestExecutionListener, org.springframework.boot.test.mock.mockito.ResetMocksTestExecutionListener, org.springframework.boot.test.autoconfigure.restdocs.RestDocsTestExecutionListener, org.springframework.boot.test.autoconfigure.web.client.MockRestServiceServerResetTestExecutionListener, org.springframework.boot.test.autoconfigure.web.servlet.MockMvcPrintOnlyOnFailureTestExecutionListener, org.springframework.boot.test.autoconfigure.web.servlet.WebDriverTestExecutionListener, org.springframework.test.context.web.ServletTestExecutionListener, org.springframework.test.context.support.DirtiesContextBeforeModesTestExecutionListener, org.springframework.test.context.support.DependencyInjectionTestExecutionListener, org.springframework.test.context.support.DirtiesContextTestExecutionListener, org.springframework.test.context.transaction.TransactionalTestExecutionListener, org.springframework.test.context.jdbc.SqlScriptsTestExecutionListener]
06-Nov-2018 22:29:25 2018-11-06 22:29:25.951  INFO 6439 --- [           main] .b.t.c.SpringBootTestContextBootstrapper : Using TestExecutionListeners: [org.springframework.test.context.web.ServletTestExecutionListener@748a654a, org.springframework.test.context.support.DirtiesContextBeforeModesTestExecutionListener@1d8b0500, org.springframework.boot.test.autoconfigure.SpringBootDependencyInjectionTestExecutionListener@76544c0a, org.springframework.test.context.support.DirtiesContextTestExecutionListener@428bdd72, org.springframework.test.context.transaction.TransactionalTestExecutionListener@650c405c, org.springframework.test.context.jdbc.SqlScriptsTestExecutionListener@20eaeaf8, org.springframework.boot.test.autoconfigure.restdocs.RestDocsTestExecutionListener@748ac6f3, org.springframework.boot.test.autoconfigure.web.servlet.MockMvcPrintOnlyOnFailureTestExecutionListener@68f6e55d, org.springframework.boot.test.mock.mockito.ResetMocksTestExecutionListener@6fff46bf, org.springframework.boot.test.autoconfigure.web.client.MockRestServiceServerResetTestExecutionListener@1835dc92, org.springframework.boot.test.autoconfigure.web.servlet.WebDriverTestExecutionListener@3aaa3c39, org.springframework.boot.test.mock.mockito.MockitoTestExecutionListener@65a9ea3c]
06-Nov-2018 22:29:26
06-Nov-2018 22:29:26
06-Nov-2018 22:29:26
06-Nov-2018 22:29:26 =========================
06-Nov-2018 22:29:26 AUTO-CONFIGURATION REPORT
06-Nov-2018 22:29:26 =========================
06-Nov-2018 22:29:26
06-Nov-2018 22:29:26
06-Nov-2018 22:29:26 Positive matches:
06-Nov-2018 22:29:26 -----------------
06-Nov-2018 22:29:26
06-Nov-2018 22:29:26    RedisAutoConfiguration matched
06-Nov-2018 22:29:26       - @ConditionalOnClass found required classes 'org.springframework.data.redis.connection.jedis.JedisConnection', 'org.springframework.data.redis.core.RedisOperations', 'redis.clients.jedis.Jedis' (OnClassCondition)
06-Nov-2018 22:29:26
06-Nov-2018 22:29:26    RedisAutoConfiguration.RedisConfiguration#redisTemplate matched
06-Nov-2018 22:29:26       - @ConditionalOnMissingBean (names: redisTemplate; SearchStrategy: all) did not find any beans (OnBeanCondition)
06-Nov-2018 22:29:26
06-Nov-2018 22:29:26    RedisAutoConfiguration.RedisConfiguration#stringRedisTemplate matched
06-Nov-2018 22:29:26       - @ConditionalOnMissingBean (types: org.springframework.data.redis.core.StringRedisTemplate; SearchStrategy: all) did not find any beans (OnBeanCondition)
06-Nov-2018 22:29:26
06-Nov-2018 22:29:26    RedisAutoConfiguration.RedisConnectionConfiguration matched
06-Nov-2018 22:29:26       - @ConditionalOnClass found required class 'org.apache.commons.pool2.impl.GenericObjectPool' (OnClassCondition)
06-Nov-2018 22:29:26
06-Nov-2018 22:29:26    RedisAutoConfiguration.RedisConnectionConfiguration#redisConnectionFactory matched
06-Nov-2018 22:29:26       - @ConditionalOnMissingBean (types: org.springframework.data.redis.connection.RedisConnectionFactory; SearchStrategy: all) did not find any beans (OnBeanCondition)
06-Nov-2018 22:29:26
06-Nov-2018 22:29:26
06-Nov-2018 22:29:26 Negative matches:
06-Nov-2018 22:29:26 -----------------
06-Nov-2018 22:29:26
06-Nov-2018 22:29:26
06-Nov-2018 22:29:26 Exclusions:
06-Nov-2018 22:29:26 -----------
06-Nov-2018 22:29:26
06-Nov-2018 22:29:26     None
06-Nov-2018 22:29:26
06-Nov-2018 22:29:26
06-Nov-2018 22:29:26 Unconditional classes:
06-Nov-2018 22:29:26 ----------------------
06-Nov-2018 22:29:26
06-Nov-2018 22:29:26     None
06-Nov-2018 22:29:26
06-Nov-2018 22:29:26
06-Nov-2018 22:29:26
06-Nov-2018 22:29:26 2018-11-06 22:29:26.010 ERROR 6439 --- [           main] o.s.test.context.TestContextManager      : Caught exception while allowing TestExecutionListener [org.springframework.boot.test.autoconfigure.SpringBootDependencyInjectionTestExecutionListener@76544c0a] to prepare test instance [org.springframework.cloud.dataflow.acceptance.test.NamedChannelTests@2db1b657]
06-Nov-2018 22:29:26
06-Nov-2018 22:29:26 org.springframework.beans.factory.BeanCreationException: Error creating bean with name 'org.springframework.cloud.dataflow.acceptance.test.NamedChannelTests': Invocation of init method failed; nested exception is org.springframework.cloud.dataflow.rest.client.DataFlowClientException:
06-Nov-2018 22:29:26         at org.springframework.beans.factory.support.AbstractAutowireCapableBeanFactory.initializeBean(AbstractAutowireCapableBeanFactory.java:1583)
06-Nov-2018 22:29:26         at org.springframework.beans.factory.support.AbstractAutowireCapableBeanFactory.initializeBean(AbstractAutowireCapableBeanFactory.java:399)
06-Nov-2018 22:29:26         at org.springframework.test.context.support.DependencyInjectionTestExecutionListener.injectDependencies(DependencyInjectionTestExecutionListener.java:119)
06-Nov-2018 22:29:26         at org.springframework.test.context.support.DependencyInjectionTestExecutionListener.prepareTestInstance(DependencyInjectionTestExecutionListener.java:83)
06-Nov-2018 22:29:26         at org.springframework.boot.test.autoconfigure.SpringBootDependencyInjectionTestExecutionListener.prepareTestInstance(SpringBootDependencyInjectionTestExecutionListener.java:44)
06-Nov-2018 22:29:26         at org.springframework.test.context.TestContextManager.prepareTestInstance(TestContextManager.java:230)
06-Nov-2018 22:29:26         at org.springframework.test.context.junit4.SpringJUnit4ClassRunner.createTest(SpringJUnit4ClassRunner.java:228)
06-Nov-2018 22:29:26         at org.springframework.test.context.junit4.SpringJUnit4ClassRunner$1.runReflectiveCall(SpringJUnit4ClassRunner.java:287)
06-Nov-2018 22:29:26         at org.junit.internal.runners.model.ReflectiveCallable.run(ReflectiveCallable.java:12)
06-Nov-2018 22:29:26         at org.springframework.test.context.junit4.SpringJUnit4ClassRunner.methodBlock(SpringJUnit4ClassRunner.java:289)
06-Nov-2018 22:29:26         at org.springframework.test.context.junit4.SpringJUnit4ClassRunner.runChild(SpringJUnit4ClassRunner.java:247)
06-Nov-2018 22:29:26         at org.springframework.test.context.junit4.SpringJUnit4ClassRunner.runChild(SpringJUnit4ClassRunner.java:94)
06-Nov-2018 22:29:26         at org.junit.runners.ParentRunner$3.run(ParentRunner.java:290)
06-Nov-2018 22:29:26         at org.junit.runners.ParentRunner$1.schedule(ParentRunner.java:71)
06-Nov-2018 22:29:26         at org.junit.runners.ParentRunner.runChildren(ParentRunner.java:288)
06-Nov-2018 22:29:26         at org.junit.runners.ParentRunner.access$000(ParentRunner.java:58)
06-Nov-2018 22:29:26         at org.junit.runners.ParentRunner$2.evaluate(ParentRunner.java:268)
06-Nov-2018 22:29:26         at org.springframework.test.context.junit4.statements.RunBeforeTestClassCallbacks.evaluate(RunBeforeTestClassCallbacks.java:61)
06-Nov-2018 22:29:26         at org.springframework.test.context.junit4.statements.RunAfterTestClassCallbacks.evaluate(RunAfterTestClassCallbacks.java:70)
06-Nov-2018 22:29:26         at org.junit.runners.ParentRunner.run(ParentRunner.java:363)
06-Nov-2018 22:29:26         at org.springframework.test.context.junit4.SpringJUnit4ClassRunner.run(SpringJUnit4ClassRunner.java:191)
06-Nov-2018 22:29:26         at org.apache.maven.surefire.junit4.JUnit4Provider.execute(JUnit4Provider.java:283)
06-Nov-2018 22:29:26         at org.apache.maven.surefire.junit4.JUnit4Provider.executeWithRerun(JUnit4Provider.java:173)
06-Nov-2018 22:29:26         at org.apache.maven.surefire.junit4.JUnit4Provider.executeTestSet(JUnit4Provider.java:153)
06-Nov-2018 22:29:26         at org.apache.maven.surefire.junit4.JUnit4Provider.invoke(JUnit4Provider.java:128)
06-Nov-2018 22:29:26         at org.apache.maven.surefire.booter.ForkedBooter.invokeProviderInSameClassLoader(ForkedBooter.java:203)
06-Nov-2018 22:29:26         at org.apache.maven.surefire.booter.ForkedBooter.runSuitesInProcess(ForkedBooter.java:155)
06-Nov-2018 22:29:26         at org.apache.maven.surefire.booter.ForkedBooter.main(ForkedBooter.java:103)
06-Nov-2018 22:29:26 Caused by: org.springframework.cloud.dataflow.rest.client.DataFlowClientException:
06-Nov-2018 22:29:26         at org.springframework.cloud.dataflow.rest.client.VndErrorResponseErrorHandler.handleError(VndErrorResponseErrorHandler.java:63)
06-Nov-2018 22:29:26         at org.springframework.web.client.RestTemplate.handleResponse(RestTemplate.java:667)
06-Nov-2018 22:29:26         at org.springframework.web.client.RestTemplate.doExecute(RestTemplate.java:620)
06-Nov-2018 22:29:26         at org.springframework.web.client.RestTemplate.execute(RestTemplate.java:580)
06-Nov-2018 22:29:26         at org.springframework.web.client.RestTemplate.getForObject(RestTemplate.java:287)
06-Nov-2018 22:29:26         at org.springframework.cloud.dataflow.rest.client.AboutTemplate.get(AboutTemplate.java:44)
06-Nov-2018 22:29:26         at org.springframework.cloud.dataflow.rest.client.DataFlowTemplate.getVersion(DataFlowTemplate.java:244)
06-Nov-2018 22:29:26         at org.springframework.cloud.dataflow.rest.client.DataFlowTemplate.<init>(DataFlowTemplate.java:191)
06-Nov-2018 22:29:26         at org.springframework.cloud.dataflow.rest.client.DataFlowTemplate.<init>(DataFlowTemplate.java:150)
06-Nov-2018 22:29:26         at org.springframework.cloud.dataflow.acceptance.test.AbstractStreamTests.afterPropertiesSet(AbstractStreamTests.java:126)
06-Nov-2018 22:29:26         at org.springframework.beans.factory.support.AbstractAutowireCapableBeanFactory.invokeInitMethods(AbstractAutowireCapableBeanFactory.java:1642)
06-Nov-2018 22:29:26         at org.springframework.beans.factory.support.AbstractAutowireCapableBeanFactory.initializeBean(AbstractAutowireCapableBeanFactory.java:1579)
06-Nov-2018 22:29:26         ... 27 common frames omitted
06-Nov-2018 22:29:26
06-Nov-2018 22:29:26
06-Nov-2018 22:29:26
06-Nov-2018 22:29:26
06-Nov-2018 22:29:26 =========================
06-Nov-2018 22:29:26 AUTO-CONFIGURATION REPORT
06-Nov-2018 22:29:26 =========================
06-Nov-2018 22:29:26
06-Nov-2018 22:29:26
06-Nov-2018 22:29:26 Positive matches:
06-Nov-2018 22:29:26 -----------------
06-Nov-2018 22:29:26
06-Nov-2018 22:29:26    RedisAutoConfiguration matched
06-Nov-2018 22:29:26       - @ConditionalOnClass found required classes 'org.springframework.data.redis.connection.jedis.JedisConnection', 'org.springframework.data.redis.core.RedisOperations', 'redis.clients.jedis.Jedis' (OnClassCondition)
06-Nov-2018 22:29:26
06-Nov-2018 22:29:26    RedisAutoConfiguration.RedisConfiguration#redisTemplate matched
06-Nov-2018 22:29:26       - @ConditionalOnMissingBean (names: redisTemplate; SearchStrategy: all) did not find any beans (OnBeanCondition)
06-Nov-2018 22:29:26
06-Nov-2018 22:29:26    RedisAutoConfiguration.RedisConfiguration#stringRedisTemplate matched
06-Nov-2018 22:29:26       - @ConditionalOnMissingBean (types: org.springframework.data.redis.core.StringRedisTemplate; SearchStrategy: all) did not find any beans (OnBeanCondition)
06-Nov-2018 22:29:26
06-Nov-2018 22:29:26    RedisAutoConfiguration.RedisConnectionConfiguration matched
06-Nov-2018 22:29:26       - @ConditionalOnClass found required class 'org.apache.commons.pool2.impl.GenericObjectPool' (OnClassCondition)
06-Nov-2018 22:29:26
06-Nov-2018 22:29:26    RedisAutoConfiguration.RedisConnectionConfiguration#redisConnectionFactory matched
06-Nov-2018 22:29:26       - @ConditionalOnMissingBean (types: org.springframework.data.redis.connection.RedisConnectionFactory; SearchStrategy: all) did not find any beans (OnBeanCondition)
06-Nov-2018 22:29:26
06-Nov-2018 22:29:26
06-Nov-2018 22:29:26 Negative matches:
06-Nov-2018 22:29:26 -----------------
06-Nov-2018 22:29:26
06-Nov-2018 22:29:26
06-Nov-2018 22:29:26 Exclusions:
06-Nov-2018 22:29:26 -----------
06-Nov-2018 22:29:26
06-Nov-2018 22:29:26     None
06-Nov-2018 22:29:26
06-Nov-2018 22:29:26
06-Nov-2018 22:29:26 Unconditional classes:
06-Nov-2018 22:29:26 ----------------------
06-Nov-2018 22:29:26
06-Nov-2018 22:29:26     None
06-Nov-2018 22:29:26
06-Nov-2018 22:29:26
06-Nov-2018 22:29:26
06-Nov-2018 22:29:26 2018-11-06 22:29:26.097 ERROR 6439 --- [           main] o.s.test.context.TestContextManager      : Caught exception while allowing TestExecutionListener [org.springframework.boot.test.autoconfigure.SpringBootDependencyInjectionTestExecutionListener@76544c0a] to prepare test instance [org.springframework.cloud.dataflow.acceptance.test.NamedChannelTests@7e351d7]
06-Nov-2018 22:29:26
06-Nov-2018 22:29:26 org.springframework.beans.factory.BeanCreationException: Error creating bean with name 'org.springframework.cloud.dataflow.acceptance.test.NamedChannelTests': Invocation of init method failed; nested exception is org.springframework.cloud.dataflow.rest.client.DataFlowClientException:
06-Nov-2018 22:29:26         at org.springframework.beans.factory.support.AbstractAutowireCapableBeanFactory.initializeBean(AbstractAutowireCapableBeanFactory.java:1583)
06-Nov-2018 22:29:26         at org.springframework.beans.factory.support.AbstractAutowireCapableBeanFactory.initializeBean(AbstractAutowireCapableBeanFactory.java:399)
06-Nov-2018 22:29:26         at org.springframework.test.context.support.DependencyInjectionTestExecutionListener.injectDependencies(DependencyInjectionTestExecutionListener.java:119)
06-Nov-2018 22:29:26         at org.springframework.test.context.support.DependencyInjectionTestExecutionListener.prepareTestInstance(DependencyInjectionTestExecutionListener.java:83)
06-Nov-2018 22:29:26         at org.springframework.boot.test.autoconfigure.SpringBootDependencyInjectionTestExecutionListener.prepareTestInstance(SpringBootDependencyInjectionTestExecutionListener.java:44)
06-Nov-2018 22:29:26         at org.springframework.test.context.TestContextManager.prepareTestInstance(TestContextManager.java:230)
06-Nov-2018 22:29:26         at org.springframework.test.context.junit4.SpringJUnit4ClassRunner.createTest(SpringJUnit4ClassRunner.java:228)
06-Nov-2018 22:29:26         at org.springframework.test.context.junit4.SpringJUnit4ClassRunner$1.runReflectiveCall(SpringJUnit4ClassRunner.java:287)
06-Nov-2018 22:29:26         at org.junit.internal.runners.model.ReflectiveCallable.run(ReflectiveCallable.java:12)
06-Nov-2018 22:29:26         at org.springframework.test.context.junit4.SpringJUnit4ClassRunner.methodBlock(SpringJUnit4ClassRunner.java:289)
06-Nov-2018 22:29:26         at org.springframework.test.context.junit4.SpringJUnit4ClassRunner.runChild(SpringJUnit4ClassRunner.java:247)
06-Nov-2018 22:29:26         at org.springframework.test.context.junit4.SpringJUnit4ClassRunner.runChild(SpringJUnit4ClassRunner.java:94)
06-Nov-2018 22:29:26         at org.junit.runners.ParentRunner$3.run(ParentRunner.java:290)
06-Nov-2018 22:29:26         at org.junit.runners.ParentRunner$1.schedule(ParentRunner.java:71)
06-Nov-2018 22:29:26         at org.junit.runners.ParentRunner.runChildren(ParentRunner.java:288)
06-Nov-2018 22:29:26         at org.junit.runners.ParentRunner.access$000(ParentRunner.java:58)
06-Nov-2018 22:29:26         at org.junit.runners.ParentRunner$2.evaluate(ParentRunner.java:268)
06-Nov-2018 22:29:26         at org.springframework.test.context.junit4.statements.RunBeforeTestClassCallbacks.evaluate(RunBeforeTestClassCallbacks.java:61)
06-Nov-2018 22:29:26         at org.springframework.test.context.junit4.statements.RunAfterTestClassCallbacks.evaluate(RunAfterTestClassCallbacks.java:70)
06-Nov-2018 22:29:26         at org.junit.runners.ParentRunner.run(ParentRunner.java:363)
06-Nov-2018 22:29:26         at org.springframework.test.context.junit4.SpringJUnit4ClassRunner.run(SpringJUnit4ClassRunner.java:191)
06-Nov-2018 22:29:26         at org.apache.maven.surefire.junit4.JUnit4Provider.execute(JUnit4Provider.java:283)
06-Nov-2018 22:29:26         at org.apache.maven.surefire.junit4.JUnit4Provider.executeWithRerun(JUnit4Provider.java:173)
06-Nov-2018 22:29:26         at org.apache.maven.surefire.junit4.JUnit4Provider.executeTestSet(JUnit4Provider.java:153)
06-Nov-2018 22:29:26         at org.apache.maven.surefire.junit4.JUnit4Provider.invoke(JUnit4Provider.java:128)
06-Nov-2018 22:29:26         at org.apache.maven.surefire.booter.ForkedBooter.invokeProviderInSameClassLoader(ForkedBooter.java:203)
06-Nov-2018 22:29:26         at org.apache.maven.surefire.booter.ForkedBooter.runSuitesInProcess(ForkedBooter.java:155)
06-Nov-2018 22:29:26         at org.apache.maven.surefire.booter.ForkedBooter.main(ForkedBooter.java:103)
06-Nov-2018 22:29:26 Caused by: org.springframework.cloud.dataflow.rest.client.DataFlowClientException:
06-Nov-2018 22:29:26         at org.springframework.cloud.dataflow.rest.client.VndErrorResponseErrorHandler.handleError(VndErrorResponseErrorHandler.java:63)
06-Nov-2018 22:29:26         at org.springframework.web.client.RestTemplate.handleResponse(RestTemplate.java:667)
06-Nov-2018 22:29:26         at org.springframework.web.client.RestTemplate.doExecute(RestTemplate.java:620)
06-Nov-2018 22:29:26         at org.springframework.web.client.RestTemplate.execute(RestTemplate.java:580)
06-Nov-2018 22:29:26         at org.springframework.web.client.RestTemplate.getForObject(RestTemplate.java:287)
06-Nov-2018 22:29:26         at org.springframework.cloud.dataflow.rest.client.AboutTemplate.get(AboutTemplate.java:44)
06-Nov-2018 22:29:26         at org.springframework.cloud.dataflow.rest.client.DataFlowTemplate.getVersion(DataFlowTemplate.java:244)
06-Nov-2018 22:29:26         at org.springframework.cloud.dataflow.rest.client.DataFlowTemplate.<init>(DataFlowTemplate.java:191)
06-Nov-2018 22:29:26         at org.springframework.cloud.dataflow.rest.client.DataFlowTemplate.<init>(DataFlowTemplate.java:150)
06-Nov-2018 22:29:26         at org.springframework.cloud.dataflow.acceptance.test.AbstractStreamTests.afterPropertiesSet(AbstractStreamTests.java:126)
06-Nov-2018 22:29:26         at org.springframework.beans.factory.support.AbstractAutowireCapableBeanFactory.invokeInitMethods(AbstractAutowireCapableBeanFactory.java:1642)
06-Nov-2018 22:29:26         at org.springframework.beans.factory.support.AbstractAutowireCapableBeanFactory.initializeBean(AbstractAutowireCapableBeanFactory.java:1579)
06-Nov-2018 22:29:26         ... 27 common frames omitted
06-Nov-2018 22:29:26
06-Nov-2018 22:29:26
06-Nov-2018 22:29:26
06-Nov-2018 22:29:26
06-Nov-2018 22:29:26 =========================
06-Nov-2018 22:29:26 AUTO-CONFIGURATION REPORT
06-Nov-2018 22:29:26 =========================
06-Nov-2018 22:29:26
06-Nov-2018 22:29:26
06-Nov-2018 22:29:26 Positive matches:
06-Nov-2018 22:29:26 -----------------
06-Nov-2018 22:29:26
06-Nov-2018 22:29:26    RedisAutoConfiguration matched
06-Nov-2018 22:29:26       - @ConditionalOnClass found required classes 'org.springframework.data.redis.connection.jedis.JedisConnection', 'org.springframework.data.redis.core.RedisOperations', 'redis.clients.jedis.Jedis' (OnClassCondition)
06-Nov-2018 22:29:26
06-Nov-2018 22:29:26    RedisAutoConfiguration.RedisConfiguration#redisTemplate matched
06-Nov-2018 22:29:26       - @ConditionalOnMissingBean (names: redisTemplate; SearchStrategy: all) did not find any beans (OnBeanCondition)
06-Nov-2018 22:29:26
06-Nov-2018 22:29:26    RedisAutoConfiguration.RedisConfiguration#stringRedisTemplate matched
06-Nov-2018 22:29:26       - @ConditionalOnMissingBean (types: org.springframework.data.redis.core.StringRedisTemplate; SearchStrategy: all) did not find any beans (OnBeanCondition)
06-Nov-2018 22:29:26
06-Nov-2018 22:29:26    RedisAutoConfiguration.RedisConnectionConfiguration matched
06-Nov-2018 22:29:26       - @ConditionalOnClass found required class 'org.apache.commons.pool2.impl.GenericObjectPool' (OnClassCondition)
06-Nov-2018 22:29:26
06-Nov-2018 22:29:26    RedisAutoConfiguration.RedisConnectionConfiguration#redisConnectionFactory matched
06-Nov-2018 22:29:26       - @ConditionalOnMissingBean (types: org.springframework.data.redis.connection.RedisConnectionFactory; SearchStrategy: all) did not find any beans (OnBeanCondition)
06-Nov-2018 22:29:26
06-Nov-2018 22:29:26
06-Nov-2018 22:29:26 Negative matches:
06-Nov-2018 22:29:26 -----------------
06-Nov-2018 22:29:26
06-Nov-2018 22:29:26
06-Nov-2018 22:29:26 Exclusions:
06-Nov-2018 22:29:26 -----------
06-Nov-2018 22:29:26
06-Nov-2018 22:29:26     None
06-Nov-2018 22:29:26
06-Nov-2018 22:29:26
06-Nov-2018 22:29:26 Unconditional classes:
06-Nov-2018 22:29:26 ----------------------
06-Nov-2018 22:29:26
06-Nov-2018 22:29:26     None
06-Nov-2018 22:29:26
06-Nov-2018 22:29:26
06-Nov-2018 22:29:26
06-Nov-2018 22:29:26 2018-11-06 22:29:26.176 ERROR 6439 --- [           main] o.s.test.context.TestContextManager      : Caught exception while allowing TestExecutionListener [org.springframework.boot.test.autoconfigure.SpringBootDependencyInjectionTestExecutionListener@76544c0a] to prepare test instance [org.springframework.cloud.dataflow.acceptance.test.NamedChannelTests@43c57161]
06-Nov-2018 22:29:26
06-Nov-2018 22:29:26 org.springframework.beans.factory.BeanCreationException: Error creating bean with name 'org.springframework.cloud.dataflow.acceptance.test.NamedChannelTests': Invocation of init method failed; nested exception is org.springframework.cloud.dataflow.rest.client.DataFlowClientException:
06-Nov-2018 22:29:26         at org.springframework.beans.factory.support.AbstractAutowireCapableBeanFactory.initializeBean(AbstractAutowireCapableBeanFactory.java:1583)
06-Nov-2018 22:29:26         at org.springframework.beans.factory.support.AbstractAutowireCapableBeanFactory.initializeBean(AbstractAutowireCapableBeanFactory.java:399)
06-Nov-2018 22:29:26         at org.springframework.test.context.support.DependencyInjectionTestExecutionListener.injectDependencies(DependencyInjectionTestExecutionListener.java:119)
06-Nov-2018 22:29:26         at org.springframework.test.context.support.DependencyInjectionTestExecutionListener.prepareTestInstance(DependencyInjectionTestExecutionListener.java:83)
06-Nov-2018 22:29:26         at org.springframework.boot.test.autoconfigure.SpringBootDependencyInjectionTestExecutionListener.prepareTestInstance(SpringBootDependencyInjectionTestExecutionListener.java:44)
06-Nov-2018 22:29:26         at org.springframework.test.context.TestContextManager.prepareTestInstance(TestContextManager.java:230)
06-Nov-2018 22:29:26         at org.springframework.test.context.junit4.SpringJUnit4ClassRunner.createTest(SpringJUnit4ClassRunner.java:228)
06-Nov-2018 22:29:26         at org.springframework.test.context.junit4.SpringJUnit4ClassRunner$1.runReflectiveCall(SpringJUnit4ClassRunner.java:287)
06-Nov-2018 22:29:26         at org.junit.internal.runners.model.ReflectiveCallable.run(ReflectiveCallable.java:12)
06-Nov-2018 22:29:26         at org.springframework.test.context.junit4.SpringJUnit4ClassRunner.methodBlock(SpringJUnit4ClassRunner.java:289)
06-Nov-2018 22:29:26         at org.springframework.test.context.junit4.SpringJUnit4ClassRunner.runChild(SpringJUnit4ClassRunner.java:247)
06-Nov-2018 22:29:26         at org.springframework.test.context.junit4.SpringJUnit4ClassRunner.runChild(SpringJUnit4ClassRunner.java:94)
06-Nov-2018 22:29:26         at org.junit.runners.ParentRunner$3.run(ParentRunner.java:290)
06-Nov-2018 22:29:26         at org.junit.runners.ParentRunner$1.schedule(ParentRunner.java:71)
06-Nov-2018 22:29:26         at org.junit.runners.ParentRunner.runChildren(ParentRunner.java:288)
06-Nov-2018 22:29:26         at org.junit.runners.ParentRunner.access$000(ParentRunner.java:58)
06-Nov-2018 22:29:26         at org.junit.runners.ParentRunner$2.evaluate(ParentRunner.java:268)
06-Nov-2018 22:29:26         at org.springframework.test.context.junit4.statements.RunBeforeTestClassCallbacks.evaluate(RunBeforeTestClassCallbacks.java:61)
06-Nov-2018 22:29:26         at org.springframework.test.context.junit4.statements.RunAfterTestClassCallbacks.evaluate(RunAfterTestClassCallbacks.java:70)
06-Nov-2018 22:29:26         at org.junit.runners.ParentRunner.run(ParentRunner.java:363)
06-Nov-2018 22:29:26         at org.springframework.test.context.junit4.SpringJUnit4ClassRunner.run(SpringJUnit4ClassRunner.java:191)
06-Nov-2018 22:29:26         at org.apache.maven.surefire.junit4.JUnit4Provider.execute(JUnit4Provider.java:283)
06-Nov-2018 22:29:26         at org.apache.maven.surefire.junit4.JUnit4Provider.executeWithRerun(JUnit4Provider.java:173)
06-Nov-2018 22:29:26         at org.apache.maven.surefire.junit4.JUnit4Provider.executeTestSet(JUnit4Provider.java:153)
06-Nov-2018 22:29:26         at org.apache.maven.surefire.junit4.JUnit4Provider.invoke(JUnit4Provider.java:128)
06-Nov-2018 22:29:26         at org.apache.maven.surefire.booter.ForkedBooter.invokeProviderInSameClassLoader(ForkedBooter.java:203)
06-Nov-2018 22:29:26         at org.apache.maven.surefire.booter.ForkedBooter.runSuitesInProcess(ForkedBooter.java:155)
06-Nov-2018 22:29:26         at org.apache.maven.surefire.booter.ForkedBooter.main(ForkedBooter.java:103)
06-Nov-2018 22:29:26 Caused by: org.springframework.cloud.dataflow.rest.client.DataFlowClientException:
06-Nov-2018 22:29:26         at org.springframework.cloud.dataflow.rest.client.VndErrorResponseErrorHandler.handleError(VndErrorResponseErrorHandler.java:63)
06-Nov-2018 22:29:26         at org.springframework.web.client.RestTemplate.handleResponse(RestTemplate.java:667)
06-Nov-2018 22:29:26         at org.springframework.web.client.RestTemplate.doExecute(RestTemplate.java:620)
06-Nov-2018 22:29:26         at org.springframework.web.client.RestTemplate.execute(RestTemplate.java:580)
06-Nov-2018 22:29:26         at org.springframework.web.client.RestTemplate.getForObject(RestTemplate.java:287)
06-Nov-2018 22:29:26         at org.springframework.cloud.dataflow.rest.client.AboutTemplate.get(AboutTemplate.java:44)
06-Nov-2018 22:29:26         at org.springframework.cloud.dataflow.rest.client.DataFlowTemplate.getVersion(DataFlowTemplate.java:244)
06-Nov-2018 22:29:26         at org.springframework.cloud.dataflow.rest.client.DataFlowTemplate.<init>(DataFlowTemplate.java:191)
06-Nov-2018 22:29:26         at org.springframework.cloud.dataflow.rest.client.DataFlowTemplate.<init>(DataFlowTemplate.java:150)
06-Nov-2018 22:29:26         at org.springframework.cloud.dataflow.acceptance.test.AbstractStreamTests.afterPropertiesSet(AbstractStreamTests.java:126)
06-Nov-2018 22:29:26         at org.springframework.beans.factory.support.AbstractAutowireCapableBeanFactory.invokeInitMethods(AbstractAutowireCapableBeanFactory.java:1642)
06-Nov-2018 22:29:26         at org.springframework.beans.factory.support.AbstractAutowireCapableBeanFactory.initializeBean(AbstractAutowireCapableBeanFactory.java:1579)
06-Nov-2018 22:29:26         ... 27 common frames omitted
06-Nov-2018 22:29:26
06-Nov-2018 22:29:26
06-Nov-2018 22:29:26
06-Nov-2018 22:29:26
06-Nov-2018 22:29:26 =========================
06-Nov-2018 22:29:26 AUTO-CONFIGURATION REPORT
06-Nov-2018 22:29:26 =========================
06-Nov-2018 22:29:26
06-Nov-2018 22:29:26
06-Nov-2018 22:29:26 Positive matches:
06-Nov-2018 22:29:26 -----------------
06-Nov-2018 22:29:26
06-Nov-2018 22:29:26    RedisAutoConfiguration matched
06-Nov-2018 22:29:26       - @ConditionalOnClass found required classes 'org.springframework.data.redis.connection.jedis.JedisConnection', 'org.springframework.data.redis.core.RedisOperations', 'redis.clients.jedis.Jedis' (OnClassCondition)
06-Nov-2018 22:29:26
06-Nov-2018 22:29:26    RedisAutoConfiguration.RedisConfiguration#redisTemplate matched
06-Nov-2018 22:29:26       - @ConditionalOnMissingBean (names: redisTemplate; SearchStrategy: all) did not find any beans (OnBeanCondition)
06-Nov-2018 22:29:26
06-Nov-2018 22:29:26    RedisAutoConfiguration.RedisConfiguration#stringRedisTemplate matched
06-Nov-2018 22:29:26       - @ConditionalOnMissingBean (types: org.springframework.data.redis.core.StringRedisTemplate; SearchStrategy: all) did not find any beans (OnBeanCondition)
06-Nov-2018 22:29:26
06-Nov-2018 22:29:26    RedisAutoConfiguration.RedisConnectionConfiguration matched
06-Nov-2018 22:29:26       - @ConditionalOnClass found required class 'org.apache.commons.pool2.impl.GenericObjectPool' (OnClassCondition)
06-Nov-2018 22:29:26
06-Nov-2018 22:29:26    RedisAutoConfiguration.RedisConnectionConfiguration#redisConnectionFactory matched
06-Nov-2018 22:29:26       - @ConditionalOnMissingBean (types: org.springframework.data.redis.connection.RedisConnectionFactory; SearchStrategy: all) did not find any beans (OnBeanCondition)
06-Nov-2018 22:29:26
06-Nov-2018 22:29:26
06-Nov-2018 22:29:26 Negative matches:
06-Nov-2018 22:29:26 -----------------
06-Nov-2018 22:29:26
06-Nov-2018 22:29:26
06-Nov-2018 22:29:26 Exclusions:
06-Nov-2018 22:29:26 -----------
06-Nov-2018 22:29:26
06-Nov-2018 22:29:26     None
06-Nov-2018 22:29:26
06-Nov-2018 22:29:26
06-Nov-2018 22:29:26 Unconditional classes:
06-Nov-2018 22:29:26 ----------------------
06-Nov-2018 22:29:26
06-Nov-2018 22:29:26     None
06-Nov-2018 22:29:26
06-Nov-2018 22:29:26
06-Nov-2018 22:29:26
06-Nov-2018 22:29:26 2018-11-06 22:29:26.244 ERROR 6439 --- [           main] o.s.test.context.TestContextManager      : Caught exception while allowing TestExecutionListener [org.springframework.boot.test.autoconfigure.SpringBootDependencyInjectionTestExecutionListener@76544c0a] to prepare test instance [org.springframework.cloud.dataflow.acceptance.test.NamedChannelTests@d902300]
06-Nov-2018 22:29:26
06-Nov-2018 22:29:26 org.springframework.beans.factory.BeanCreationException: Error creating bean with name 'org.springframework.cloud.dataflow.acceptance.test.NamedChannelTests': Invocation of init method failed; nested exception is org.springframework.cloud.dataflow.rest.client.DataFlowClientException:
06-Nov-2018 22:29:26         at org.springframework.beans.factory.support.AbstractAutowireCapableBeanFactory.initializeBean(AbstractAutowireCapableBeanFactory.java:1583)
06-Nov-2018 22:29:26         at org.springframework.beans.factory.support.AbstractAutowireCapableBeanFactory.initializeBean(AbstractAutowireCapableBeanFactory.java:399)
06-Nov-2018 22:29:26         at org.springframework.test.context.support.DependencyInjectionTestExecutionListener.injectDependencies(DependencyInjectionTestExecutionListener.java:119)
06-Nov-2018 22:29:26         at org.springframework.test.context.support.DependencyInjectionTestExecutionListener.prepareTestInstance(DependencyInjectionTestExecutionListener.java:83)
06-Nov-2018 22:29:26         at org.springframework.boot.test.autoconfigure.SpringBootDependencyInjectionTestExecutionListener.prepareTestInstance(SpringBootDependencyInjectionTestExecutionListener.java:44)
06-Nov-2018 22:29:26         at org.springframework.test.context.TestContextManager.prepareTestInstance(TestContextManager.java:230)
06-Nov-2018 22:29:26         at org.springframework.test.context.junit4.SpringJUnit4ClassRunner.createTest(SpringJUnit4ClassRunner.java:228)
06-Nov-2018 22:29:26         at org.springframework.test.context.junit4.SpringJUnit4ClassRunner$1.runReflectiveCall(SpringJUnit4ClassRunner.java:287)
06-Nov-2018 22:29:26         at org.junit.internal.runners.model.ReflectiveCallable.run(ReflectiveCallable.java:12)
06-Nov-2018 22:29:26         at org.springframework.test.context.junit4.SpringJUnit4ClassRunner.methodBlock(SpringJUnit4ClassRunner.java:289)
06-Nov-2018 22:29:26         at org.springframework.test.context.junit4.SpringJUnit4ClassRunner.runChild(SpringJUnit4ClassRunner.java:247)
06-Nov-2018 22:29:26         at org.springframework.test.context.junit4.SpringJUnit4ClassRunner.runChild(SpringJUnit4ClassRunner.java:94)
06-Nov-2018 22:29:26         at org.junit.runners.ParentRunner$3.run(ParentRunner.java:290)
06-Nov-2018 22:29:26         at org.junit.runners.ParentRunner$1.schedule(ParentRunner.java:71)
06-Nov-2018 22:29:26         at org.junit.runners.ParentRunner.runChildren(ParentRunner.java:288)
06-Nov-2018 22:29:26         at org.junit.runners.ParentRunner.access$000(ParentRunner.java:58)
06-Nov-2018 22:29:26         at org.junit.runners.ParentRunner$2.evaluate(ParentRunner.java:268)
06-Nov-2018 22:29:26         at org.springframework.test.context.junit4.statements.RunBeforeTestClassCallbacks.evaluate(RunBeforeTestClassCallbacks.java:61)
06-Nov-2018 22:29:26         at org.springframework.test.context.junit4.statements.RunAfterTestClassCallbacks.evaluate(RunAfterTestClassCallbacks.java:70)
06-Nov-2018 22:29:26         at org.junit.runners.ParentRunner.run(ParentRunner.java:363)
06-Nov-2018 22:29:26         at org.springframework.test.context.junit4.SpringJUnit4ClassRunner.run(SpringJUnit4ClassRunner.java:191)
06-Nov-2018 22:29:26         at org.apache.maven.surefire.junit4.JUnit4Provider.execute(JUnit4Provider.java:283)
06-Nov-2018 22:29:26         at org.apache.maven.surefire.junit4.JUnit4Provider.executeWithRerun(JUnit4Provider.java:173)
06-Nov-2018 22:29:26         at org.apache.maven.surefire.junit4.JUnit4Provider.executeTestSet(JUnit4Provider.java:153)
06-Nov-2018 22:29:26         at org.apache.maven.surefire.junit4.JUnit4Provider.invoke(JUnit4Provider.java:128)
06-Nov-2018 22:29:26         at org.apache.maven.surefire.booter.ForkedBooter.invokeProviderInSameClassLoader(ForkedBooter.java:203)
06-Nov-2018 22:29:26         at org.apache.maven.surefire.booter.ForkedBooter.runSuitesInProcess(ForkedBooter.java:155)
06-Nov-2018 22:29:26         at org.apache.maven.surefire.booter.ForkedBooter.main(ForkedBooter.java:103)
06-Nov-2018 22:29:26 Caused by: org.springframework.cloud.dataflow.rest.client.DataFlowClientException:
06-Nov-2018 22:29:26         at org.springframework.cloud.dataflow.rest.client.VndErrorResponseErrorHandler.handleError(VndErrorResponseErrorHandler.java:63)
06-Nov-2018 22:29:26         at org.springframework.web.client.RestTemplate.handleResponse(RestTemplate.java:667)
06-Nov-2018 22:29:26         at org.springframework.web.client.RestTemplate.doExecute(RestTemplate.java:620)
06-Nov-2018 22:29:26         at org.springframework.web.client.RestTemplate.execute(RestTemplate.java:580)
06-Nov-2018 22:29:26         at org.springframework.web.client.RestTemplate.getForObject(RestTemplate.java:287)
06-Nov-2018 22:29:26         at org.springframework.cloud.dataflow.rest.client.AboutTemplate.get(AboutTemplate.java:44)
06-Nov-2018 22:29:26         at org.springframework.cloud.dataflow.rest.client.DataFlowTemplate.getVersion(DataFlowTemplate.java:244)
06-Nov-2018 22:29:26         at org.springframework.cloud.dataflow.rest.client.DataFlowTemplate.<init>(DataFlowTemplate.java:191)
06-Nov-2018 22:29:26         at org.springframework.cloud.dataflow.rest.client.DataFlowTemplate.<init>(DataFlowTemplate.java:150)
06-Nov-2018 22:29:26         at org.springframework.cloud.dataflow.acceptance.test.AbstractStreamTests.afterPropertiesSet(AbstractStreamTests.java:126)
06-Nov-2018 22:29:26         at org.springframework.beans.factory.support.AbstractAutowireCapableBeanFactory.invokeInitMethods(AbstractAutowireCapableBeanFactory.java:1642)
06-Nov-2018 22:29:26         at org.springframework.beans.factory.support.AbstractAutowireCapableBeanFactory.initializeBean(AbstractAutowireCapableBeanFactory.java:1579)
06-Nov-2018 22:29:26         ... 27 common frames omitted
06-Nov-2018 22:29:26
06-Nov-2018 22:29:26 Tests run: 4, Failures: 0, Errors: 4, Skipped: 0, Time elapsed: 0.253 sec <<< FAILURE! - in org.springframework.cloud.dataflow.acceptance.test.NamedChannelTests
06-Nov-2018 22:29:26 testDestination(org.springframework.cloud.dataflow.acceptance.test.NamedChannelTests)  Time elapsed: 0 sec  <<< ERROR!
06-Nov-2018 22:29:26 org.springframework.beans.factory.BeanCreationException: Error creating bean with name 'org.springframework.cloud.dataflow.acceptance.test.NamedChannelTests': Invocation of init method failed; nested exception is org.springframework.cloud.dataflow.rest.client.DataFlowClientException:
06-Nov-2018 22:29:26         at org.springframework.beans.factory.support.AbstractAutowireCapableBeanFactory.initializeBean(AbstractAutowireCapableBeanFactory.java:1583)
06-Nov-2018 22:29:26         at org.springframework.beans.factory.support.AbstractAutowireCapableBeanFactory.initializeBean(AbstractAutowireCapableBeanFactory.java:399)
06-Nov-2018 22:29:26         at org.springframework.test.context.support.DependencyInjectionTestExecutionListener.injectDependencies(DependencyInjectionTestExecutionListener.java:119)
06-Nov-2018 22:29:26         at org.springframework.test.context.support.DependencyInjectionTestExecutionListener.prepareTestInstance(DependencyInjectionTestExecutionListener.java:83)
06-Nov-2018 22:29:26         at org.springframework.boot.test.autoconfigure.SpringBootDependencyInjectionTestExecutionListener.prepareTestInstance(SpringBootDependencyInjectionTestExecutionListener.java:44)
06-Nov-2018 22:29:26         at org.springframework.test.context.TestContextManager.prepareTestInstance(TestContextManager.java:230)
06-Nov-2018 22:29:26         at org.springframework.test.context.junit4.SpringJUnit4ClassRunner.createTest(SpringJUnit4ClassRunner.java:228)
06-Nov-2018 22:29:26         at org.springframework.test.context.junit4.SpringJUnit4ClassRunner$1.runReflectiveCall(SpringJUnit4ClassRunner.java:287)
06-Nov-2018 22:29:26         at org.junit.internal.runners.model.ReflectiveCallable.run(ReflectiveCallable.java:12)
06-Nov-2018 22:29:26         at org.springframework.test.context.junit4.SpringJUnit4ClassRunner.methodBlock(SpringJUnit4ClassRunner.java:289)
06-Nov-2018 22:29:26         at org.springframework.test.context.junit4.SpringJUnit4ClassRunner.runChild(SpringJUnit4ClassRunner.java:247)
06-Nov-2018 22:29:26         at org.springframework.test.context.junit4.SpringJUnit4ClassRunner.runChild(SpringJUnit4ClassRunner.java:94)
06-Nov-2018 22:29:26         at org.junit.runners.ParentRunner$3.run(ParentRunner.java:290)
06-Nov-2018 22:29:26         at org.junit.runners.ParentRunner$1.schedule(ParentRunner.java:71)
06-Nov-2018 22:29:26         at org.junit.runners.ParentRunner.runChildren(ParentRunner.java:288)
06-Nov-2018 22:29:26         at org.junit.runners.ParentRunner.access$000(ParentRunner.java:58)
06-Nov-2018 22:29:26         at org.junit.runners.ParentRunner$2.evaluate(ParentRunner.java:268)
06-Nov-2018 22:29:26         at org.springframework.test.context.junit4.statements.RunBeforeTestClassCallbacks.evaluate(RunBeforeTestClassCallbacks.java:61)
06-Nov-2018 22:29:26         at org.springframework.test.context.junit4.statements.RunAfterTestClassCallbacks.evaluate(RunAfterTestClassCallbacks.java:70)
06-Nov-2018 22:29:26         at org.junit.runners.ParentRunner.run(ParentRunner.java:363)
06-Nov-2018 22:29:26         at org.springframework.test.context.junit4.SpringJUnit4ClassRunner.run(SpringJUnit4ClassRunner.java:191)
06-Nov-2018 22:29:26         at org.apache.maven.surefire.junit4.JUnit4Provider.execute(JUnit4Provider.java:283)
06-Nov-2018 22:29:26         at org.apache.maven.surefire.junit4.JUnit4Provider.executeWithRerun(JUnit4Provider.java:173)
06-Nov-2018 22:29:26         at org.apache.maven.surefire.junit4.JUnit4Provider.executeTestSet(JUnit4Provider.java:153)
06-Nov-2018 22:29:26         at org.apache.maven.surefire.junit4.JUnit4Provider.invoke(JUnit4Provider.java:128)
06-Nov-2018 22:29:26         at org.apache.maven.surefire.booter.ForkedBooter.invokeProviderInSameClassLoader(ForkedBooter.java:203)
06-Nov-2018 22:29:26         at org.apache.maven.surefire.booter.ForkedBooter.runSuitesInProcess(ForkedBooter.java:155)
06-Nov-2018 22:29:26         at org.apache.maven.surefire.booter.ForkedBooter.main(ForkedBooter.java:103)
06-Nov-2018 22:29:26 Caused by: org.springframework.cloud.dataflow.rest.client.DataFlowClientException:
06-Nov-2018 22:29:26         at org.springframework.cloud.dataflow.rest.client.VndErrorResponseErrorHandler.handleError(VndErrorResponseErrorHandler.java:63)
06-Nov-2018 22:29:26         at org.springframework.web.client.RestTemplate.handleResponse(RestTemplate.java:667)
06-Nov-2018 22:29:26         at org.springframework.web.client.RestTemplate.doExecute(RestTemplate.java:620)
06-Nov-2018 22:29:26         at org.springframework.web.client.RestTemplate.execute(RestTemplate.java:580)
06-Nov-2018 22:29:26         at org.springframework.web.client.RestTemplate.getForObject(RestTemplate.java:287)
06-Nov-2018 22:29:26         at org.springframework.cloud.dataflow.rest.client.AboutTemplate.get(AboutTemplate.java:44)
06-Nov-2018 22:29:26         at org.springframework.cloud.dataflow.rest.client.DataFlowTemplate.getVersion(DataFlowTemplate.java:244)
06-Nov-2018 22:29:26         at org.springframework.cloud.dataflow.rest.client.DataFlowTemplate.<init>(DataFlowTemplate.java:191)
06-Nov-2018 22:29:26         at org.springframework.cloud.dataflow.rest.client.DataFlowTemplate.<init>(DataFlowTemplate.java:150)
06-Nov-2018 22:29:26         at org.springframework.cloud.dataflow.acceptance.test.AbstractStreamTests.afterPropertiesSet(AbstractStreamTests.java:126)
06-Nov-2018 22:29:26         at org.springframework.beans.factory.support.AbstractAutowireCapableBeanFactory.invokeInitMethods(AbstractAutowireCapableBeanFactory.java:1642)
06-Nov-2018 22:29:26         at org.springframework.beans.factory.support.AbstractAutowireCapableBeanFactory.initializeBean(AbstractAutowireCapableBeanFactory.java:1579)
06-Nov-2018 22:29:26         at org.springframework.beans.factory.support.AbstractAutowireCapableBeanFactory.initializeBean(AbstractAutowireCapableBeanFactory.java:399)
06-Nov-2018 22:29:26         at org.springframework.test.context.support.DependencyInjectionTestExecutionListener.injectDependencies(DependencyInjectionTestExecutionListener.java:119)
06-Nov-2018 22:29:26         at org.springframework.test.context.support.DependencyInjectionTestExecutionListener.prepareTestInstance(DependencyInjectionTestExecutionListener.java:83)
06-Nov-2018 22:29:26         at org.springframework.boot.test.autoconfigure.SpringBootDependencyInjectionTestExecutionListener.prepareTestInstance(SpringBootDependencyInjectionTestExecutionListener.java:44)
06-Nov-2018 22:29:26         at org.springframework.test.context.TestContextManager.prepareTestInstance(TestContextManager.java:230)
06-Nov-2018 22:29:26         at org.springframework.test.context.junit4.SpringJUnit4ClassRunner.createTest(SpringJUnit4ClassRunner.java:228)
06-Nov-2018 22:29:26         at org.springframework.test.context.junit4.SpringJUnit4ClassRunner$1.runReflectiveCall(SpringJUnit4ClassRunner.java:287)
06-Nov-2018 22:29:26         at org.junit.internal.runners.model.ReflectiveCallable.run(ReflectiveCallable.java:12)
06-Nov-2018 22:29:26         at org.springframework.test.context.junit4.SpringJUnit4ClassRunner.methodBlock(SpringJUnit4ClassRunner.java:289)
06-Nov-2018 22:29:26         at org.springframework.test.context.junit4.SpringJUnit4ClassRunner.runChild(SpringJUnit4ClassRunner.java:247)
06-Nov-2018 22:29:26         at org.springframework.test.context.junit4.SpringJUnit4ClassRunner.runChild(SpringJUnit4ClassRunner.java:94)
06-Nov-2018 22:29:26         at org.junit.runners.ParentRunner$3.run(ParentRunner.java:290)
06-Nov-2018 22:29:26         at org.junit.runners.ParentRunner$1.schedule(ParentRunner.java:71)
06-Nov-2018 22:29:26         at org.junit.runners.ParentRunner.runChildren(ParentRunner.java:288)
06-Nov-2018 22:29:26         at org.junit.runners.ParentRunner.access$000(ParentRunner.java:58)
06-Nov-2018 22:29:26         at org.junit.runners.ParentRunner$2.evaluate(ParentRunner.java:268)
06-Nov-2018 22:29:26         at org.springframework.test.context.junit4.statements.RunBeforeTestClassCallbacks.evaluate(RunBeforeTestClassCallbacks.java:61)
06-Nov-2018 22:29:26         at org.springframework.test.context.junit4.statements.RunAfterTestClassCallbacks.evaluate(RunAfterTestClassCallbacks.java:70)
06-Nov-2018 22:29:26         at org.junit.runners.ParentRunner.run(ParentRunner.java:363)
06-Nov-2018 22:29:26         at org.springframework.test.context.junit4.SpringJUnit4ClassRunner.run(SpringJUnit4ClassRunner.java:191)
06-Nov-2018 22:29:26         at org.apache.maven.surefire.junit4.JUnit4Provider.execute(JUnit4Provider.java:283)
06-Nov-2018 22:29:26         at org.apache.maven.surefire.junit4.JUnit4Provider.executeWithRerun(JUnit4Provider.java:173)
06-Nov-2018 22:29:26         at org.apache.maven.surefire.junit4.JUnit4Provider.executeTestSet(JUnit4Provider.java:153)
06-Nov-2018 22:29:26         at org.apache.maven.surefire.junit4.JUnit4Provider.invoke(JUnit4Provider.java:128)
06-Nov-2018 22:29:26         at org.apache.maven.surefire.booter.ForkedBooter.invokeProviderInSameClassLoader(ForkedBooter.java:203)
06-Nov-2018 22:29:26         at org.apache.maven.surefire.booter.ForkedBooter.runSuitesInProcess(ForkedBooter.java:155)
06-Nov-2018 22:29:26         at org.apache.maven.surefire.booter.ForkedBooter.main(ForkedBooter.java:103)
06-Nov-2018 22:29:26
06-Nov-2018 22:29:26 testTap(org.springframework.cloud.dataflow.acceptance.test.NamedChannelTests)  Time elapsed: 0.002 sec  <<< ERROR!
06-Nov-2018 22:29:26 org.springframework.beans.factory.BeanCreationException: Error creating bean with name 'org.springframework.cloud.dataflow.acceptance.test.NamedChannelTests': Invocation of init method failed; nested exception is org.springframework.cloud.dataflow.rest.client.DataFlowClientException:
06-Nov-2018 22:29:26         at org.springframework.beans.factory.support.AbstractAutowireCapableBeanFactory.initializeBean(AbstractAutowireCapableBeanFactory.java:1583)
06-Nov-2018 22:29:26         at org.springframework.beans.factory.support.AbstractAutowireCapableBeanFactory.initializeBean(AbstractAutowireCapableBeanFactory.java:399)
06-Nov-2018 22:29:26         at org.springframework.test.context.support.DependencyInjectionTestExecutionListener.injectDependencies(DependencyInjectionTestExecutionListener.java:119)
06-Nov-2018 22:29:26         at org.springframework.test.context.support.DependencyInjectionTestExecutionListener.prepareTestInstance(DependencyInjectionTestExecutionListener.java:83)
06-Nov-2018 22:29:26         at org.springframework.boot.test.autoconfigure.SpringBootDependencyInjectionTestExecutionListener.prepareTestInstance(SpringBootDependencyInjectionTestExecutionListener.java:44)
06-Nov-2018 22:29:26         at org.springframework.test.context.TestContextManager.prepareTestInstance(TestContextManager.java:230)
06-Nov-2018 22:29:26         at org.springframework.test.context.junit4.SpringJUnit4ClassRunner.createTest(SpringJUnit4ClassRunner.java:228)
06-Nov-2018 22:29:26         at org.springframework.test.context.junit4.SpringJUnit4ClassRunner$1.runReflectiveCall(SpringJUnit4ClassRunner.java:287)
06-Nov-2018 22:29:26         at org.junit.internal.runners.model.ReflectiveCallable.run(ReflectiveCallable.java:12)
06-Nov-2018 22:29:26         at org.springframework.test.context.junit4.SpringJUnit4ClassRunner.methodBlock(SpringJUnit4ClassRunner.java:289)
06-Nov-2018 22:29:26         at org.springframework.test.context.junit4.SpringJUnit4ClassRunner.runChild(SpringJUnit4ClassRunner.java:247)
06-Nov-2018 22:29:26         at org.springframework.test.context.junit4.SpringJUnit4ClassRunner.runChild(SpringJUnit4ClassRunner.java:94)
06-Nov-2018 22:29:26         at org.junit.runners.ParentRunner$3.run(ParentRunner.java:290)
06-Nov-2018 22:29:26         at org.junit.runners.ParentRunner$1.schedule(ParentRunner.java:71)
06-Nov-2018 22:29:26         at org.junit.runners.ParentRunner.runChildren(ParentRunner.java:288)
06-Nov-2018 22:29:26         at org.junit.runners.ParentRunner.access$000(ParentRunner.java:58)
06-Nov-2018 22:29:26         at org.junit.runners.ParentRunner$2.evaluate(ParentRunner.java:268)
06-Nov-2018 22:29:26         at org.springframework.test.context.junit4.statements.RunBeforeTestClassCallbacks.evaluate(RunBeforeTestClassCallbacks.java:61)
06-Nov-2018 22:29:26         at org.springframework.test.context.junit4.statements.RunAfterTestClassCallbacks.evaluate(RunAfterTestClassCallbacks.java:70)
06-Nov-2018 22:29:26         at org.junit.runners.ParentRunner.run(ParentRunner.java:363)
06-Nov-2018 22:29:26         at org.springframework.test.context.junit4.SpringJUnit4ClassRunner.run(SpringJUnit4ClassRunner.java:191)
06-Nov-2018 22:29:26         at org.apache.maven.surefire.junit4.JUnit4Provider.execute(JUnit4Provider.java:283)
06-Nov-2018 22:29:26         at org.apache.maven.surefire.junit4.JUnit4Provider.executeWithRerun(JUnit4Provider.java:173)
06-Nov-2018 22:29:26         at org.apache.maven.surefire.junit4.JUnit4Provider.executeTestSet(JUnit4Provider.java:153)
06-Nov-2018 22:29:26         at org.apache.maven.surefire.junit4.JUnit4Provider.invoke(JUnit4Provider.java:128)
06-Nov-2018 22:29:26         at org.apache.maven.surefire.booter.ForkedBooter.invokeProviderInSameClassLoader(ForkedBooter.java:203)
06-Nov-2018 22:29:26         at org.apache.maven.surefire.booter.ForkedBooter.runSuitesInProcess(ForkedBooter.java:155)
06-Nov-2018 22:29:26         at org.apache.maven.surefire.booter.ForkedBooter.main(ForkedBooter.java:103)
06-Nov-2018 22:29:26 Caused by: org.springframework.cloud.dataflow.rest.client.DataFlowClientException:
06-Nov-2018 22:29:26         at org.springframework.cloud.dataflow.rest.client.VndErrorResponseErrorHandler.handleError(VndErrorResponseErrorHandler.java:63)
06-Nov-2018 22:29:26         at org.springframework.web.client.RestTemplate.handleResponse(RestTemplate.java:667)
06-Nov-2018 22:29:26         at org.springframework.web.client.RestTemplate.doExecute(RestTemplate.java:620)
06-Nov-2018 22:29:26         at org.springframework.web.client.RestTemplate.execute(RestTemplate.java:580)
06-Nov-2018 22:29:26         at org.springframework.web.client.RestTemplate.getForObject(RestTemplate.java:287)
06-Nov-2018 22:29:26         at org.springframework.cloud.dataflow.rest.client.AboutTemplate.get(AboutTemplate.java:44)
06-Nov-2018 22:29:26         at org.springframework.cloud.dataflow.rest.client.DataFlowTemplate.getVersion(DataFlowTemplate.java:244)
06-Nov-2018 22:29:26         at org.springframework.cloud.dataflow.rest.client.DataFlowTemplate.<init>(DataFlowTemplate.java:191)
06-Nov-2018 22:29:26         at org.springframework.cloud.dataflow.rest.client.DataFlowTemplate.<init>(DataFlowTemplate.java:150)
06-Nov-2018 22:29:26         at org.springframework.cloud.dataflow.acceptance.test.AbstractStreamTests.afterPropertiesSet(AbstractStreamTests.java:126)
06-Nov-2018 22:29:26         at org.springframework.beans.factory.support.AbstractAutowireCapableBeanFactory.invokeInitMethods(AbstractAutowireCapableBeanFactory.java:1642)
06-Nov-2018 22:29:26         at org.springframework.beans.factory.support.AbstractAutowireCapableBeanFactory.initializeBean(AbstractAutowireCapableBeanFactory.java:1579)
06-Nov-2018 22:29:26         at org.springframework.beans.factory.support.AbstractAutowireCapableBeanFactory.initializeBean(AbstractAutowireCapableBeanFactory.java:399)
06-Nov-2018 22:29:26         at org.springframework.test.context.support.DependencyInjectionTestExecutionListener.injectDependencies(DependencyInjectionTestExecutionListener.java:119)
06-Nov-2018 22:29:26         at org.springframework.test.context.support.DependencyInjectionTestExecutionListener.prepareTestInstance(DependencyInjectionTestExecutionListener.java:83)
06-Nov-2018 22:29:26         at org.springframework.boot.test.autoconfigure.SpringBootDependencyInjectionTestExecutionListener.prepareTestInstance(SpringBootDependencyInjectionTestExecutionListener.java:44)
06-Nov-2018 22:29:26         at org.springframework.test.context.TestContextManager.prepareTestInstance(TestContextManager.java:230)
06-Nov-2018 22:29:26         at org.springframework.test.context.junit4.SpringJUnit4ClassRunner.createTest(SpringJUnit4ClassRunner.java:228)
06-Nov-2018 22:29:26         at org.springframework.test.context.junit4.SpringJUnit4ClassRunner$1.runReflectiveCall(SpringJUnit4ClassRunner.java:287)
06-Nov-2018 22:29:26         at org.junit.internal.runners.model.ReflectiveCallable.run(ReflectiveCallable.java:12)
06-Nov-2018 22:29:26         at org.springframework.test.context.junit4.SpringJUnit4ClassRunner.methodBlock(SpringJUnit4ClassRunner.java:289)
06-Nov-2018 22:29:26         at org.springframework.test.context.junit4.SpringJUnit4ClassRunner.runChild(SpringJUnit4ClassRunner.java:247)
06-Nov-2018 22:29:26         at org.springframework.test.context.junit4.SpringJUnit4ClassRunner.runChild(SpringJUnit4ClassRunner.java:94)
06-Nov-2018 22:29:26         at org.junit.runners.ParentRunner$3.run(ParentRunner.java:290)
06-Nov-2018 22:29:26         at org.junit.runners.ParentRunner$1.schedule(ParentRunner.java:71)
06-Nov-2018 22:29:26         at org.junit.runners.ParentRunner.runChildren(ParentRunner.java:288)
06-Nov-2018 22:29:26         at org.junit.runners.ParentRunner.access$000(ParentRunner.java:58)
06-Nov-2018 22:29:26         at org.junit.runners.ParentRunner$2.evaluate(ParentRunner.java:268)
06-Nov-2018 22:29:26         at org.springframework.test.context.junit4.statements.RunBeforeTestClassCallbacks.evaluate(RunBeforeTestClassCallbacks.java:61)
06-Nov-2018 22:29:26         at org.springframework.test.context.junit4.statements.RunAfterTestClassCallbacks.evaluate(RunAfterTestClassCallbacks.java:70)
06-Nov-2018 22:29:26         at org.junit.runners.ParentRunner.run(ParentRunner.java:363)
06-Nov-2018 22:29:26         at org.springframework.test.context.junit4.SpringJUnit4ClassRunner.run(SpringJUnit4ClassRunner.java:191)
06-Nov-2018 22:29:26         at org.apache.maven.surefire.junit4.JUnit4Provider.execute(JUnit4Provider.java:283)
06-Nov-2018 22:29:26         at org.apache.maven.surefire.junit4.JUnit4Provider.executeWithRerun(JUnit4Provider.java:173)
06-Nov-2018 22:29:26         at org.apache.maven.surefire.junit4.JUnit4Provider.executeTestSet(JUnit4Provider.java:153)
06-Nov-2018 22:29:26         at org.apache.maven.surefire.junit4.JUnit4Provider.invoke(JUnit4Provider.java:128)
06-Nov-2018 22:29:26         at org.apache.maven.surefire.booter.ForkedBooter.invokeProviderInSameClassLoader(ForkedBooter.java:203)
06-Nov-2018 22:29:26         at org.apache.maven.surefire.booter.ForkedBooter.runSuitesInProcess(ForkedBooter.java:155)
06-Nov-2018 22:29:26         at org.apache.maven.surefire.booter.ForkedBooter.main(ForkedBooter.java:103)
06-Nov-2018 22:29:26
06-Nov-2018 22:29:26 manyToOneTest(org.springframework.cloud.dataflow.acceptance.test.NamedChannelTests)  Time elapsed: 0.001 sec  <<< ERROR!
06-Nov-2018 22:29:26 org.springframework.beans.factory.BeanCreationException: Error creating bean with name 'org.springframework.cloud.dataflow.acceptance.test.NamedChannelTests': Invocation of init method failed; nested exception is org.springframework.cloud.dataflow.rest.client.DataFlowClientException:
06-Nov-2018 22:29:26         at org.springframework.beans.factory.support.AbstractAutowireCapableBeanFactory.initializeBean(AbstractAutowireCapableBeanFactory.java:1583)
06-Nov-2018 22:29:26         at org.springframework.beans.factory.support.AbstractAutowireCapableBeanFactory.initializeBean(AbstractAutowireCapableBeanFactory.java:399)
06-Nov-2018 22:29:26         at org.springframework.test.context.support.DependencyInjectionTestExecutionListener.injectDependencies(DependencyInjectionTestExecutionListener.java:119)
06-Nov-2018 22:29:26         at org.springframework.test.context.support.DependencyInjectionTestExecutionListener.prepareTestInstance(DependencyInjectionTestExecutionListener.java:83)
06-Nov-2018 22:29:26         at org.springframework.boot.test.autoconfigure.SpringBootDependencyInjectionTestExecutionListener.prepareTestInstance(SpringBootDependencyInjectionTestExecutionListener.java:44)
06-Nov-2018 22:29:26         at org.springframework.test.context.TestContextManager.prepareTestInstance(TestContextManager.java:230)
06-Nov-2018 22:29:26         at org.springframework.test.context.junit4.SpringJUnit4ClassRunner.createTest(SpringJUnit4ClassRunner.java:228)
06-Nov-2018 22:29:26         at org.springframework.test.context.junit4.SpringJUnit4ClassRunner$1.runReflectiveCall(SpringJUnit4ClassRunner.java:287)
06-Nov-2018 22:29:26         at org.junit.internal.runners.model.ReflectiveCallable.run(ReflectiveCallable.java:12)
06-Nov-2018 22:29:26         at org.springframework.test.context.junit4.SpringJUnit4ClassRunner.methodBlock(SpringJUnit4ClassRunner.java:289)
06-Nov-2018 22:29:26         at org.springframework.test.context.junit4.SpringJUnit4ClassRunner.runChild(SpringJUnit4ClassRunner.java:247)
06-Nov-2018 22:29:26         at org.springframework.test.context.junit4.SpringJUnit4ClassRunner.runChild(SpringJUnit4ClassRunner.java:94)
06-Nov-2018 22:29:26         at org.junit.runners.ParentRunner$3.run(ParentRunner.java:290)
06-Nov-2018 22:29:26         at org.junit.runners.ParentRunner$1.schedule(ParentRunner.java:71)
06-Nov-2018 22:29:26         at org.junit.runners.ParentRunner.runChildren(ParentRunner.java:288)
06-Nov-2018 22:29:26         at org.junit.runners.ParentRunner.access$000(ParentRunner.java:58)
06-Nov-2018 22:29:26         at org.junit.runners.ParentRunner$2.evaluate(ParentRunner.java:268)
06-Nov-2018 22:29:26         at org.springframework.test.context.junit4.statements.RunBeforeTestClassCallbacks.evaluate(RunBeforeTestClassCallbacks.java:61)
06-Nov-2018 22:29:26         at org.springframework.test.context.junit4.statements.RunAfterTestClassCallbacks.evaluate(RunAfterTestClassCallbacks.java:70)
06-Nov-2018 22:29:26         at org.junit.runners.ParentRunner.run(ParentRunner.java:363)
06-Nov-2018 22:29:26         at org.springframework.test.context.junit4.SpringJUnit4ClassRunner.run(SpringJUnit4ClassRunner.java:191)
06-Nov-2018 22:29:26         at org.apache.maven.surefire.junit4.JUnit4Provider.execute(JUnit4Provider.java:283)
06-Nov-2018 22:29:26         at org.apache.maven.surefire.junit4.JUnit4Provider.executeWithRerun(JUnit4Provider.java:173)
06-Nov-2018 22:29:26         at org.apache.maven.surefire.junit4.JUnit4Provider.executeTestSet(JUnit4Provider.java:153)
06-Nov-2018 22:29:26         at org.apache.maven.surefire.junit4.JUnit4Provider.invoke(JUnit4Provider.java:128)
06-Nov-2018 22:29:26         at org.apache.maven.surefire.booter.ForkedBooter.invokeProviderInSameClassLoader(ForkedBooter.java:203)
06-Nov-2018 22:29:26         at org.apache.maven.surefire.booter.ForkedBooter.runSuitesInProcess(ForkedBooter.java:155)
06-Nov-2018 22:29:26         at org.apache.maven.surefire.booter.ForkedBooter.main(ForkedBooter.java:103)
06-Nov-2018 22:29:26 Caused by: org.springframework.cloud.dataflow.rest.client.DataFlowClientException:
06-Nov-2018 22:29:26         at org.springframework.cloud.dataflow.rest.client.VndErrorResponseErrorHandler.handleError(VndErrorResponseErrorHandler.java:63)
06-Nov-2018 22:29:26         at org.springframework.web.client.RestTemplate.handleResponse(RestTemplate.java:667)
06-Nov-2018 22:29:26         at org.springframework.web.client.RestTemplate.doExecute(RestTemplate.java:620)
06-Nov-2018 22:29:26         at org.springframework.web.client.RestTemplate.execute(RestTemplate.java:580)
06-Nov-2018 22:29:26         at org.springframework.web.client.RestTemplate.getForObject(RestTemplate.java:287)
06-Nov-2018 22:29:26         at org.springframework.cloud.dataflow.rest.client.AboutTemplate.get(AboutTemplate.java:44)
06-Nov-2018 22:29:26         at org.springframework.cloud.dataflow.rest.client.DataFlowTemplate.getVersion(DataFlowTemplate.java:244)
06-Nov-2018 22:29:26         at org.springframework.cloud.dataflow.rest.client.DataFlowTemplate.<init>(DataFlowTemplate.java:191)
06-Nov-2018 22:29:26         at org.springframework.cloud.dataflow.rest.client.DataFlowTemplate.<init>(DataFlowTemplate.java:150)
06-Nov-2018 22:29:26         at org.springframework.cloud.dataflow.acceptance.test.AbstractStreamTests.afterPropertiesSet(AbstractStreamTests.java:126)
06-Nov-2018 22:29:26         at org.springframework.beans.factory.support.AbstractAutowireCapableBeanFactory.invokeInitMethods(AbstractAutowireCapableBeanFactory.java:1642)
06-Nov-2018 22:29:26         at org.springframework.beans.factory.support.AbstractAutowireCapableBeanFactory.initializeBean(AbstractAutowireCapableBeanFactory.java:1579)
06-Nov-2018 22:29:26         at org.springframework.beans.factory.support.AbstractAutowireCapableBeanFactory.initializeBean(AbstractAutowireCapableBeanFactory.java:399)
06-Nov-2018 22:29:26         at org.springframework.test.context.support.DependencyInjectionTestExecutionListener.injectDependencies(DependencyInjectionTestExecutionListener.java:119)
06-Nov-2018 22:29:26         at org.springframework.test.context.support.DependencyInjectionTestExecutionListener.prepareTestInstance(DependencyInjectionTestExecutionListener.java:83)
06-Nov-2018 22:29:26         at org.springframework.boot.test.autoconfigure.SpringBootDependencyInjectionTestExecutionListener.prepareTestInstance(SpringBootDependencyInjectionTestExecutionListener.java:44)
06-Nov-2018 22:29:26         at org.springframework.test.context.TestContextManager.prepareTestInstance(TestContextManager.java:230)
06-Nov-2018 22:29:26         at org.springframework.test.context.junit4.SpringJUnit4ClassRunner.createTest(SpringJUnit4ClassRunner.java:228)
06-Nov-2018 22:29:26         at org.springframework.test.context.junit4.SpringJUnit4ClassRunner$1.runReflectiveCall(SpringJUnit4ClassRunner.java:287)
06-Nov-2018 22:29:26         at org.junit.internal.runners.model.ReflectiveCallable.run(ReflectiveCallable.java:12)
06-Nov-2018 22:29:26         at org.springframework.test.context.junit4.SpringJUnit4ClassRunner.methodBlock(SpringJUnit4ClassRunner.java:289)
06-Nov-2018 22:29:26         at org.springframework.test.context.junit4.SpringJUnit4ClassRunner.runChild(SpringJUnit4ClassRunner.java:247)
06-Nov-2018 22:29:26         at org.springframework.test.context.junit4.SpringJUnit4ClassRunner.runChild(SpringJUnit4ClassRunner.java:94)
06-Nov-2018 22:29:26         at org.junit.runners.ParentRunner$3.run(ParentRunner.java:290)
06-Nov-2018 22:29:26         at org.junit.runners.ParentRunner$1.schedule(ParentRunner.java:71)
06-Nov-2018 22:29:26         at org.junit.runners.ParentRunner.runChildren(ParentRunner.java:288)
06-Nov-2018 22:29:26         at org.junit.runners.ParentRunner.access$000(ParentRunner.java:58)
06-Nov-2018 22:29:26         at org.junit.runners.ParentRunner$2.evaluate(ParentRunner.java:268)
06-Nov-2018 22:29:26         at org.springframework.test.context.junit4.statements.RunBeforeTestClassCallbacks.evaluate(RunBeforeTestClassCallbacks.java:61)
06-Nov-2018 22:29:26         at org.springframework.test.context.junit4.statements.RunAfterTestClassCallbacks.evaluate(RunAfterTestClassCallbacks.java:70)
06-Nov-2018 22:29:26         at org.junit.runners.ParentRunner.run(ParentRunner.java:363)
06-Nov-2018 22:29:26         at org.springframework.test.context.junit4.SpringJUnit4ClassRunner.run(SpringJUnit4ClassRunner.java:191)
06-Nov-2018 22:29:26         at org.apache.maven.surefire.junit4.JUnit4Provider.execute(JUnit4Provider.java:283)
06-Nov-2018 22:29:26         at org.apache.maven.surefire.junit4.JUnit4Provider.executeWithRerun(JUnit4Provider.java:173)
06-Nov-2018 22:29:26         at org.apache.maven.surefire.junit4.JUnit4Provider.executeTestSet(JUnit4Provider.java:153)
06-Nov-2018 22:29:26         at org.apache.maven.surefire.junit4.JUnit4Provider.invoke(JUnit4Provider.java:128)
06-Nov-2018 22:29:26         at org.apache.maven.surefire.booter.ForkedBooter.invokeProviderInSameClassLoader(ForkedBooter.java:203)
06-Nov-2018 22:29:26         at org.apache.maven.surefire.booter.ForkedBooter.runSuitesInProcess(ForkedBooter.java:155)
06-Nov-2018 22:29:26         at org.apache.maven.surefire.booter.ForkedBooter.main(ForkedBooter.java:103)
06-Nov-2018 22:29:26
06-Nov-2018 22:29:26 directedGraphTest(org.springframework.cloud.dataflow.acceptance.test.NamedChannelTests)  Time elapsed: 0.001 sec  <<< ERROR!
06-Nov-2018 22:29:26 org.springframework.beans.factory.BeanCreationException: Error creating bean with name 'org.springframework.cloud.dataflow.acceptance.test.NamedChannelTests': Invocation of init method failed; nested exception is org.springframework.cloud.dataflow.rest.client.DataFlowClientException:
06-Nov-2018 22:29:26         at org.springframework.beans.factory.support.AbstractAutowireCapableBeanFactory.initializeBean(AbstractAutowireCapableBeanFactory.java:1583)
06-Nov-2018 22:29:26         at org.springframework.beans.factory.support.AbstractAutowireCapableBeanFactory.initializeBean(AbstractAutowireCapableBeanFactory.java:399)
06-Nov-2018 22:29:26         at org.springframework.test.context.support.DependencyInjectionTestExecutionListener.injectDependencies(DependencyInjectionTestExecutionListener.java:119)
06-Nov-2018 22:29:26         at org.springframework.test.context.support.DependencyInjectionTestExecutionListener.prepareTestInstance(DependencyInjectionTestExecutionListener.java:83)
06-Nov-2018 22:29:26         at org.springframework.boot.test.autoconfigure.SpringBootDependencyInjectionTestExecutionListener.prepareTestInstance(SpringBootDependencyInjectionTestExecutionListener.java:44)
06-Nov-2018 22:29:26         at org.springframework.test.context.TestContextManager.prepareTestInstance(TestContextManager.java:230)
06-Nov-2018 22:29:26         at org.springframework.test.context.junit4.SpringJUnit4ClassRunner.createTest(SpringJUnit4ClassRunner.java:228)
06-Nov-2018 22:29:26         at org.springframework.test.context.junit4.SpringJUnit4ClassRunner$1.runReflectiveCall(SpringJUnit4ClassRunner.java:287)
06-Nov-2018 22:29:26         at org.junit.internal.runners.model.ReflectiveCallable.run(ReflectiveCallable.java:12)
06-Nov-2018 22:29:26         at org.springframework.test.context.junit4.SpringJUnit4ClassRunner.methodBlock(SpringJUnit4ClassRunner.java:289)
06-Nov-2018 22:29:26         at org.springframework.test.context.junit4.SpringJUnit4ClassRunner.runChild(SpringJUnit4ClassRunner.java:247)
06-Nov-2018 22:29:26         at org.springframework.test.context.junit4.SpringJUnit4ClassRunner.runChild(SpringJUnit4ClassRunner.java:94)
06-Nov-2018 22:29:26         at org.junit.runners.ParentRunner$3.run(ParentRunner.java:290)
06-Nov-2018 22:29:26         at org.junit.runners.ParentRunner$1.schedule(ParentRunner.java:71)
06-Nov-2018 22:29:26         at org.junit.runners.ParentRunner.runChildren(ParentRunner.java:288)
06-Nov-2018 22:29:26         at org.junit.runners.ParentRunner.access$000(ParentRunner.java:58)
06-Nov-2018 22:29:26         at org.junit.runners.ParentRunner$2.evaluate(ParentRunner.java:268)
06-Nov-2018 22:29:26         at org.springframework.test.context.junit4.statements.RunBeforeTestClassCallbacks.evaluate(RunBeforeTestClassCallbacks.java:61)
06-Nov-2018 22:29:26         at org.springframework.test.context.junit4.statements.RunAfterTestClassCallbacks.evaluate(RunAfterTestClassCallbacks.java:70)
06-Nov-2018 22:29:26         at org.junit.runners.ParentRunner.run(ParentRunner.java:363)
06-Nov-2018 22:29:26         at org.springframework.test.context.junit4.SpringJUnit4ClassRunner.run(SpringJUnit4ClassRunner.java:191)
06-Nov-2018 22:29:26         at org.apache.maven.surefire.junit4.JUnit4Provider.execute(JUnit4Provider.java:283)
06-Nov-2018 22:29:26         at org.apache.maven.surefire.junit4.JUnit4Provider.executeWithRerun(JUnit4Provider.java:173)
06-Nov-2018 22:29:26         at org.apache.maven.surefire.junit4.JUnit4Provider.executeTestSet(JUnit4Provider.java:153)
06-Nov-2018 22:29:26         at org.apache.maven.surefire.junit4.JUnit4Provider.invoke(JUnit4Provider.java:128)
06-Nov-2018 22:29:26         at org.apache.maven.surefire.booter.ForkedBooter.invokeProviderInSameClassLoader(ForkedBooter.java:203)
06-Nov-2018 22:29:26         at org.apache.maven.surefire.booter.ForkedBooter.runSuitesInProcess(ForkedBooter.java:155)
06-Nov-2018 22:29:26         at org.apache.maven.surefire.booter.ForkedBooter.main(ForkedBooter.java:103)
06-Nov-2018 22:29:26 Caused by: org.springframework.cloud.dataflow.rest.client.DataFlowClientException:
06-Nov-2018 22:29:26         at org.springframework.cloud.dataflow.rest.client.VndErrorResponseErrorHandler.handleError(VndErrorResponseErrorHandler.java:63)
06-Nov-2018 22:29:26         at org.springframework.web.client.RestTemplate.handleResponse(RestTemplate.java:667)
06-Nov-2018 22:29:26         at org.springframework.web.client.RestTemplate.doExecute(RestTemplate.java:620)
06-Nov-2018 22:29:26         at org.springframework.web.client.RestTemplate.execute(RestTemplate.java:580)
06-Nov-2018 22:29:26         at org.springframework.web.client.RestTemplate.getForObject(RestTemplate.java:287)
06-Nov-2018 22:29:26         at org.springframework.cloud.dataflow.rest.client.AboutTemplate.get(AboutTemplate.java:44)
06-Nov-2018 22:29:26         at org.springframework.cloud.dataflow.rest.client.DataFlowTemplate.getVersion(DataFlowTemplate.java:244)
06-Nov-2018 22:29:26         at org.springframework.cloud.dataflow.rest.client.DataFlowTemplate.<init>(DataFlowTemplate.java:191)
06-Nov-2018 22:29:26         at org.springframework.cloud.dataflow.rest.client.DataFlowTemplate.<init>(DataFlowTemplate.java:150)
06-Nov-2018 22:29:26         at org.springframework.cloud.dataflow.acceptance.test.AbstractStreamTests.afterPropertiesSet(AbstractStreamTests.java:126)
06-Nov-2018 22:29:26         at org.springframework.beans.factory.support.AbstractAutowireCapableBeanFactory.invokeInitMethods(AbstractAutowireCapableBeanFactory.java:1642)
06-Nov-2018 22:29:26         at org.springframework.beans.factory.support.AbstractAutowireCapableBeanFactory.initializeBean(AbstractAutowireCapableBeanFactory.java:1579)
06-Nov-2018 22:29:26         at org.springframework.beans.factory.support.AbstractAutowireCapableBeanFactory.initializeBean(AbstractAutowireCapableBeanFactory.java:399)
06-Nov-2018 22:29:26         at org.springframework.test.context.support.DependencyInjectionTestExecutionListener.injectDependencies(DependencyInjectionTestExecutionListener.java:119)
06-Nov-2018 22:29:26         at org.springframework.test.context.support.DependencyInjectionTestExecutionListener.prepareTestInstance(DependencyInjectionTestExecutionListener.java:83)
06-Nov-2018 22:29:26         at org.springframework.boot.test.autoconfigure.SpringBootDependencyInjectionTestExecutionListener.prepareTestInstance(SpringBootDependencyInjectionTestExecutionListener.java:44)
06-Nov-2018 22:29:26         at org.springframework.test.context.TestContextManager.prepareTestInstance(TestContextManager.java:230)
06-Nov-2018 22:29:26         at org.springframework.test.context.junit4.SpringJUnit4ClassRunner.createTest(SpringJUnit4ClassRunner.java:228)
06-Nov-2018 22:29:26         at org.springframework.test.context.junit4.SpringJUnit4ClassRunner$1.runReflectiveCall(SpringJUnit4ClassRunner.java:287)
06-Nov-2018 22:29:26         at org.junit.internal.runners.model.ReflectiveCallable.run(ReflectiveCallable.java:12)
06-Nov-2018 22:29:26         at org.springframework.test.context.junit4.SpringJUnit4ClassRunner.methodBlock(SpringJUnit4ClassRunner.java:289)
06-Nov-2018 22:29:26         at org.springframework.test.context.junit4.SpringJUnit4ClassRunner.runChild(SpringJUnit4ClassRunner.java:247)
06-Nov-2018 22:29:26         at org.springframework.test.context.junit4.SpringJUnit4ClassRunner.runChild(SpringJUnit4ClassRunner.java:94)
06-Nov-2018 22:29:26         at org.junit.runners.ParentRunner$3.run(ParentRunner.java:290)
06-Nov-2018 22:29:26         at org.junit.runners.ParentRunner$1.schedule(ParentRunner.java:71)
06-Nov-2018 22:29:26         at org.junit.runners.ParentRunner.runChildren(ParentRunner.java:288)
06-Nov-2018 22:29:26         at org.junit.runners.ParentRunner.access$000(ParentRunner.java:58)
06-Nov-2018 22:29:26         at org.junit.runners.ParentRunner$2.evaluate(ParentRunner.java:268)
06-Nov-2018 22:29:26         at org.springframework.test.context.junit4.statements.RunBeforeTestClassCallbacks.evaluate(RunBeforeTestClassCallbacks.java:61)
06-Nov-2018 22:29:26         at org.springframework.test.context.junit4.statements.RunAfterTestClassCallbacks.evaluate(RunAfterTestClassCallbacks.java:70)
06-Nov-2018 22:29:26         at org.junit.runners.ParentRunner.run(ParentRunner.java:363)
06-Nov-2018 22:29:26         at org.springframework.test.context.junit4.SpringJUnit4ClassRunner.run(SpringJUnit4ClassRunner.java:191)
06-Nov-2018 22:29:26         at org.apache.maven.surefire.junit4.JUnit4Provider.execute(JUnit4Provider.java:283)
06-Nov-2018 22:29:26         at org.apache.maven.surefire.junit4.JUnit4Provider.executeWithRerun(JUnit4Provider.java:173)
06-Nov-2018 22:29:26         at org.apache.maven.surefire.junit4.JUnit4Provider.executeTestSet(JUnit4Provider.java:153)
06-Nov-2018 22:29:26         at org.apache.maven.surefire.junit4.JUnit4Provider.invoke(JUnit4Provider.java:128)
06-Nov-2018 22:29:26         at org.apache.maven.surefire.booter.ForkedBooter.invokeProviderInSameClassLoader(ForkedBooter.java:203)
06-Nov-2018 22:29:26         at org.apache.maven.surefire.booter.ForkedBooter.runSuitesInProcess(ForkedBooter.java:155)
06-Nov-2018 22:29:26         at org.apache.maven.surefire.booter.ForkedBooter.main(ForkedBooter.java:103)
06-Nov-2018 22:29:26
06-Nov-2018 22:29:26 Running org.springframework.cloud.dataflow.acceptance.test.util.PlatformHelperTests
06-Nov-2018 22:29:26 Tests run: 3, Failures: 0, Errors: 0, Skipped: 0, Time elapsed: 0.036 sec - in org.springframework.cloud.dataflow.acceptance.test.util.PlatformHelperTests
06-Nov-2018 22:29:26 Running org.springframework.cloud.dataflow.acceptance.test.util.ApplicationTests
06-Nov-2018 22:29:26 Tests run: 2, Failures: 0, Errors: 0, Skipped: 0, Time elapsed: 0.001 sec - in org.springframework.cloud.dataflow.acceptance.test.util.ApplicationTests
06-Nov-2018 22:29:26 2018-11-06 22:29:26.411  INFO 6439 --- [       Thread-6] o.s.c.support.GenericApplicationContext  : Closing org.springframework.context.support.GenericApplicationContext@2aff9dff: startup date [Tue Nov 06 22:29:24 UTC 2018]; root of context hierarchy
06-Nov-2018 22:29:26
06-Nov-2018 22:29:26 Results :
06-Nov-2018 22:29:26
06-Nov-2018 22:29:26 Tests in error:
06-Nov-2018 22:29:26   AnalyticsTests.analyticsTest » BeanCreation Error creating bean with name 'org...
06-Nov-2018 22:29:26   HttpSourceTests.httpSourceTests » BeanCreation Error creating bean with name '...
06-Nov-2018 22:29:26   NamedChannelTests.directedGraphTest » BeanCreation Error creating bean with na...
06-Nov-2018 22:29:26   NamedChannelTests.manyToOneTest » BeanCreation Error creating bean with name '...
06-Nov-2018 22:29:26   NamedChannelTests.testDestination » BeanCreation Error creating bean with name...
06-Nov-2018 22:29:26   NamedChannelTests.testTap » BeanCreation Error creating bean with name 'org.sp...
06-Nov-2018 22:29:26   TickTockTests.tickTockTests » BeanCreation Error creating bean with name 'org....
06-Nov-2018 22:29:26   TickTockTests.tickTockTestsFromConfigServer » BeanCreation Error creating bean...
06-Nov-2018 22:29:26   TimestampTaskTests.timeStampTests » BeanCreation Error creating bean with name...
06-Nov-2018 22:29:26   TimestampTaskTests.timeStampTestsMultipleLaunch » BeanCreation Error creating ...
06-Nov-2018 22:29:26   TransformTests.transformTests » BeanCreation Error creating bean with name 'or...
06-Nov-2018 22:29:26   WoodChuckTests.testPartitioning » BeanCreation Error creating bean with name '...
06-Nov-2018 22:29:26
06-Nov-2018 22:29:26 Tests run: 18, Failures: 0, Errors: 12, Skipped: 1
06-Nov-2018 22:29:26
06-Nov-2018 22:29:26 [INFO] ------------------------------------------------------------------------
06-Nov-2018 22:29:26 [INFO] BUILD FAILURE
06-Nov-2018 22:29:26 [INFO] ------------------------------------------------------------------------
06-Nov-2018 22:29:26 [INFO] Total time: 18.735 s
06-Nov-2018 22:29:26 [INFO] Finished at: 2018-11-06T22:29:26+00:00
06-Nov-2018 22:29:26 [INFO] Final Memory: 56M/410M
06-Nov-2018 22:29:26 [INFO] ------------------------------------------------------------------------
06-Nov-2018 22:29:26 [ERROR] Failed to execute goal org.apache.maven.plugins:maven-surefire-plugin:2.18.1:test (default-test) on project spring-cloud-dataflow-acceptance-tests: There are test failures.
06-Nov-2018 22:29:26 [ERROR]
06-Nov-2018 22:29:26 [ERROR] Please refer to /opt/bamboo-home/xml-data/build-dir/SCDT-LOCAL20XSKIPPER20X-RABBIT/target/surefire-reports for the individual test results.
06-Nov-2018 22:29:26 [ERROR] -> [Help 1]
06-Nov-2018 22:29:26 [ERROR]
06-Nov-2018 22:29:26 [ERROR] To see the full stack trace of the errors, re-run Maven with the -e switch.
06-Nov-2018 22:29:26 [ERROR] Re-run Maven using the -X switch to enable full debug logging.
06-Nov-2018 22:29:26 [ERROR]
06-Nov-2018 22:29:26 [ERROR] For more information about the errors and possible solutions, please read the following articles:
06-Nov-2018 22:29:26 [ERROR] [Help 1] http://cwiki.apache.org/confluence/display/MAVEN/MojoFailureException
06-Nov-2018 22:29:26 Clean up, clean up, everybody everywhere; clean up clean up, everybody do your share!
06-Nov-2018 22:29:26 Killing process PID [6297]
06-Nov-2018 22:29:27 No stopped containers
06-Nov-2018 22:29:28 Stopping mysql_mysql_1 ...
06-Nov-2018 22:29:29
06-Nov-2018 22:29:29 Stopping mysql_mysql_1 ... done
06-Nov-2018 22:29:30 Removing mysql_mysql_1 ...
06-Nov-2018 22:29:30
06-Nov-2018 22:29:30 Removing mysql_mysql_1 ... done
06-Nov-2018 22:29:30 Going to remove mysql_mysql_1
06-Nov-2018 22:29:31 No stopped containers
06-Nov-2018 22:29:31
06-Nov-2018 22:29:31 Finished task 'Execute Acceptance Tests' with result: Success
06-Nov-2018 22:29:31 Starting task 'JUnit Parser' of type 'com.atlassian.bamboo.plugins.testresultparser:task.testresultparser.junit'
06-Nov-2018 22:29:31 Parsing test results under /opt/bamboo-home/xml-data/build-dir/SCDT-LOCAL20XSKIPPER20X-RABBIT...
06-Nov-2018 22:29:31 Failing task since 12 failing test cases were found.
06-Nov-2018 22:29:31 Finished task 'JUnit Parser' with result: Failed
06-Nov-2018 22:29:31 Starting task 'clean up' of type 'com.atlassian.bamboo.plugins.scripttask:task.builder.script'
06-Nov-2018 22:29:31
Beginning to execute external process for build 'Spring Cloud Data Flow Acceptance Tests - Local + SCDF-2.0.0.BS + Skipper 2.0.0.BS - Run Data Flow Acceptance Tests for Rabbit #2 (SCDT-LOCAL20XSKIPPER20X-RABBIT-2)'
... running command line:
/opt/bamboo-home/temp/SCDT-LOCAL20XSKIPPER20X-RABBIT-2-ScriptBuildTask-7213876961773859030.sh
... in: /opt/bamboo-home/xml-data/build-dir/SCDT-LOCAL20XSKIPPER20X-RABBIT
... using extra environment variables:
bamboo_planRepository_1_branch=master
bamboo_signing_store_password=********
bamboo_capability_system_builder_ant_Ant_1_9=/opt/ant-1.9
bamboo_capability_system_builder_ant_Ant_1_8=/opt/ant-1.8
bamboo_planRepository_1_branchDisplayName=master
bamboo_repository_274694331_git_username=spring-buildmaster
bamboo_capability_system_jdk_OpenJDK_7u181=/opt/openjdk-7
bamboo_repository_revision_number=08e5bc520aba466c60a3788b41b49655670899b6
bamboo_capability_system_builder_node_Node_js_6=/usr/bin/node
bamboo_RIAK_BIN=/usr/sbin/riak
bamboo_buildKey=SCDT-LOCAL20XSKIPPER20X-RABBIT
bamboo_repository_274694331_branch_name=master
bamboo_sonar_token_password=********
bamboo_shortJobName=Run Data Flow Acceptance Tests for Rabbit
bamboo_capability_system_builder_gradle___gradlew=./gradlew
bamboo_buildResultsUrl=https://build.spring.io/browse/SCDT-LOCAL20XSKIPPER20X-RABBIT-2
bamboo_capability_system_builder_mvn3_Maven_3_3=/opt/maven-3.3
bamboo_capability_system_builder_mvn3_Maven_3_2=/opt/maven-3.2
bamboo_capability_system_builder_mvn3_Maven_3_1=/opt/maven-3.1
bamboo_planRepository_repositoryUrl=https://github.com/spring-cloud/spring-cloud-dataflow-acceptance-tests.git
bamboo_agentId=208568332
bamboo_capability_system_builder_mvn3_Maven_3_5=/opt/maven-3.5
bamboo_capability_system_builder_mvn3_Maven_3_0=/opt/maven-3.0
bamboo_planRepository_revision=08e5bc520aba466c60a3788b41b49655670899b6
bamboo_planRepository_previousRevision=0c83aa4efad4b0e7540794d10f3ecde4f6a5a6d6
bamboo_capability_remote_build=true
bamboo_repository_branch_name=master
bamboo_repository_274694331_name=Git
bamboo_scdf_acceptance_tests_password=********
bamboo_dependenciesDisabled=false
bamboo_repository_274694331_git_branch=master
bamboo_capability_Agent=bamboo-08.af.pivotal.io
bamboo_planRepository_branch=master
bamboo_planRepository_1_type=gitv2
bamboo_planRepository_branchName=master
bamboo_sonar_password=********
bamboo_hg_cache_directory=/opt/bamboo-home/xml-data/build-dir/_hg-repositories-cache
bamboo_planRepository_1_username=spring-buildmaster
bamboo_repository_274694331_git_repositoryUrl=https://github.com/spring-cloud/spring-cloud-dataflow-acceptance-tests.git
bamboo_planRepository_type=gitv2
bamboo_ManualBuildTriggerReason_userName=mpollack
bamboo_git_cache_directory=/opt/bamboo-home/xml-data/build-dir/_git-repositories-cache
bamboo_artifactory_username=buildmaster
bamboo_tmp_directory=/opt/bamboo-home/temp
bamboo_planKey=SCDT-LOCAL20XSKIPPER20X
bamboo_planRepository_username=spring-buildmaster
bamboo_JDK8_HOME=/opt/jdk-8
bamboo_repository_274694331_previous_revision_number=0c83aa4efad4b0e7540794d10f3ecde4f6a5a6d6
bamboo_planRepository_1_branchName=master
bamboo_sonar_version=5.6.3
bamboo_capability_system_jdk_JDK_1_11=/opt/jdk-11
bamboo_resultsUrl=https://build.spring.io/browse/SCDT-LOCAL20XSKIPPER20X-RABBIT-2
bamboo_capability_system_jdk_JDK_1_10=/opt/jdk-10
bamboo_build_working_directory=/opt/bamboo-home/xml-data/build-dir/SCDT-LOCAL20XSKIPPER20X-RABBIT
bamboo_planRepository_1_name=Git
bamboo_capability_system_os=ubuntu1604
bamboo_nexusPush_stagingProfile=buildmaster
bamboo_shortPlanName=Local + SCDF-2.0.0.BS + Skipper 2.0.0.BS
bamboo_planRepository_name=Git
bamboo_buildNumber=2
bamboo_planName=Spring Cloud Data Flow Acceptance Tests - Local + SCDF-2.0.0.BS + Skipper 2.0.0.BS
bamboo_JDK7_HOME=/opt/jdk-7
bamboo_build_commandline_com_atlassian_bamboo_plugins_scripttask_task_builder_script_7=/opt/bamboo-home/temp/SCDT-LOCAL20XSKIPPER20X-RABBIT-2-ScriptBuildTask-5048334585015912259.sh
bamboo_shortPlanKey=LOCAL20XSKIPPER20X
bamboo_shortJobKey=RABBIT
bamboo_artifactory_password=********
bamboo_buildTimeStamp=2018-11-06T22:22:05.128Z
bamboo_repository_previous_revision_number=0c83aa4efad4b0e7540794d10f3ecde4f6a5a6d6
bamboo_sonar_username=buildmaster
bamboo_repository_git_branch=master
bamboo_buildResultKey=SCDT-LOCAL20XSKIPPER20X-RABBIT-2
bamboo_nexusPush_close=true
bamboo_buildPlanName=Spring Cloud Data Flow Acceptance Tests - Local + SCDF-2.0.0.BS + Skipper 2.0.0.BS - Run Data Flow Acceptance Tests for Rabbit
bamboo_repository_274694331_revision_number=08e5bc520aba466c60a3788b41b49655670899b6
bamboo_planRepository_1_revision=08e5bc520aba466c60a3788b41b49655670899b6
bamboo_repository_name=Git
bamboo_signing_key_password=********
bamboo_buildFailed=true
bamboo_capability_system_docker_executable=/usr/bin/docker
bamboo_capability_system_builder_groovy_Groovy_2_4=/opt/groovy-2.4
bamboo_capability_system_builder_command_Bash=/bin/bash
bamboo_jobFailed=true
bamboo_agentWorkingDirectory=/opt/bamboo-home/xml-data/build-dir
bamboo_capability_system_git_executable=/usr/bin/git
bamboo_repository_git_username=spring-buildmaster
bamboo_planRepository_1_previousRevision=0c83aa4efad4b0e7540794d10f3ecde4f6a5a6d6
bamboo_capability_os_family=unix
bamboo_planRepository_branchDisplayName=master
bamboo_capability_system_builder_maven_Artifactory_Maven_3_5=/opt/maven-3.5
bamboo_capability_system_builder_maven_Artifactory_Maven_3_3=/opt/maven-3.3
bamboo_capability_system_builder_maven_Artifactory_Maven_3_2=/opt/maven-3.2
bamboo_s3_properties=/home/bamboo/tools/s3.properties
bamboo_capability_system_builder_maven_Artifactory_Maven_3_1=/opt/maven-3.1
bamboo_capability_system_builder_maven_Artifactory_Maven_3_0=/opt/maven-3.0
bamboo_plan_storageTag=plan-274497908
bamboo_repository_git_repositoryUrl=https://github.com/spring-cloud/spring-cloud-dataflow-acceptance-tests.git
bamboo_working_directory=/opt/bamboo-home/xml-data/build-dir/SCDT-LOCAL20XSKIPPER20X-RABBIT
bamboo_planRepository_1_repositoryUrl=https://github.com/spring-cloud/spring-cloud-dataflow-acceptance-tests.git
bamboo_capability_system_jdk_JDK_1_8=/opt/jdk-8
bamboo_capability_system_jdk_JDK_1_9=/opt/jdk-9
bamboo_capability_system_jdk_JDK_1_6=/opt/jdk-6
bamboo_capability_system_jdk_JDK_1_7=/opt/jdk-7
bamboo_sonar_ip=10.194.6.9
06-Nov-2018 22:29:31 CLEANING UP RESOURCES AFTER RUNNING TESTS
06-Nov-2018 22:29:31 Environment variable JAVA_HOME must be set
06-Nov-2018 22:29:31 FINISHED CLEANING UP RESOURCES
06-Nov-2018 22:29:31 Finished task 'clean up' with result: Success
06-Nov-2018 22:29:31 Running post build plugin 'Docker Container Cleanup'
06-Nov-2018 22:29:31 Running post build plugin 'NCover Results Collector'
06-Nov-2018 22:29:31 Running post build plugin 'Artifactory Release Management Staging'
06-Nov-2018 22:29:31 Running post build plugin 'Artifactory Build Info Copier'
06-Nov-2018 22:29:31 Running post build plugin 'Artifactory Gradle Properties Info Copier'
06-Nov-2018 22:29:31 Running post build plugin 'Clover Results Collector'
06-Nov-2018 22:29:31 Running post build plugin 'npm Cache Cleanup'
06-Nov-2018 22:29:31 Running post build plugin 'Artifact Copier'
06-Nov-2018 22:29:31 Publishing an artifact: Test Results
06-Nov-2018 22:29:33 Finished publishing of artifact Job artifact: [Test Results], pattern: [**/target/surefire-reports/**/*.*] in 2.355 s
06-Nov-2018 22:29:33 Publishing an artifact: App and Server Logs
06-Nov-2018 22:29:33 Finished publishing of artifact Job artifact: [App and Server Logs], pattern: [**/*.log] anchored at: [local] in 36.09 ms
06-Nov-2018 22:29:33 Successfully removed working directory at '/opt/bamboo-home/xml-data/build-dir/SCDT-LOCAL20XSKIPPER20X-RABBIT'
06-Nov-2018 22:29:33 Finalising the build...
06-Nov-2018 22:29:33 Stopping timer.
06-Nov-2018 22:29:33 Build SCDT-LOCAL20XSKIPPER20X-RABBIT-2 completed.
06-Nov-2018 22:29:34 Running on server: post build plugin 'NCover Results Collector'
06-Nov-2018 22:29:34 Running on server: post build plugin 'Build Hanging Detection Configuration'
06-Nov-2018 22:29:34 Running on server: post build plugin 'Clover Delta Calculator'
06-Nov-2018 22:29:34 Running on server: post build plugin 'Maven Dependencies Postprocessor'
06-Nov-2018 22:29:34 All post build plugins have finished
06-Nov-2018 22:29:34 Generating build results summary...
06-Nov-2018 22:29:34 Saving build results to disk...
06-Nov-2018 22:29:34 Logging substituted variables...
06-Nov-2018 22:29:34 Indexing build results...
06-Nov-2018 22:29:34 Finished building SCDT-LOCAL20XSKIPPER20X-RABBIT-2.
06-Nov-2018 22:42:22 Build Spring Cloud Data Flow Acceptance Tests - Local + SCDF-2.0.0.BS + Skipper 2.0.0.BS - Run Data Flow Acceptance Tests for Rabbit #2 (SCDT-LOCAL20XSKIPPER20X-RABBIT-2) started building on agent bamboo-06.af.pivotal.io
06-Nov-2018 22:42:22 Remote agent on host bamboo-06.af.pivotal.io
06-Nov-2018 22:42:22 Build working directory is /opt/bamboo-home/xml-data/build-dir/SCDT-LOCAL20XSKIPPER20X-RABBIT
06-Nov-2018 22:42:22 Executing build Spring Cloud Data Flow Acceptance Tests - Local + SCDF-2.0.0.BS + Skipper 2.0.0.BS - Run Data Flow Acceptance Tests for Rabbit #2 (SCDT-LOCAL20XSKIPPER20X-RABBIT-2)
06-Nov-2018 22:42:22 Starting task 'Checkout Default Repository' of type 'com.atlassian.bamboo.plugins.vcs:task.vcs.checkout'
06-Nov-2018 22:42:22 Checking out into /opt/bamboo-home/xml-data/build-dir/SCDT-LOCAL20XSKIPPER20X-RABBIT
06-Nov-2018 22:42:22 Updating source code to revision: 08e5bc520aba466c60a3788b41b49655670899b6
06-Nov-2018 22:42:22 Creating local git repository in '/opt/bamboo-home/xml-data/build-dir/SCDT-LOCAL20XSKIPPER20X-RABBIT/.git'.
06-Nov-2018 22:42:22 Initialized empty Git repository in /opt/bamboo-home/xml-data/build-dir/SCDT-LOCAL20XSKIPPER20X-RABBIT/.git/
06-Nov-2018 22:42:22 Fetching 'refs/heads/master' from 'https://github.com/spring-cloud/spring-cloud-dataflow-acceptance-tests.git'.
06-Nov-2018 22:42:25 From https://github.com/spring-cloud/spring-cloud-dataflow-acceptance-tests
06-Nov-2018 22:42:25 * [new branch]      master     -> master
06-Nov-2018 22:42:25 Checking out revision 08e5bc520aba466c60a3788b41b49655670899b6.
06-Nov-2018 22:42:25 Already on 'master'
06-Nov-2018 22:42:25 Updated source code to revision: 08e5bc520aba466c60a3788b41b49655670899b6
06-Nov-2018 22:42:25 Finished task 'Checkout Default Repository' with result: Success
06-Nov-2018 22:42:25 Running pre-build action: Artifactory Release Staging
06-Nov-2018 22:42:25 Running pre-build action: VCS Version Collector
06-Nov-2018 22:42:25 Starting task 'Execute Acceptance Tests' of type 'com.atlassian.bamboo.plugins.scripttask:task.builder.script'
06-Nov-2018 22:42:25
Beginning to execute external process for build 'Spring Cloud Data Flow Acceptance Tests - Local + SCDF-2.0.0.BS + Skipper 2.0.0.BS - Run Data Flow Acceptance Tests for Rabbit #2 (SCDT-LOCAL20XSKIPPER20X-RABBIT-2)'
... running command line:
/opt/bamboo-home/temp/SCDT-LOCAL20XSKIPPER20X-RABBIT-2-ScriptBuildTask-7576486434938353207.sh
... in: /opt/bamboo-home/xml-data/build-dir/SCDT-LOCAL20XSKIPPER20X-RABBIT
... using extra environment variables:
bamboo_planRepository_1_branch=master
bamboo_signing_store_password=********
bamboo_capability_system_builder_ant_Ant_1_9=/opt/ant-1.9
bamboo_capability_system_builder_ant_Ant_1_8=/opt/ant-1.8
bamboo_planRepository_1_branchDisplayName=master
bamboo_repository_274694331_git_username=spring-buildmaster
bamboo_capability_system_jdk_OpenJDK_7u181=/opt/openjdk-7
bamboo_repository_revision_number=08e5bc520aba466c60a3788b41b49655670899b6
bamboo_capability_system_builder_node_Node_js_6=/usr/bin/node
bamboo_RIAK_BIN=/usr/sbin/riak
bamboo_buildKey=SCDT-LOCAL20XSKIPPER20X-RABBIT
bamboo_repository_274694331_branch_name=master
bamboo_sonar_token_password=********
bamboo_shortJobName=Run Data Flow Acceptance Tests for Rabbit
bamboo_capability_system_builder_gradle___gradlew=./gradlew
bamboo_buildResultsUrl=https://build.spring.io/browse/SCDT-LOCAL20XSKIPPER20X-RABBIT-2
bamboo_capability_system_builder_mvn3_Maven_3_3=/opt/maven-3.3
bamboo_capability_system_builder_mvn3_Maven_3_2=/opt/maven-3.2
bamboo_capability_system_builder_mvn3_Maven_3_1=/opt/maven-3.1
bamboo_planRepository_repositoryUrl=https://github.com/spring-cloud/spring-cloud-dataflow-acceptance-tests.git
bamboo_agentId=208568327
bamboo_capability_system_builder_mvn3_Maven_3_5=/opt/maven-3.5
bamboo_capability_system_builder_mvn3_Maven_3_0=/opt/maven-3.0
bamboo_planRepository_revision=08e5bc520aba466c60a3788b41b49655670899b6
bamboo_planRepository_previousRevision=0c83aa4efad4b0e7540794d10f3ecde4f6a5a6d6
bamboo_capability_remote_build=true
bamboo_repository_branch_name=master
bamboo_repository_274694331_name=Git
bamboo_scdf_acceptance_tests_password=********
JAVA_HOME=/opt/jdk-8
bamboo_dependenciesDisabled=false
bamboo_repository_274694331_git_branch=master
bamboo_capability_Agent=bamboo-06.af.pivotal.io
bamboo_planRepository_branch=master
bamboo_planRepository_1_type=gitv2
bamboo_planRepository_branchName=master
bamboo_sonar_password=********
bamboo_hg_cache_directory=/opt/bamboo-home/xml-data/build-dir/_hg-repositories-cache
bamboo_planRepository_1_username=spring-buildmaster
bamboo_repository_274694331_git_repositoryUrl=https://github.com/spring-cloud/spring-cloud-dataflow-acceptance-tests.git
bamboo_planRepository_type=gitv2
bamboo_ManualBuildTriggerReason_userName=mpollack
bamboo_git_cache_directory=/opt/bamboo-home/xml-data/build-dir/_git-repositories-cache
bamboo_artifactory_username=buildmaster
bamboo_tmp_directory=/opt/bamboo-home/temp
bamboo_planKey=SCDT-LOCAL20XSKIPPER20X
bamboo_planRepository_username=spring-buildmaster
bamboo_JDK8_HOME=/opt/jdk-8
bamboo_repository_274694331_previous_revision_number=0c83aa4efad4b0e7540794d10f3ecde4f6a5a6d6
bamboo_planRepository_1_branchName=master
bamboo_sonar_version=5.6.3
bamboo_capability_system_jdk_JDK_1_11=/opt/jdk-11
bamboo_resultsUrl=https://build.spring.io/browse/SCDT-LOCAL20XSKIPPER20X-RABBIT-2
bamboo_capability_system_jdk_JDK_1_10=/opt/jdk-10
bamboo_build_working_directory=/opt/bamboo-home/xml-data/build-dir/SCDT-LOCAL20XSKIPPER20X-RABBIT
bamboo_planRepository_1_name=Git
bamboo_capability_system_os=ubuntu1604
bamboo_nexusPush_stagingProfile=buildmaster
bamboo_shortPlanName=Local + SCDF-2.0.0.BS + Skipper 2.0.0.BS
bamboo_planRepository_name=Git
bamboo_buildNumber=2
bamboo_ManualBuildTriggerReason_stageName=Test Stage - Rabbit
bamboo_planName=Spring Cloud Data Flow Acceptance Tests - Local + SCDF-2.0.0.BS + Skipper 2.0.0.BS
bamboo_JDK7_HOME=/opt/jdk-7
bamboo_build_commandline_com_atlassian_bamboo_plugins_scripttask_task_builder_script_7=/opt/bamboo-home/temp/SCDT-LOCAL20XSKIPPER20X-RABBIT-2-ScriptBuildTask-5048334585015912259.sh
bamboo_build_commandline_com_atlassian_bamboo_plugins_scripttask_task_builder_script_9=/opt/bamboo-home/temp/SCDT-LOCAL20XSKIPPER20X-RABBIT-2-ScriptBuildTask-7213876961773859030.sh
bamboo_shortPlanKey=LOCAL20XSKIPPER20X
bamboo_shortJobKey=RABBIT
bamboo_artifactory_password=********
bamboo_buildTimeStamp=2018-11-06T22:42:21.349Z
bamboo_repository_previous_revision_number=0c83aa4efad4b0e7540794d10f3ecde4f6a5a6d6
bamboo_sonar_username=buildmaster
bamboo_repository_git_branch=master
bamboo_buildResultKey=SCDT-LOCAL20XSKIPPER20X-RABBIT-2
bamboo_nexusPush_close=true
bamboo_buildPlanName=Spring Cloud Data Flow Acceptance Tests - Local + SCDF-2.0.0.BS + Skipper 2.0.0.BS - Run Data Flow Acceptance Tests for Rabbit
bamboo_repository_274694331_revision_number=08e5bc520aba466c60a3788b41b49655670899b6
bamboo_planRepository_1_revision=08e5bc520aba466c60a3788b41b49655670899b6
bamboo_repository_name=Git
bamboo_signing_key_password=********
bamboo_buildFailed=false
bamboo_capability_system_docker_executable=/usr/bin/docker
bamboo_capability_system_builder_groovy_Groovy_2_4=/opt/groovy-2.4
bamboo_capability_system_builder_command_Bash=/bin/bash
bamboo_agentWorkingDirectory=/opt/bamboo-home/xml-data/build-dir
bamboo_capability_system_git_executable=/usr/bin/git
bamboo_repository_git_username=spring-buildmaster
bamboo_planRepository_1_previousRevision=0c83aa4efad4b0e7540794d10f3ecde4f6a5a6d6
bamboo_capability_os_family=unix
bamboo_planRepository_branchDisplayName=master
bamboo_capability_system_builder_maven_Artifactory_Maven_3_5=/opt/maven-3.5
bamboo_capability_system_builder_maven_Artifactory_Maven_3_3=/opt/maven-3.3
bamboo_capability_system_builder_maven_Artifactory_Maven_3_2=/opt/maven-3.2
bamboo_s3_properties=/home/bamboo/tools/s3.properties
bamboo_capability_system_builder_maven_Artifactory_Maven_3_1=/opt/maven-3.1
bamboo_capability_system_builder_maven_Artifactory_Maven_3_0=/opt/maven-3.0
bamboo_plan_storageTag=plan-274497908
bamboo_repository_git_repositoryUrl=https://github.com/spring-cloud/spring-cloud-dataflow-acceptance-tests.git
bamboo_working_directory=/opt/bamboo-home/xml-data/build-dir/SCDT-LOCAL20XSKIPPER20X-RABBIT
bamboo_RerunBuildTriggerReason_noOfRetries=1
bamboo_planRepository_1_repositoryUrl=https://github.com/spring-cloud/spring-cloud-dataflow-acceptance-tests.git
bamboo_capability_system_jdk_JDK_1_8=/opt/jdk-8
bamboo_capability_system_jdk_JDK_1_9=/opt/jdk-9
bamboo_capability_system_jdk_JDK_1_6=/opt/jdk-6
bamboo_capability_system_jdk_JDK_1_7=/opt/jdk-7
bamboo_sonar_ip=10.194.6.9
06-Nov-2018 22:42:25 CLEANING UP RESOURCES BEFORE RUNNING TESTS
06-Nov-2018 22:42:25 Setting the environment variables
06-Nov-2018 22:42:25 Export the unset env. variables from /opt/bamboo-home/xml-data/build-dir/SCDT-LOCAL20XSKIPPER20X-RABBIT/local/init/env.properties :
06-Nov-2018 22:42:25    SPRING_CLOUD_DATAFLOW_SERVER_DOWNLOAD_URL = http://repo.spring.io/libs-snapshot/org/springframework/cloud/spring-cloud-dataflow-server-local//spring-cloud-dataflow-server-local-.jar
06-Nov-2018 22:42:25    SPRING_CLOUD_SKIPPER_SERVER_DOWNLOAD_URL = http://repo.spring.io/libs-snapshot/org/springframework/cloud/spring-cloud-skipper-server//spring-cloud-skipper-server-.jar
06-Nov-2018 22:42:25    SPRING_DATASOURCE_USERNAME = spring
06-Nov-2018 22:42:25    SPRING_DATASOURCE_PASSWORD = cloud
06-Nov-2018 22:42:25    SPRING_SCHEMA_NAME = dataflow
06-Nov-2018 22:42:25    DOCKER_SERVER = localhost
06-Nov-2018 22:42:25 Setting retries to 60 and WAIT_TIME to 5
06-Nov-2018 22:42:25 Export the unset env. variables from /opt/bamboo-home/xml-data/build-dir/SCDT-LOCAL20XSKIPPER20X-RABBIT/local/binder/rabbit/env.properties :
06-Nov-2018 22:42:25    STREAM_REGISTRATION_RESOURCE = http://repo.spring.io/libs-release/org/springframework/cloud/stream/app/spring-cloud-stream-app-descriptor/Celsius.SR3/spring-cloud-stream-app-descriptor-Celsius.SR3.stream-apps-rabbit-maven
06-Nov-2018 22:42:25    TASK_REGISTRATION_RESOURCE = http://repo.spring.io/libs-release/org/springframework/cloud/task/app/spring-cloud-task-app-descriptor/Clark.RELEASE/spring-cloud-task-app-descriptor-Clark.RELEASE.task-apps-maven
06-Nov-2018 22:42:25 SCDF SERVER URI: http://localhost:9393
06-Nov-2018 22:42:25 Clean up, clean up, everybody everywhere; clean up clean up, everybody do your share!
06-Nov-2018 22:42:26 No stopped containers
06-Nov-2018 22:42:26 No stopped containers
06-Nov-2018 22:42:27 No stopped containers
06-Nov-2018 22:42:27 FINISHED CLEANING UP RESOURCES
06-Nov-2018 22:42:27 Setting the environment variables
06-Nov-2018 22:42:27 Export the unset env. variables from /opt/bamboo-home/xml-data/build-dir/SCDT-LOCAL20XSKIPPER20X-RABBIT/local/init/env.properties :
06-Nov-2018 22:42:27    SPRING_CLOUD_DATAFLOW_SERVER_DOWNLOAD_URL = http://repo.spring.io/libs-snapshot/org/springframework/cloud/spring-cloud-dataflow-server-local/2.0.0.BUILD-SNAPSHOT/spring-cloud-dataflow-server-local-2.0.0.BUILD-SNAPSHOT.jar
06-Nov-2018 22:42:27    SPRING_CLOUD_SKIPPER_SERVER_DOWNLOAD_URL = http://repo.spring.io/libs-snapshot/org/springframework/cloud/spring-cloud-skipper-server/2.0.01.BUILD-SNAPSHOT/spring-cloud-skipper-server-2.0.01.BUILD-SNAPSHOT.jar
06-Nov-2018 22:42:27    SPRING_DATASOURCE_USERNAME = spring
06-Nov-2018 22:42:27    SPRING_DATASOURCE_PASSWORD = cloud
06-Nov-2018 22:42:27    SPRING_SCHEMA_NAME = dataflow
06-Nov-2018 22:42:27    DOCKER_SERVER = localhost
06-Nov-2018 22:42:27 Setting retries to 60 and WAIT_TIME to 5
06-Nov-2018 22:42:27 cleaning up any previous mysql docker containers...
06-Nov-2018 22:42:28 done cleaning up.
06-Nov-2018 22:42:28 Could not find a local mysql server, trying docker.
06-Nov-2018 22:42:29 Creating mysql_mysql_1
06-Nov-2018 22:42:31 mysql running on localhost:3306
06-Nov-2018 22:42:31 Service host is localhost
06-Nov-2018 22:42:31 cleaning up any previous rabbit docker containers...
06-Nov-2018 22:42:31 done cleaning up.
06-Nov-2018 22:42:32 rabbitmq found on localhost
06-Nov-2018 22:42:32 Export the unset env. variables from /opt/bamboo-home/xml-data/build-dir/SCDT-LOCAL20XSKIPPER20X-RABBIT/local/binder/rabbit/env.properties :
06-Nov-2018 22:42:32    STREAM_REGISTRATION_RESOURCE = http://repo.spring.io/libs-release/org/springframework/cloud/stream/app/spring-cloud-stream-app-descriptor/Celsius.SR3/spring-cloud-stream-app-descriptor-Celsius.SR3.stream-apps-rabbit-maven
06-Nov-2018 22:42:32    TASK_REGISTRATION_RESOURCE = http://repo.spring.io/libs-release/org/springframework/cloud/task/app/spring-cloud-task-app-descriptor/Clark.RELEASE/spring-cloud-task-app-descriptor-Clark.RELEASE.task-apps-maven
06-Nov-2018 22:42:32 cleaning up any previous redis docker containers...
06-Nov-2018 22:42:32 done cleaning up.
06-Nov-2018 22:42:33 redis found on localhost
06-Nov-2018 22:42:33 SKIPPER SERVER URI: http://localhost:7577
06-Nov-2018 22:42:33 Downloading server from http://repo.spring.io/libs-snapshot/org/springframework/cloud/spring-cloud-skipper-server/2.0.01.BUILD-SNAPSHOT/spring-cloud-skipper-server-2.0.01.BUILD-SNAPSHOT.jar
06-Nov-2018 22:42:34 http://repo.spring.io/libs-snapshot/org/springframework/cloud/spring-cloud-skipper-server/2.0.01.BUILD-SNAPSHOT/spring-cloud-skipper-server-2.0.01.BUILD-SNAPSHOT.jar:
06-Nov-2018 22:42:34 2018-11-06 22:42:34 ERROR 404: Not Found.
06-Nov-2018 22:42:34 executing [nohup /opt/jdk-8/bin/java  -Xmx1024m -Xss1024k -jar /opt/bamboo-home/xml-data/build-dir/SCDT-LOCAL20XSKIPPER20X-RABBIT/local/skipper-server/skipper-server.jar  --spring.datasource.driver-class-name=org.mariadb.jdbc.Driver --spring.datasource.url=jdbc:mysql://localhost/dataflow --spring.datasource.username=spring --spring.datasource.password=cloud  --spring.cloud.dataflow.applicationProperties.stream.spring.rabbitmq.host=127.0.0.1  --spring.redis.host=127.0.0.1 --spring.cloud.skipper.server.platform.local.accounts.default.workingDirectoriesRoot=/opt/bamboo-home/xml-data/build-dir/SCDT-LOCAL20XSKIPPER20X-RABBIT/local/skipper-server/app-logs > /opt/bamboo-home/xml-data/build-dir/SCDT-LOCAL20XSKIPPER20X-RABBIT/local/skipper-server/skipper-server.log &]
06-Nov-2018 22:42:34 [/opt/bamboo-home/xml-data/build-dir/SCDT-LOCAL20XSKIPPER20X-RABBIT/local/skipper-server] process pid is [28546]
06-Nov-2018 22:42:34 System props are []
06-Nov-2018 22:42:34 Logs are under [/opt/bamboo-home/xml-data/build-dir/SCDT-LOCAL20XSKIPPER20X-RABBIT/local/skipper-server/skipper-server.log] or from nohup [/opt/bamboo-home/xml-data/build-dir/SCDT-LOCAL20XSKIPPER20X-RABBIT/local/skipper-server/nohup.log]
06-Nov-2018 22:42:34 Failed to connect to localhost:7577. Attempt  #1/60... will try again in [5] seconds
06-Nov-2018 22:42:34 Error: Invalid or corrupt jarfile /opt/bamboo-home/xml-data/build-dir/SCDT-LOCAL20XSKIPPER20X-RABBIT/local/skipper-server/skipper-server.jar
06-Nov-2018 22:42:39 Failed to connect to localhost:7577. Attempt  #2/60... will try again in [5] seconds
06-Nov-2018 22:42:44 Failed to connect to localhost:7577. Attempt  #3/60... will try again in [5] seconds
06-Nov-2018 22:42:49 Failed to connect to localhost:7577. Attempt  #4/60... will try again in [5] seconds
06-Nov-2018 22:42:54 Failed to connect to localhost:7577. Attempt  #5/60... will try again in [5] seconds
06-Nov-2018 22:42:59 Failed to connect to localhost:7577. Attempt  #6/60... will try again in [5] seconds
06-Nov-2018 22:43:04 Failed to connect to localhost:7577. Attempt  #7/60... will try again in [5] seconds
06-Nov-2018 22:43:09 Failed to connect to localhost:7577. Attempt  #8/60... will try again in [5] seconds
06-Nov-2018 22:43:14 Failed to connect to localhost:7577. Attempt  #9/60... will try again in [5] seconds
06-Nov-2018 22:43:19 Failed to connect to localhost:7577. Attempt  #10/60... will try again in [5] seconds
06-Nov-2018 22:43:24 Failed to connect to localhost:7577. Attempt  #11/60... will try again in [5] seconds
06-Nov-2018 22:43:28
Request to stop 'SCDT-LOCAL20XSKIPPER20X-RABBIT-2' received from mpollack
06-Nov-2018 22:43:29 Failed to connect to localhost:7577. Attempt  #12/60... will try again in [5] seconds
06-Nov-2018 22:43:30 Failing task since return code of [/opt/bamboo-home/temp/SCDT-LOCAL20XSKIPPER20X-RABBIT-2-ScriptBuildTask-7576486434938353207.sh] was 143 while expected 0
06-Nov-2018 22:43:30 Finished task 'Execute Acceptance Tests' with result: Failed
06-Nov-2018 22:43:30 Starting task 'clean up' of type 'com.atlassian.bamboo.plugins.scripttask:task.builder.script'
06-Nov-2018 22:43:30
Beginning to execute external process for build 'Spring Cloud Data Flow Acceptance Tests - Local + SCDF-2.0.0.BS + Skipper 2.0.0.BS - Run Data Flow Acceptance Tests for Rabbit #2 (SCDT-LOCAL20XSKIPPER20X-RABBIT-2)'
... running command line:
/opt/bamboo-home/temp/SCDT-LOCAL20XSKIPPER20X-RABBIT-2-ScriptBuildTask-9140561143036026759.sh
... in: /opt/bamboo-home/xml-data/build-dir/SCDT-LOCAL20XSKIPPER20X-RABBIT
... using extra environment variables:
bamboo_planRepository_1_branch=master
bamboo_signing_store_password=********
bamboo_capability_system_builder_ant_Ant_1_9=/opt/ant-1.9
bamboo_capability_system_builder_ant_Ant_1_8=/opt/ant-1.8
bamboo_planRepository_1_branchDisplayName=master
bamboo_repository_274694331_git_username=spring-buildmaster
bamboo_capability_system_jdk_OpenJDK_7u181=/opt/openjdk-7
bamboo_repository_revision_number=08e5bc520aba466c60a3788b41b49655670899b6
bamboo_capability_system_builder_node_Node_js_6=/usr/bin/node
bamboo_RIAK_BIN=/usr/sbin/riak
bamboo_buildKey=SCDT-LOCAL20XSKIPPER20X-RABBIT
bamboo_repository_274694331_branch_name=master
bamboo_sonar_token_password=********
bamboo_shortJobName=Run Data Flow Acceptance Tests for Rabbit
bamboo_capability_system_builder_gradle___gradlew=./gradlew
bamboo_buildResultsUrl=https://build.spring.io/browse/SCDT-LOCAL20XSKIPPER20X-RABBIT-2
bamboo_capability_system_builder_mvn3_Maven_3_3=/opt/maven-3.3
bamboo_capability_system_builder_mvn3_Maven_3_2=/opt/maven-3.2
bamboo_capability_system_builder_mvn3_Maven_3_1=/opt/maven-3.1
bamboo_planRepository_repositoryUrl=https://github.com/spring-cloud/spring-cloud-dataflow-acceptance-tests.git
bamboo_agentId=208568327
bamboo_capability_system_builder_mvn3_Maven_3_5=/opt/maven-3.5
bamboo_capability_system_builder_mvn3_Maven_3_0=/opt/maven-3.0
bamboo_planRepository_revision=08e5bc520aba466c60a3788b41b49655670899b6
bamboo_planRepository_previousRevision=0c83aa4efad4b0e7540794d10f3ecde4f6a5a6d6
bamboo_capability_remote_build=true
bamboo_repository_branch_name=master
bamboo_repository_274694331_name=Git
bamboo_scdf_acceptance_tests_password=********
bamboo_dependenciesDisabled=false
bamboo_repository_274694331_git_branch=master
bamboo_capability_Agent=bamboo-06.af.pivotal.io
bamboo_planRepository_branch=master
bamboo_planRepository_1_type=gitv2
bamboo_planRepository_branchName=master
bamboo_sonar_password=********
bamboo_hg_cache_directory=/opt/bamboo-home/xml-data/build-dir/_hg-repositories-cache
bamboo_planRepository_1_username=spring-buildmaster
bamboo_repository_274694331_git_repositoryUrl=https://github.com/spring-cloud/spring-cloud-dataflow-acceptance-tests.git
bamboo_planRepository_type=gitv2
bamboo_ManualBuildTriggerReason_userName=mpollack
bamboo_git_cache_directory=/opt/bamboo-home/xml-data/build-dir/_git-repositories-cache
bamboo_artifactory_username=buildmaster
bamboo_tmp_directory=/opt/bamboo-home/temp
bamboo_planKey=SCDT-LOCAL20XSKIPPER20X
bamboo_planRepository_username=spring-buildmaster
bamboo_JDK8_HOME=/opt/jdk-8
bamboo_repository_274694331_previous_revision_number=0c83aa4efad4b0e7540794d10f3ecde4f6a5a6d6
bamboo_planRepository_1_branchName=master
bamboo_sonar_version=5.6.3
bamboo_capability_system_jdk_JDK_1_11=/opt/jdk-11
bamboo_resultsUrl=https://build.spring.io/browse/SCDT-LOCAL20XSKIPPER20X-RABBIT-2
bamboo_capability_system_jdk_JDK_1_10=/opt/jdk-10
bamboo_build_working_directory=/opt/bamboo-home/xml-data/build-dir/SCDT-LOCAL20XSKIPPER20X-RABBIT
bamboo_planRepository_1_name=Git
bamboo_capability_system_os=ubuntu1604
bamboo_nexusPush_stagingProfile=buildmaster
bamboo_shortPlanName=Local + SCDF-2.0.0.BS + Skipper 2.0.0.BS
bamboo_planRepository_name=Git
bamboo_buildNumber=2
bamboo_ManualBuildTriggerReason_stageName=Test Stage - Rabbit
bamboo_planName=Spring Cloud Data Flow Acceptance Tests - Local + SCDF-2.0.0.BS + Skipper 2.0.0.BS
bamboo_JDK7_HOME=/opt/jdk-7
bamboo_build_commandline_com_atlassian_bamboo_plugins_scripttask_task_builder_script_7=/opt/bamboo-home/temp/SCDT-LOCAL20XSKIPPER20X-RABBIT-2-ScriptBuildTask-7576486434938353207.sh
bamboo_build_commandline_com_atlassian_bamboo_plugins_scripttask_task_builder_script_9=/opt/bamboo-home/temp/SCDT-LOCAL20XSKIPPER20X-RABBIT-2-ScriptBuildTask-7213876961773859030.sh
bamboo_shortPlanKey=LOCAL20XSKIPPER20X
bamboo_shortJobKey=RABBIT
bamboo_artifactory_password=********
bamboo_buildTimeStamp=2018-11-06T22:42:21.349Z
bamboo_repository_previous_revision_number=0c83aa4efad4b0e7540794d10f3ecde4f6a5a6d6
bamboo_sonar_username=buildmaster
bamboo_repository_git_branch=master
bamboo_buildResultKey=SCDT-LOCAL20XSKIPPER20X-RABBIT-2
bamboo_nexusPush_close=true
bamboo_buildPlanName=Spring Cloud Data Flow Acceptance Tests - Local + SCDF-2.0.0.BS + Skipper 2.0.0.BS - Run Data Flow Acceptance Tests for Rabbit
bamboo_repository_274694331_revision_number=08e5bc520aba466c60a3788b41b49655670899b6
bamboo_planRepository_1_revision=08e5bc520aba466c60a3788b41b49655670899b6
bamboo_repository_name=Git
bamboo_signing_key_password=********
bamboo_buildFailed=true
bamboo_capability_system_docker_executable=/usr/bin/docker
bamboo_capability_system_builder_groovy_Groovy_2_4=/opt/groovy-2.4
bamboo_capability_system_builder_command_Bash=/bin/bash
bamboo_jobFailed=true
bamboo_agentWorkingDirectory=/opt/bamboo-home/xml-data/build-dir
bamboo_capability_system_git_executable=/usr/bin/git
bamboo_repository_git_username=spring-buildmaster
bamboo_planRepository_1_previousRevision=0c83aa4efad4b0e7540794d10f3ecde4f6a5a6d6
bamboo_capability_os_family=unix
bamboo_planRepository_branchDisplayName=master
bamboo_capability_system_builder_maven_Artifactory_Maven_3_5=/opt/maven-3.5
bamboo_capability_system_builder_maven_Artifactory_Maven_3_3=/opt/maven-3.3
bamboo_capability_system_builder_maven_Artifactory_Maven_3_2=/opt/maven-3.2
bamboo_s3_properties=/home/bamboo/tools/s3.properties
bamboo_capability_system_builder_maven_Artifactory_Maven_3_1=/opt/maven-3.1
bamboo_capability_system_builder_maven_Artifactory_Maven_3_0=/opt/maven-3.0
bamboo_plan_storageTag=plan-274497908
bamboo_repository_git_repositoryUrl=https://github.com/spring-cloud/spring-cloud-dataflow-acceptance-tests.git
bamboo_working_directory=/opt/bamboo-home/xml-data/build-dir/SCDT-LOCAL20XSKIPPER20X-RABBIT
bamboo_RerunBuildTriggerReason_noOfRetries=1
bamboo_planRepository_1_repositoryUrl=https://github.com/spring-cloud/spring-cloud-dataflow-acceptance-tests.git
bamboo_capability_system_jdk_JDK_1_8=/opt/jdk-8
bamboo_capability_system_jdk_JDK_1_9=/opt/jdk-9
bamboo_capability_system_jdk_JDK_1_6=/opt/jdk-6
bamboo_capability_system_jdk_JDK_1_7=/opt/jdk-7
bamboo_sonar_ip=10.194.6.9
06-Nov-2018 22:43:30 CLEANING UP RESOURCES AFTER RUNNING TESTS
06-Nov-2018 22:43:30 Environment variable JAVA_HOME must be set
06-Nov-2018 22:43:30 FINISHED CLEANING UP RESOURCES
06-Nov-2018 22:43:30 Finished task 'clean up' with result: Success
06-Nov-2018 22:43:30 Running post build plugin 'Docker Container Cleanup'
06-Nov-2018 22:43:30 Running post build plugin 'NCover Results Collector'
06-Nov-2018 22:43:30 Running post build plugin 'Artifactory Release Management Staging'
06-Nov-2018 22:43:30 Running post build plugin 'Artifactory Build Info Copier'
06-Nov-2018 22:43:30 Running post build plugin 'Artifactory Gradle Properties Info Copier'
06-Nov-2018 22:43:30 Running post build plugin 'Clover Results Collector'
06-Nov-2018 22:43:30 Running post build plugin 'npm Cache Cleanup'
06-Nov-2018 22:43:30 Running post build plugin 'Artifact Copier'
06-Nov-2018 22:43:30 Publishing an artifact: Test Results
06-Nov-2018 22:43:30 Finished publishing of artifact Job artifact: [Test Results], pattern: [**/target/surefire-reports/**/*.*] in 23.38 ms
06-Nov-2018 22:43:30 Publishing an artifact: App and Server Logs
06-Nov-2018 22:43:30 Finished publishing of artifact Job artifact: [App and Server Logs], pattern: [**/*.log] anchored at: [local] in 27.78 ms
06-Nov-2018 22:43:30 Successfully removed working directory at '/opt/bamboo-home/xml-data/build-dir/SCDT-LOCAL20XSKIPPER20X-RABBIT'
06-Nov-2018 22:43:30 Finalising the build...
06-Nov-2018 22:43:30 Stopping timer.
06-Nov-2018 22:43:30 Build SCDT-LOCAL20XSKIPPER20X-RABBIT-2 completed.
06-Nov-2018 22:43:30 Running on server: post build plugin 'NCover Results Collector'
06-Nov-2018 22:43:30 Running on server: post build plugin 'Build Hanging Detection Configuration'
06-Nov-2018 22:43:30 Running on server: post build plugin 'Clover Delta Calculator'
06-Nov-2018 22:43:30 Running on server: post build plugin 'Maven Dependencies Postprocessor'
06-Nov-2018 22:43:30 All post build plugins have finished
06-Nov-2018 22:43:30 Generating build results summary...
06-Nov-2018 22:43:30 Saving build results to disk...
06-Nov-2018 22:43:30 Logging substituted variables...
06-Nov-2018 22:43:30 Indexing build results...
06-Nov-2018 22:43:30 Finished building SCDT-LOCAL20XSKIPPER20X-RABBIT-2.
06-Nov-2018 22:43:31 Force Stop build feature is enabled for current plan. Either Bamboo has detected the build has hung or it has been manually stopped.
06-Nov-2018 22:43:31 Attempting to generate stack trace and terminate spawned sub-processes of process id: 1936
06-Nov-2018 22:43:31 Found related process: pid: 26118 ppid: 1 pgid: 1929 %cpu: 0.0 %mem: 0.0 cmd: tail
06-Nov-2018 22:43:31 Found related process: pid: 26120 ppid: 1 pgid: 1929 %cpu: 0.0 %mem: 0.0 cmd: tail
06-Nov-2018 22:43:31 Found related process: pid: 26096 ppid: 1 pgid: 1929 %cpu: 0.0 %mem: 0.0 cmd: tail
06-Nov-2018 22:43:31 Found related process: pid: 28310 ppid: 1 pgid: 1929 %cpu: 0.0 %mem: 0.0 cmd: /bin/bash
06-Nov-2018 22:43:31 Found related process: pid: 26116 ppid: 1 pgid: 1929 %cpu: 0.0 %mem: 0.0 cmd: tail
06-Nov-2018 22:43:31 Found related process: pid: 2771 ppid: 1 pgid: 1929 %cpu: 0.0 %mem: 0.0 cmd: tail
06-Nov-2018 22:43:31 Found related process: pid: 2773 ppid: 1 pgid: 1929 %cpu: 0.0 %mem: 0.0 cmd: tail
06-Nov-2018 22:43:31 Found related process: pid: 2774 ppid: 1 pgid: 1929 %cpu: 0.0 %mem: 0.0 cmd: tail
06-Nov-2018 22:43:31 Found related process: pid: 9509 ppid: 1 pgid: 1929 %cpu: 0.0 %mem: 0.0 cmd: tail
06-Nov-2018 22:43:31 Found related process: pid: 9510 ppid: 1 pgid: 1929 %cpu: 0.0 %mem: 0.0 cmd: tail
06-Nov-2018 22:43:31 Found related process: pid: 9508 ppid: 1 pgid: 1929 %cpu: 0.0 %mem: 0.0 cmd: tail
06-Nov-2018 22:43:31 getStackTraceAndKillRelatedProcesses for 11 processes
06-Nov-2018 22:43:31 Executing kill -3 9508
06-Nov-2018 22:43:31 Executing kill -3 9510
06-Nov-2018 22:43:31 Executing kill -3 9509
06-Nov-2018 22:43:31 Executing kill -3 2774
06-Nov-2018 22:43:31 Executing kill -3 2773
06-Nov-2018 22:43:31 Executing kill -3 2771
06-Nov-2018 22:43:31 Executing kill -3 26116
06-Nov-2018 22:43:31 Executing kill -3 28310
06-Nov-2018 22:43:31 Executing kill -3 26096
06-Nov-2018 22:43:31 Executing kill -3 26120
06-Nov-2018 22:43:31 Executing kill -3 26118
06-Nov-2018 22:43:36 Killing: 9508
06-Nov-2018 22:43:36 Executing kill 9508
06-Nov-2018 22:43:36 Killing: 9510
06-Nov-2018 22:43:36 Executing kill 9510
06-Nov-2018 22:43:36 Killing: 9509
06-Nov-2018 22:43:36 Executing kill 9509
06-Nov-2018 22:43:36 Killing: 2774
06-Nov-2018 22:43:36 Executing kill 2774
06-Nov-2018 22:43:36 Killing: 2773
06-Nov-2018 22:43:36 Executing kill 2773
06-Nov-2018 22:43:36 Killing: 2771
06-Nov-2018 22:43:36 Executing kill 2771
06-Nov-2018 22:43:36 Killing: 26116
06-Nov-2018 22:43:36 Executing kill 26116
06-Nov-2018 22:43:36 Killing: 28310
06-Nov-2018 22:43:36 Executing kill 28310
06-Nov-2018 22:43:36 Killing: 26096
06-Nov-2018 22:43:36 Executing kill 26096
06-Nov-2018 22:43:36 Killing: 26120
06-Nov-2018 22:43:36 Executing kill 26120
06-Nov-2018 22:43:36 Killing: 26118
06-Nov-2018 22:43:36 Executing kill 26118
06-Nov-2018 22:43:41 Force Stop build feature is enabled for current plan. Either Bamboo has detected the build has hung or it has been manually stopped.
06-Nov-2018 22:43:41 Has finished generating stack trace and terminating spawned sub-processes of process id: 1936