Build: #44 was successful

Job: Run Data Flow Acceptance Tests for Rabbit was successful

Stages & jobs

  1. Test Stage - Kafka

  2. Test Stage - Rabbit

Build log

The build generated 761 lines of output. Download or view full build log

05-Mar-2019 19:14:30 Build Spring Cloud Data Flow Acceptance Tests - Local + SCDF-2.0.0.BS + Skipper 2.0.0.BS - Run Data Flow Acceptance Tests for Rabbit #44 (SCDT-LOCAL20XSKIPPER20X-RABBIT-44) started building on agent bamboo-01.af.pivotal.io
05-Mar-2019 19:14:30 Remote agent on host bamboo-01.af.pivotal.io
05-Mar-2019 19:14:30 Build working directory is /opt/bamboo-home/xml-data/build-dir/SCDT-LOCAL20XSKIPPER20X-RABBIT
05-Mar-2019 19:14:30 Executing build Spring Cloud Data Flow Acceptance Tests - Local + SCDF-2.0.0.BS + Skipper 2.0.0.BS - Run Data Flow Acceptance Tests for Rabbit #44 (SCDT-LOCAL20XSKIPPER20X-RABBIT-44)
05-Mar-2019 19:14:30 Starting task 'Checkout Default Repository' of type 'com.atlassian.bamboo.plugins.vcs:task.vcs.checkout'
05-Mar-2019 19:14:30 Checking out into /opt/bamboo-home/xml-data/build-dir/SCDT-LOCAL20XSKIPPER20X-RABBIT
05-Mar-2019 19:14:30 Updating source code to revision: 4d6bba78ca2b8629684e8fda0b50bfa8dd69649c
05-Mar-2019 19:14:30 Creating local git repository in '/opt/bamboo-home/xml-data/build-dir/SCDT-LOCAL20XSKIPPER20X-RABBIT/.git'.
05-Mar-2019 19:14:30 Initialized empty Git repository in /opt/bamboo-home/xml-data/build-dir/SCDT-LOCAL20XSKIPPER20X-RABBIT/.git/
05-Mar-2019 19:14:31 Fetching 'refs/heads/master' from 'https://github.com/spring-cloud/spring-cloud-dataflow-acceptance-tests.git'.
05-Mar-2019 19:14:32 From https://github.com/spring-cloud/spring-cloud-dataflow-acceptance-tests
05-Mar-2019 19:14:32 * [new branch]      master     -> master
05-Mar-2019 19:14:32 Checking out revision 4d6bba78ca2b8629684e8fda0b50bfa8dd69649c.
05-Mar-2019 19:14:32 Already on 'master'
05-Mar-2019 19:14:32 Updated source code to revision: 4d6bba78ca2b8629684e8fda0b50bfa8dd69649c
05-Mar-2019 19:14:32 Finished task 'Checkout Default Repository' with result: Success
05-Mar-2019 19:14:32 Running pre-build action: Artifactory Release Staging
05-Mar-2019 19:14:32 Running pre-build action: VCS Version Collector
05-Mar-2019 19:14:32 Starting task 'Execute Acceptance Tests' of type 'com.atlassian.bamboo.plugins.scripttask:task.builder.script'
05-Mar-2019 19:14:32
Beginning to execute external process for build 'Spring Cloud Data Flow Acceptance Tests - Local + SCDF-2.0.0.BS + Skipper 2.0.0.BS - Run Data Flow Acceptance Tests for Rabbit #44 (SCDT-LOCAL20XSKIPPER20X-RABBIT-44)'
... running command line:
/opt/bamboo-home/temp/SCDT-LOCAL20XSKIPPER20X-RABBIT-44-ScriptBuildTask-5306690754829538350.sh
... in: /opt/bamboo-home/xml-data/build-dir/SCDT-LOCAL20XSKIPPER20X-RABBIT
... using extra environment variables:
bamboo_planRepository_1_branch=master
bamboo_********_username_password=********
bamboo_signing_store_password=********
bamboo_capability_system_builder_ant_Ant_1_9=/opt/ant-1.9
bamboo_capability_system_builder_ant_Ant_1_8=/opt/ant-1.8
bamboo_planRepository_1_branchDisplayName=master
bamboo_repository_274694331_git_username=spring-buildmaster
bamboo_capability_system_jdk_OpenJDK_7u181=/opt/openjdk-7
bamboo_repository_revision_number=4d6bba78ca2b8629684e8fda0b50bfa8dd69649c
bamboo_capability_system_builder_node_Node_js_6=/usr/bin/node
bamboo_RIAK_BIN=/usr/sbin/riak
bamboo_buildKey=SCDT-LOCAL20XSKIPPER20X-RABBIT
bamboo_repository_274694331_branch_name=master
bamboo_bintray_password=********
bamboo_sonar_token_password=********
bamboo_shortJobName=Run Data Flow Acceptance Tests for Rabbit
bamboo_capability_system_builder_gradle___gradlew=./gradlew
bamboo_buildResultsUrl=https://build.spring.io/browse/SCDT-LOCAL20XSKIPPER20X-RABBIT-44
bamboo_capability_system_builder_mvn3_Maven_3_3=/opt/maven-3.3
bamboo_capability_system_builder_mvn3_Maven_3_2=/opt/maven-3.2
bamboo_capability_system_builder_mvn3_Maven_3_1=/opt/maven-3.1
bamboo_planRepository_repositoryUrl=https://github.com/spring-cloud/spring-cloud-dataflow-acceptance-tests.git
bamboo_agentId=208568322
bamboo_capability_system_builder_mvn3_Maven_3_5=/opt/maven-3.5
bamboo_capability_system_builder_mvn3_Maven_3_0=/opt/maven-3.0
bamboo_planRepository_revision=4d6bba78ca2b8629684e8fda0b50bfa8dd69649c
bamboo_planRepository_previousRevision=4d6bba78ca2b8629684e8fda0b50bfa8dd69649c
bamboo_capability_remote_build=true
bamboo_repository_branch_name=master
bamboo_sonatype_token_password=********
bamboo_repository_274694331_name=Git
bamboo_scdf_acceptance_tests_password=********
JAVA_HOME=/opt/jdk-8
bamboo_dependenciesDisabled=false
bamboo_repository_274694331_git_branch=master
bamboo_capability_Agent=bamboo-01.af.pivotal.io
bamboo_planRepository_branch=master
bamboo_planRepository_1_type=gitv2
bamboo_planRepository_branchName=master
bamboo_sonar_password=********
bamboo_hg_cache_directory=/opt/bamboo-home/xml-data/build-dir/_hg-repositories-cache
bamboo_planRepository_1_username=spring-buildmaster
bamboo_repository_274694331_git_repositoryUrl=https://github.com/spring-cloud/spring-cloud-dataflow-acceptance-tests.git
bamboo_planRepository_type=gitv2
bamboo_ManualBuildTriggerReason_userName=sabby
bamboo_git_cache_directory=/opt/bamboo-home/xml-data/build-dir/_git-repositories-cache
bamboo_artifactory_username=buildmaster
bamboo_tmp_directory=/opt/bamboo-home/temp
bamboo_planKey=SCDT-LOCAL20XSKIPPER20X
bamboo_planRepository_username=spring-buildmaster
bamboo_JDK8_HOME=/opt/jdk-8
bamboo_repository_274694331_previous_revision_number=4d6bba78ca2b8629684e8fda0b50bfa8dd69649c
bamboo_planRepository_1_branchName=master
bamboo_sonar_version=5.6.3
bamboo_capability_system_jdk_JDK_1_11=/opt/jdk-11
bamboo_resultsUrl=https://build.spring.io/browse/SCDT-LOCAL20XSKIPPER20X-RABBIT-44
bamboo_capability_system_jdk_JDK_1_10=/opt/jdk-10
bamboo_build_working_directory=/opt/bamboo-home/xml-data/build-dir/SCDT-LOCAL20XSKIPPER20X-RABBIT
bamboo_planRepository_1_name=Git
bamboo_capability_system_os=ubuntu1604
bamboo_nexusPush_stagingProfile=buildmaster
bamboo_shortPlanName=Local + SCDF-2.0.0.BS + Skipper 2.0.0.BS
bamboo_planRepository_name=Git
bamboo_buildNumber=44
bamboo_planName=Spring Cloud Data Flow Acceptance Tests - Local + SCDF-2.0.0.BS + Skipper 2.0.0.BS
bamboo_JDK7_HOME=/opt/jdk-7
bamboo_shortPlanKey=LOCAL20XSKIPPER20X
bamboo_shortJobKey=RABBIT
bamboo_artifactory_password=********
bamboo_buildTimeStamp=2019-03-05T19:14:30.455Z
bamboo_repository_previous_revision_number=4d6bba78ca2b8629684e8fda0b50bfa8dd69649c
bamboo_sonar_username=buildmaster
bamboo_********_password=********
bamboo_repository_git_branch=master
bamboo_buildResultKey=SCDT-LOCAL20XSKIPPER20X-RABBIT-44
bamboo_nexusPush_close=true
bamboo_buildPlanName=Spring Cloud Data Flow Acceptance Tests - Local + SCDF-2.0.0.BS + Skipper 2.0.0.BS - Run Data Flow Acceptance Tests for Rabbit
bamboo_repository_274694331_revision_number=4d6bba78ca2b8629684e8fda0b50bfa8dd69649c
bamboo_planRepository_1_revision=4d6bba78ca2b8629684e8fda0b50bfa8dd69649c
bamboo_repository_name=Git
bamboo_signing_key_password=********
bamboo_buildFailed=false
bamboo_capability_system_docker_executable=/usr/bin/docker
bamboo_capability_system_builder_groovy_Groovy_2_4=/opt/groovy-2.4
bamboo_capability_system_builder_command_Bash=/bin/bash
bamboo_agentWorkingDirectory=/opt/bamboo-home/xml-data/build-dir
bamboo_capability_system_git_executable=/usr/bin/git
bamboo_repository_git_username=spring-buildmaster
bamboo_planRepository_1_previousRevision=4d6bba78ca2b8629684e8fda0b50bfa8dd69649c
bamboo_capability_os_family=unix
bamboo_planRepository_branchDisplayName=master
bamboo_capability_system_builder_maven_Artifactory_Maven_3_5=/opt/maven-3.5
bamboo_capability_system_builder_maven_Artifactory_Maven_3_3=/opt/maven-3.3
bamboo_capability_system_builder_maven_Artifactory_Maven_3_2=/opt/maven-3.2
bamboo_s3_properties=/home/bamboo/tools/s3.properties
bamboo_capability_system_builder_maven_Artifactory_Maven_3_1=/opt/maven-3.1
bamboo_capability_system_builder_maven_Artifactory_Maven_3_0=/opt/maven-3.0
bamboo_plan_storageTag=plan-274497908
bamboo_bintray_username_password=********
bamboo_repository_git_repositoryUrl=https://github.com/spring-cloud/spring-cloud-dataflow-acceptance-tests.git
bamboo_working_directory=/opt/bamboo-home/xml-data/build-dir/SCDT-LOCAL20XSKIPPER20X-RABBIT
bamboo_planRepository_1_repositoryUrl=https://github.com/spring-cloud/spring-cloud-dataflow-acceptance-tests.git
bamboo_capability_system_jdk_JDK_1_8=/opt/jdk-8
bamboo_capability_system_jdk_JDK_1_9=/opt/jdk-9
bamboo_capability_system_jdk_JDK_1_6=/opt/jdk-6
bamboo_sonatype_password=********
bamboo_capability_system_jdk_JDK_1_7=/opt/jdk-7
bamboo_sonar_ip=10.194.6.9
05-Mar-2019 19:14:32 CLEANING UP RESOURCES BEFORE RUNNING TESTS
05-Mar-2019 19:14:32 Setting the environment variables
05-Mar-2019 19:14:32 Export the unset env. variables from /opt/bamboo-home/xml-data/build-dir/SCDT-LOCAL20XSKIPPER20X-RABBIT/local/init/env.properties :
05-Mar-2019 19:14:32    SPRING_CLOUD_DATAFLOW_SERVER_DOWNLOAD_URL = http://repo.spring.io/libs-snapshot/org/springframework/cloud/spring-cloud-dataflow-server-local//spring-cloud-dataflow-server-local-.jar
05-Mar-2019 19:14:32    SPRING_CLOUD_SKIPPER_SERVER_DOWNLOAD_URL = http://repo.spring.io/libs-snapshot/org/springframework/cloud/spring-cloud-skipper-server//spring-cloud-skipper-server-.jar
05-Mar-2019 19:14:32    SPRING_DATASOURCE_USERNAME = spring
05-Mar-2019 19:14:32    SPRING_DATASOURCE_PASSWORD = cloud
05-Mar-2019 19:14:32    SPRING_SCHEMA_NAME = dataflow
05-Mar-2019 19:14:32    DOCKER_SERVER = localhost
05-Mar-2019 19:14:32 Setting retries to 60 and WAIT_TIME to 5
05-Mar-2019 19:14:32 Export the unset env. variables from /opt/bamboo-home/xml-data/build-dir/SCDT-LOCAL20XSKIPPER20X-RABBIT/local/binder/rabbit/env.properties :
05-Mar-2019 19:14:32    STREAM_REGISTRATION_RESOURCE = http://repo.spring.io/libs-release/org/springframework/cloud/stream/app/spring-cloud-stream-app-descriptor/Celsius.SR3/spring-cloud-stream-app-descriptor-Celsius.SR3.stream-apps-rabbit-maven
05-Mar-2019 19:14:32    TASK_REGISTRATION_RESOURCE = http://repo.spring.io/libs-release/org/springframework/cloud/task/app/spring-cloud-task-app-descriptor/Clark.RELEASE/spring-cloud-task-app-descriptor-Clark.RELEASE.task-apps-maven
05-Mar-2019 19:14:32 SCDF SERVER URI: http://localhost:9393
05-Mar-2019 19:14:32 Clean up, clean up, everybody everywhere; clean up clean up, everybody do your share!
05-Mar-2019 19:14:32 No stopped containers
05-Mar-2019 19:14:33 No stopped containers
05-Mar-2019 19:14:33 No stopped containers
05-Mar-2019 19:14:33 FINISHED CLEANING UP RESOURCES
05-Mar-2019 19:14:33 Setting the environment variables
05-Mar-2019 19:14:33 Export the unset env. variables from /opt/bamboo-home/xml-data/build-dir/SCDT-LOCAL20XSKIPPER20X-RABBIT/local/init/env.properties :
05-Mar-2019 19:14:33    SPRING_CLOUD_DATAFLOW_SERVER_DOWNLOAD_URL = http://repo.spring.io/libs-snapshot/org/springframework/cloud/spring-cloud-dataflow-server/2.0.0.BUILD-SNAPSHOT/spring-cloud-dataflow-server-2.0.0.BUILD-SNAPSHOT.jar
05-Mar-2019 19:14:33    SPRING_CLOUD_SKIPPER_SERVER_DOWNLOAD_URL = http://repo.spring.io/libs-snapshot/org/springframework/cloud/spring-cloud-skipper-server/2.0.0.BUILD-SNAPSHOT/spring-cloud-skipper-server-2.0.0.BUILD-SNAPSHOT.jar
05-Mar-2019 19:14:33    SPRING_DATASOURCE_USERNAME = spring
05-Mar-2019 19:14:33    SPRING_DATASOURCE_PASSWORD = cloud
05-Mar-2019 19:14:33    SPRING_SCHEMA_NAME = dataflow
05-Mar-2019 19:14:33    DOCKER_SERVER = localhost
05-Mar-2019 19:14:33 Setting retries to 60 and WAIT_TIME to 5
05-Mar-2019 19:14:33 cleaning up any previous mysql docker containers...
05-Mar-2019 19:14:33 done cleaning up.
05-Mar-2019 19:14:33 Could not find a local mysql server, trying docker.
05-Mar-2019 19:14:34 Pulling mysql (mysql:5.7)...
05-Mar-2019 19:14:34 5.7: Pulling from library/mysql
05-Mar-2019 19:14:43 Digest: sha256:de482b2b0fdbe5bb142462c07c5650a74e0daa31e501bc52448a2be10f384e6d
05-Mar-2019 19:14:43 Status: Downloaded newer image for mysql:5.7
05-Mar-2019 19:14:43 Creating mysql_mysql_1
05-Mar-2019 19:14:44 mysql running on localhost:3306
05-Mar-2019 19:14:44 Service host is localhost
05-Mar-2019 19:14:44 cleaning up any previous rabbit docker containers...
05-Mar-2019 19:14:44 done cleaning up.
05-Mar-2019 19:14:45 rabbitmq found on localhost
05-Mar-2019 19:14:45 Export the unset env. variables from /opt/bamboo-home/xml-data/build-dir/SCDT-LOCAL20XSKIPPER20X-RABBIT/local/binder/rabbit/env.properties :
05-Mar-2019 19:14:45    STREAM_REGISTRATION_RESOURCE = http://repo.spring.io/libs-release/org/springframework/cloud/stream/app/spring-cloud-stream-app-descriptor/Einstein.RELEASE/spring-cloud-stream-app-descriptor-Einstein.RELEASE.stream-apps-rabbit-maven
05-Mar-2019 19:14:45    TASK_REGISTRATION_RESOURCE = http://repo.spring.io/libs-release/org/springframework/cloud/task/app/spring-cloud-task-app-descriptor/Dearborn.SR1/spring-cloud-task-app-descriptor-Dearborn.SR1.task-apps-maven
05-Mar-2019 19:14:45 cleaning up any previous redis docker containers...
05-Mar-2019 19:14:45 done cleaning up.
05-Mar-2019 19:14:46 redis found on localhost
05-Mar-2019 19:14:46 SKIPPER SERVER URI: http://localhost:7577
05-Mar-2019 19:14:46 Downloading server from http://repo.spring.io/libs-snapshot/org/springframework/cloud/spring-cloud-skipper-server/2.0.0.BUILD-SNAPSHOT/spring-cloud-skipper-server-2.0.0.BUILD-SNAPSHOT.jar
05-Mar-2019 19:15:20 2019-03-05 19:15:20 URL:http://repo.spring.io/libs-snapshot/org/springframework/cloud/spring-cloud-skipper-server/2.0.0.BUILD-SNAPSHOT/spring-cloud-skipper-server-2.0.0.BUILD-SNAPSHOT.jar [81483373/81483373] -> "/opt/bamboo-home/xml-data/build-dir/SCDT-LOCAL20XSKIPPER20X-RABBIT/local/skipper-server/skipper-server.jar" [1]
05-Mar-2019 19:15:20 executing [nohup /opt/jdk-8/bin/java  -Dlogging.level.org.springframework.cloud.deployer.spi.local.LocalAppDeployer=DEBUG -Xmx1024m -Xss1024k -jar /opt/bamboo-home/xml-data/build-dir/SCDT-LOCAL20XSKIPPER20X-RABBIT/local/skipper-server/skipper-server.jar  --spring.datasource.driver-class-name=org.mariadb.jdbc.Driver --spring.datasource.url=jdbc:mysql://localhost/dataflow --spring.datasource.username=spring --spring.datasource.password=cloud  --spring.cloud.dataflow.applicationProperties.stream.spring.rabbitmq.host=127.0.0.1  --spring.redis.host=127.0.0.1 --spring.cloud.skipper.server.platform.local.accounts.default.workingDirectoriesRoot=/opt/bamboo-home/xml-data/build-dir/SCDT-LOCAL20XSKIPPER20X-RABBIT/local/skipper-server/app-logs > /opt/bamboo-home/xml-data/build-dir/SCDT-LOCAL20XSKIPPER20X-RABBIT/local/skipper-server/skipper-server.log &]
05-Mar-2019 19:15:20 [/opt/bamboo-home/xml-data/build-dir/SCDT-LOCAL20XSKIPPER20X-RABBIT/local/skipper-server] process pid is [10311]
05-Mar-2019 19:15:20 System props are []
05-Mar-2019 19:15:20 Logs are under [/opt/bamboo-home/xml-data/build-dir/SCDT-LOCAL20XSKIPPER20X-RABBIT/local/skipper-server/skipper-server.log] or from nohup [/opt/bamboo-home/xml-data/build-dir/SCDT-LOCAL20XSKIPPER20X-RABBIT/local/skipper-server/nohup.log]
05-Mar-2019 19:15:20 Failed to connect to localhost:7577. Attempt  #1/60... will try again in [5] seconds
05-Mar-2019 19:15:25 Failed to connect to localhost:7577. Attempt  #2/60... will try again in [5] seconds
05-Mar-2019 19:15:30 Failed to connect to localhost:7577. Attempt  #3/60... will try again in [5] seconds
05-Mar-2019 19:15:35 SCDF SERVER URI: http://localhost:9393
05-Mar-2019 19:15:35 Downloading server from http://repo.spring.io/libs-snapshot/org/springframework/cloud/spring-cloud-dataflow-server/2.0.0.BUILD-SNAPSHOT/spring-cloud-dataflow-server-2.0.0.BUILD-SNAPSHOT.jar
05-Mar-2019 19:16:13 2019-03-05 19:16:13 URL:http://repo.spring.io/libs-snapshot/org/springframework/cloud/spring-cloud-dataflow-server/2.0.0.BUILD-SNAPSHOT/spring-cloud-dataflow-server-2.0.0.BUILD-SNAPSHOT.jar [88071194/88071194] -> "/opt/bamboo-home/xml-data/build-dir/SCDT-LOCAL20XSKIPPER20X-RABBIT/local/server/scdf-server.jar" [1]
05-Mar-2019 19:16:13 SPRING_PROFILES_ACTIVE []
05-Mar-2019 19:16:13 executing [nohup /opt/jdk-8/bin/java  -Xmx1024m -Xss1024k -jar /opt/bamboo-home/xml-data/build-dir/SCDT-LOCAL20XSKIPPER20X-RABBIT/local/server/scdf-server.jar  --spring.datasource.driver-class-name=org.mariadb.jdbc.Driver --spring.datasource.url=jdbc:mysql://localhost/dataflow --spring.datasource.username=spring --spring.datasource.password=cloud  --spring.cloud.dataflow.applicationProperties.stream.spring.rabbitmq.host=127.0.0.1  --spring.redis.host=127.0.0.1 --spring.cloud.skipper.server.platform.local.accounts.default.workingDirectoriesRoot=/opt/bamboo-home/xml-data/build-dir/SCDT-LOCAL20XSKIPPER20X-RABBIT/local/skipper-server/app-logs --spring.cloud.dataflow.features.skipper-enabled=true > /opt/bamboo-home/xml-data/build-dir/SCDT-LOCAL20XSKIPPER20X-RABBIT/local/server/scdf-server.log &]
05-Mar-2019 19:16:13 [/opt/bamboo-home/xml-data/build-dir/SCDT-LOCAL20XSKIPPER20X-RABBIT/local/server] process pid is [10453]
05-Mar-2019 19:16:13 System props are []
05-Mar-2019 19:16:13 Logs are under [/opt/bamboo-home/xml-data/build-dir/SCDT-LOCAL20XSKIPPER20X-RABBIT/local/server/scdf-server.log] or from nohup [/opt/bamboo-home/xml-data/build-dir/SCDT-LOCAL20XSKIPPER20X-RABBIT/local/server/nohup.log]
05-Mar-2019 19:16:13 Failed to connect to localhost:9393. Attempt  #1/60... will try again in [5] seconds
05-Mar-2019 19:16:18 Failed to connect to localhost:9393. Attempt  #2/60... will try again in [5] seconds
05-Mar-2019 19:16:23 Failed to connect to localhost:9393. Attempt  #3/60... will try again in [5] seconds
05-Mar-2019 19:16:28 SCDF SERVER ABOUT:
05-Mar-2019 19:16:29 {
05-Mar-2019 19:16:29     "_links": {
05-Mar-2019 19:16:29         "self": {
05-Mar-2019 19:16:29             "href": "http://localhost:9393/about"
05-Mar-2019 19:16:29         }
05-Mar-2019 19:16:29     },
05-Mar-2019 19:16:29     "featureInfo": {
05-Mar-2019 19:16:29         "analyticsEnabled": true,
05-Mar-2019 19:16:29         "grafanaEnabled": false,
05-Mar-2019 19:16:29         "schedulerEnabled": false,
05-Mar-2019 19:16:29         "streamsEnabled": true,
05-Mar-2019 19:16:29         "tasksEnabled": true
05-Mar-2019 19:16:29     },
05-Mar-2019 19:16:29     "grafanaInfo": {
05-Mar-2019 19:16:29         "refreshInterval": 15,
05-Mar-2019 19:16:29         "url": ""
05-Mar-2019 19:16:29     },
05-Mar-2019 19:16:29     "runtimeEnvironment": {
05-Mar-2019 19:16:29         "appDeployer": {
05-Mar-2019 19:16:29             "deployerImplementationVersion": "2.0.0.BUILD-SNAPSHOT",
05-Mar-2019 19:16:29             "deployerName": "Spring Cloud Skipper Server",
05-Mar-2019 19:16:29             "deployerSpiVersion": "2.0.0.BUILD-SNAPSHOT",
05-Mar-2019 19:16:29             "javaVersion": "1.8.0_144",
05-Mar-2019 19:16:29             "platformApiVersion": "",
05-Mar-2019 19:16:29             "platformClientVersion": "",
05-Mar-2019 19:16:29             "platformHostVersion": "",
05-Mar-2019 19:16:29             "platformSpecificInfo": {
05-Mar-2019 19:16:29                 "default": "local"
05-Mar-2019 19:16:29             },
05-Mar-2019 19:16:29             "platformType": "Skipper Managed",
05-Mar-2019 19:16:29             "springBootVersion": "2.1.2.RELEASE",
05-Mar-2019 19:16:29             "springVersion": "5.1.4.RELEASE"
05-Mar-2019 19:16:29         },
05-Mar-2019 19:16:29         "taskLaunchers": [
05-Mar-2019 19:16:29             {
05-Mar-2019 19:16:29                 "deployerImplementationVersion": "2.0.0.RELEASE",
05-Mar-2019 19:16:29                 "deployerName": "LocalTaskLauncher",
05-Mar-2019 19:16:29                 "deployerSpiVersion": "2.0.0.RELEASE",
05-Mar-2019 19:16:29                 "javaVersion": "1.8.0_144",
05-Mar-2019 19:16:29                 "platformApiVersion": "Linux 4.4.0-141-generic",
05-Mar-2019 19:16:29                 "platformClientVersion": "4.4.0-141-generic",
05-Mar-2019 19:16:29                 "platformHostVersion": "4.4.0-141-generic",
05-Mar-2019 19:16:29                 "platformSpecificInfo": {},
05-Mar-2019 19:16:29                 "platformType": "Local",
05-Mar-2019 19:16:29                 "springBootVersion": "2.1.2.RELEASE",
05-Mar-2019 19:16:29                 "springVersion": "5.1.4.RELEASE"
05-Mar-2019 19:16:29             }
05-Mar-2019 19:16:29         ]
05-Mar-2019 19:16:29     },
05-Mar-2019 19:16:29     "securityInfo": {
05-Mar-2019 19:16:29         "authenticated": false,
05-Mar-2019 19:16:29         "authenticationEnabled": false,
05-Mar-2019 19:16:29         "roles": [],
05-Mar-2019 19:16:29         "username": null
05-Mar-2019 19:16:29     },
05-Mar-2019 19:16:29     "versionInfo": {
05-Mar-2019 19:16:29         "core": {
05-Mar-2019 19:16:29             "name": "Spring Cloud Data Flow Core",
05-Mar-2019 19:16:29             "version": "2.0.0.BUILD-SNAPSHOT"
05-Mar-2019 19:16:29         },
05-Mar-2019 19:16:29         "dashboard": {
05-Mar-2019 19:16:29             "name": "Spring Cloud Dataflow UI",
05-Mar-2019 19:16:29             "version": "2.0.0.BUILD-SNAPSHOT"
05-Mar-2019 19:16:29         },
05-Mar-2019 19:16:29         "implementation": {
05-Mar-2019 19:16:29             "name": "spring-cloud-dataflow-server",
05-Mar-2019 19:16:29             "version": "2.0.0.BUILD-SNAPSHOT"
05-Mar-2019 19:16:29         },
05-Mar-2019 19:16:29         "shell": {
05-Mar-2019 19:16:29             "name": "Spring Cloud Data Flow Shell",
05-Mar-2019 19:16:29             "url": "https://repo.spring.io/libs-snapshot/org/springframework/cloud/spring-cloud-dataflow-shell/2.0.0.BUILD-SNAPSHOT/spring-cloud-dataflow-shell-2.0.0.BUILD-SNAPSHOT.jar",
05-Mar-2019 19:16:29             "version": "2.0.0.BUILD-SNAPSHOT"
05-Mar-2019 19:16:29         }
05-Mar-2019 19:16:29     }
05-Mar-2019 19:16:29 }
05-Mar-2019 19:16:29 SKIPPER SERVER ABOUT:
05-Mar-2019 19:16:29 {
05-Mar-2019 19:16:29     "versionInfo": {
05-Mar-2019 19:16:29         "server": {
05-Mar-2019 19:16:29             "name": "Spring Cloud Skipper Server",
05-Mar-2019 19:16:29             "version": "2.0.0.BUILD-SNAPSHOT"
05-Mar-2019 19:16:29         },
05-Mar-2019 19:16:29         "shell": {
05-Mar-2019 19:16:29             "name": "Spring Cloud Skipper Shell",
05-Mar-2019 19:16:29             "url": "https://repo.spring.io/libs-snapshot/org/springframework/cloud/spring-cloud-skipper-shell/2.0.0.BUILD-SNAPSHOT/spring-cloud-skipper-shell-2.0.0.BUILD-SNAPSHOT.jar",
05-Mar-2019 19:16:29             "version": "2.0.0.BUILD-SNAPSHOT"
05-Mar-2019 19:16:29         }
05-Mar-2019 19:16:29     }
05-Mar-2019 19:16:29 }
05-Mar-2019 19:16:30 [INFO] Scanning for projects...
05-Mar-2019 19:16:30 [INFO]                                                                         
05-Mar-2019 19:16:30 [INFO] ------------------------------------------------------------------------
05-Mar-2019 19:16:30 [INFO] Building Data Flow Acceptance Tests 1.1.0.BUILD-SNAPSHOT
05-Mar-2019 19:16:30 [INFO] ------------------------------------------------------------------------
05-Mar-2019 19:16:31 [INFO]
05-Mar-2019 19:16:31 [INFO] --- maven-checkstyle-plugin:2.17:check (checkstyle-validation) @ spring-cloud-dataflow-acceptance-tests ---
05-Mar-2019 19:16:31 [INFO]
05-Mar-2019 19:16:31 [INFO] --- maven-resources-plugin:2.6:resources (default-resources) @ spring-cloud-dataflow-acceptance-tests ---
05-Mar-2019 19:16:32 [INFO] Using 'UTF-8' encoding to copy filtered resources.
05-Mar-2019 19:16:32 [INFO] skip non existing resourceDirectory /opt/bamboo-home/xml-data/build-dir/SCDT-LOCAL20XSKIPPER20X-RABBIT/src/main/resources
05-Mar-2019 19:16:32 [INFO] skip non existing resourceDirectory /opt/bamboo-home/xml-data/build-dir/SCDT-LOCAL20XSKIPPER20X-RABBIT/src/main/resources
05-Mar-2019 19:16:32 [INFO]
05-Mar-2019 19:16:32 [INFO] --- maven-compiler-plugin:3.1:compile (default-compile) @ spring-cloud-dataflow-acceptance-tests ---
05-Mar-2019 19:16:32 [INFO] Changes detected - recompiling the module!
05-Mar-2019 19:16:32 [INFO] Compiling 8 source files to /opt/bamboo-home/xml-data/build-dir/SCDT-LOCAL20XSKIPPER20X-RABBIT/target/classes
05-Mar-2019 19:16:32 [INFO]
05-Mar-2019 19:16:32 [INFO] --- maven-resources-plugin:2.6:testResources (default-testResources) @ spring-cloud-dataflow-acceptance-tests ---
05-Mar-2019 19:16:32 [INFO] Using 'UTF-8' encoding to copy filtered resources.
05-Mar-2019 19:16:32 [INFO] Copying 1 resource
05-Mar-2019 19:16:32 [INFO]
05-Mar-2019 19:16:32 [INFO] --- maven-compiler-plugin:3.1:testCompile (default-testCompile) @ spring-cloud-dataflow-acceptance-tests ---
05-Mar-2019 19:16:32 [INFO] Changes detected - recompiling the module!
05-Mar-2019 19:16:32 [INFO] Compiling 15 source files to /opt/bamboo-home/xml-data/build-dir/SCDT-LOCAL20XSKIPPER20X-RABBIT/target/test-classes
05-Mar-2019 19:16:33 [WARNING] /opt/bamboo-home/xml-data/build-dir/SCDT-LOCAL20XSKIPPER20X-RABBIT/src/test/java/org/springframework/cloud/dataflow/acceptance/test/AbstractTaskTests.java: Some input files use unchecked or unsafe operations.
05-Mar-2019 19:16:33 [WARNING] /opt/bamboo-home/xml-data/build-dir/SCDT-LOCAL20XSKIPPER20X-RABBIT/src/test/java/org/springframework/cloud/dataflow/acceptance/test/AbstractTaskTests.java: Recompile with -Xlint:unchecked for details.
05-Mar-2019 19:16:33 [INFO]
05-Mar-2019 19:16:33 [INFO] --- maven-surefire-plugin:2.18.1:test (default-test) @ spring-cloud-dataflow-acceptance-tests ---
05-Mar-2019 19:16:33 [INFO] Surefire report directory: /opt/bamboo-home/xml-data/build-dir/SCDT-LOCAL20XSKIPPER20X-RABBIT/target/surefire-reports
05-Mar-2019 19:16:33
05-Mar-2019 19:16:33 -------------------------------------------------------
05-Mar-2019 19:16:33 T E S T S
05-Mar-2019 19:16:33 -------------------------------------------------------
05-Mar-2019 19:16:33 2019-03-05 19:16:33.909  INFO   --- [           main] .b.t.c.SpringBootTestContextBootstrapper : Neither @ContextConfiguration nor @ContextHierarchy found for test class [org.springframework.cloud.dataflow.acceptance.test.AnalyticsTests], using SpringBootContextLoader
05-Mar-2019 19:16:33 2019-03-05 19:16:33.955  INFO   --- [           main] .b.t.c.SpringBootTestContextBootstrapper : Loaded default TestExecutionListener class names from location [META-INF/spring.factories]: [org.springframework.boot.test.mock.mockito.MockitoTestExecutionListener, org.springframework.boot.test.mock.mockito.ResetMocksTestExecutionListener, org.springframework.boot.test.autoconfigure.restdocs.RestDocsTestExecutionListener, org.springframework.boot.test.autoconfigure.web.client.MockRestServiceServerResetTestExecutionListener, org.springframework.boot.test.autoconfigure.web.servlet.MockMvcPrintOnlyOnFailureTestExecutionListener, org.springframework.boot.test.autoconfigure.web.servlet.WebDriverTestExecutionListener, org.springframework.test.context.web.ServletTestExecutionListener, org.springframework.test.context.support.DirtiesContextBeforeModesTestExecutionListener, org.springframework.test.context.support.DependencyInjectionTestExecutionListener, org.springframework.test.context.support.DirtiesContextTestExecutionListener, org.springframework.test.context.transaction.TransactionalTestExecutionListener, org.springframework.test.context.jdbc.SqlScriptsTestExecutionListener]
05-Mar-2019 19:16:33 2019-03-05 19:16:33.972  INFO   --- [           main] .b.t.c.SpringBootTestContextBootstrapper : Using TestExecutionListeners: [org.springframework.test.context.web.ServletTestExecutionListener@636be97c, org.springframework.test.context.support.DirtiesContextBeforeModesTestExecutionListener@50a638b5, org.springframework.boot.test.autoconfigure.SpringBootDependencyInjectionTestExecutionListener@1817d444, org.springframework.test.context.support.DirtiesContextTestExecutionListener@6ca8564a, org.springframework.test.context.transaction.TransactionalTestExecutionListener@50b472aa, org.springframework.test.context.jdbc.SqlScriptsTestExecutionListener@31368b99, org.springframework.boot.test.autoconfigure.web.servlet.MockMvcPrintOnlyOnFailureTestExecutionListener@1725dc0f, org.springframework.boot.test.autoconfigure.web.client.MockRestServiceServerResetTestExecutionListener@3911c2a7, org.springframework.boot.test.mock.mockito.ResetMocksTestExecutionListener@4ac3c60d, org.springframework.boot.test.autoconfigure.web.servlet.WebDriverTestExecutionListener@4facf68f, org.springframework.boot.test.autoconfigure.restdocs.RestDocsTestExecutionListener@76508ed1, org.springframework.boot.test.mock.mockito.MockitoTestExecutionListener@41e36e46]
05-Mar-2019 19:16:33 2019-03-05 19:16:33.974  INFO   --- [           main] .b.t.c.SpringBootTestContextBootstrapper : Neither @ContextConfiguration nor @ContextHierarchy found for test class [org.springframework.cloud.dataflow.acceptance.test.WoodChuckTests], using SpringBootContextLoader
05-Mar-2019 19:16:33 2019-03-05 19:16:33.986  INFO   --- [           main] .b.t.c.SpringBootTestContextBootstrapper : Loaded default TestExecutionListener class names from location [META-INF/spring.factories]: [org.springframework.boot.test.mock.mockito.MockitoTestExecutionListener, org.springframework.boot.test.mock.mockito.ResetMocksTestExecutionListener, org.springframework.boot.test.autoconfigure.restdocs.RestDocsTestExecutionListener, org.springframework.boot.test.autoconfigure.web.client.MockRestServiceServerResetTestExecutionListener, org.springframework.boot.test.autoconfigure.web.servlet.MockMvcPrintOnlyOnFailureTestExecutionListener, org.springframework.boot.test.autoconfigure.web.servlet.WebDriverTestExecutionListener, org.springframework.test.context.web.ServletTestExecutionListener, org.springframework.test.context.support.DirtiesContextBeforeModesTestExecutionListener, org.springframework.test.context.support.DependencyInjectionTestExecutionListener, org.springframework.test.context.support.DirtiesContextTestExecutionListener, org.springframework.test.context.transaction.TransactionalTestExecutionListener, org.springframework.test.context.jdbc.SqlScriptsTestExecutionListener]
05-Mar-2019 19:16:33 2019-03-05 19:16:33.990  INFO   --- [           main] .b.t.c.SpringBootTestContextBootstrapper : Using TestExecutionListeners: [org.springframework.test.context.web.ServletTestExecutionListener@49139829, org.springframework.test.context.support.DirtiesContextBeforeModesTestExecutionListener@9597028, org.springframework.boot.test.autoconfigure.SpringBootDependencyInjectionTestExecutionListener@6069db50, org.springframework.test.context.support.DirtiesContextTestExecutionListener@4efbca5a, org.springframework.test.context.transaction.TransactionalTestExecutionListener@1b7cc17c, org.springframework.test.context.jdbc.SqlScriptsTestExecutionListener@59662a0b, org.springframework.boot.test.autoconfigure.web.servlet.MockMvcPrintOnlyOnFailureTestExecutionListener@77fbd92c, org.springframework.boot.test.autoconfigure.web.client.MockRestServiceServerResetTestExecutionListener@67c27493, org.springframework.boot.test.mock.mockito.ResetMocksTestExecutionListener@1a482e36, org.springframework.boot.test.autoconfigure.web.servlet.WebDriverTestExecutionListener@72967906, org.springframework.boot.test.autoconfigure.restdocs.RestDocsTestExecutionListener@5b8dfcc1, org.springframework.boot.test.mock.mockito.MockitoTestExecutionListener@2f9f7dcf]
05-Mar-2019 19:16:33 2019-03-05 19:16:33.991  INFO   --- [           main] .b.t.c.SpringBootTestContextBootstrapper : Neither @ContextConfiguration nor @ContextHierarchy found for test class [org.springframework.cloud.dataflow.acceptance.test.HttpSourceTests], using SpringBootContextLoader
05-Mar-2019 19:16:34 2019-03-05 19:16:34.002  INFO   --- [           main] .b.t.c.SpringBootTestContextBootstrapper : Loaded default TestExecutionListener class names from location [META-INF/spring.factories]: [org.springframework.boot.test.mock.mockito.MockitoTestExecutionListener, org.springframework.boot.test.mock.mockito.ResetMocksTestExecutionListener, org.springframework.boot.test.autoconfigure.restdocs.RestDocsTestExecutionListener, org.springframework.boot.test.autoconfigure.web.client.MockRestServiceServerResetTestExecutionListener, org.springframework.boot.test.autoconfigure.web.servlet.MockMvcPrintOnlyOnFailureTestExecutionListener, org.springframework.boot.test.autoconfigure.web.servlet.WebDriverTestExecutionListener, org.springframework.test.context.web.ServletTestExecutionListener, org.springframework.test.context.support.DirtiesContextBeforeModesTestExecutionListener, org.springframework.test.context.support.DependencyInjectionTestExecutionListener, org.springframework.test.context.support.DirtiesContextTestExecutionListener, org.springframework.test.context.transaction.TransactionalTestExecutionListener, org.springframework.test.context.jdbc.SqlScriptsTestExecutionListener]
05-Mar-2019 19:16:34 2019-03-05 19:16:34.005  INFO   --- [           main] .b.t.c.SpringBootTestContextBootstrapper : Using TestExecutionListeners: [org.springframework.test.context.web.ServletTestExecutionListener@1a677343, org.springframework.test.context.support.DirtiesContextBeforeModesTestExecutionListener@15de0b3c, org.springframework.boot.test.autoconfigure.SpringBootDependencyInjectionTestExecutionListener@489115ef, org.springframework.test.context.support.DirtiesContextTestExecutionListener@3857f613, org.springframework.test.context.transaction.TransactionalTestExecutionListener@198b6731, org.springframework.test.context.jdbc.SqlScriptsTestExecutionListener@7c6908d7, org.springframework.boot.test.autoconfigure.web.servlet.MockMvcPrintOnlyOnFailureTestExecutionListener@3c9754d8, org.springframework.boot.test.autoconfigure.web.client.MockRestServiceServerResetTestExecutionListener@3bf7ca37, org.springframework.boot.test.mock.mockito.ResetMocksTestExecutionListener@79079097, org.springframework.boot.test.autoconfigure.web.servlet.WebDriverTestExecutionListener@4d1c00d0, org.springframework.boot.test.autoconfigure.restdocs.RestDocsTestExecutionListener@4b2bac3f, org.springframework.boot.test.mock.mockito.MockitoTestExecutionListener@4e08711f]
05-Mar-2019 19:16:34 2019-03-05 19:16:34.023  INFO   --- [           main] .b.t.c.SpringBootTestContextBootstrapper : Neither @ContextConfiguration nor @ContextHierarchy found for test class [org.springframework.cloud.dataflow.acceptance.test.TickTockTests], using SpringBootContextLoader
05-Mar-2019 19:16:34 2019-03-05 19:16:34.032  INFO   --- [           main] .b.t.c.SpringBootTestContextBootstrapper : Loaded default TestExecutionListener class names from location [META-INF/spring.factories]: [org.springframework.boot.test.mock.mockito.MockitoTestExecutionListener, org.springframework.boot.test.mock.mockito.ResetMocksTestExecutionListener, org.springframework.boot.test.autoconfigure.restdocs.RestDocsTestExecutionListener, org.springframework.boot.test.autoconfigure.web.client.MockRestServiceServerResetTestExecutionListener, org.springframework.boot.test.autoconfigure.web.servlet.MockMvcPrintOnlyOnFailureTestExecutionListener, org.springframework.boot.test.autoconfigure.web.servlet.WebDriverTestExecutionListener, org.springframework.test.context.web.ServletTestExecutionListener, org.springframework.test.context.support.DirtiesContextBeforeModesTestExecutionListener, org.springframework.test.context.support.DependencyInjectionTestExecutionListener, org.springframework.test.context.support.DirtiesContextTestExecutionListener, org.springframework.test.context.transaction.TransactionalTestExecutionListener, org.springframework.test.context.jdbc.SqlScriptsTestExecutionListener]
05-Mar-2019 19:16:34 2019-03-05 19:16:34.035  INFO   --- [           main] .b.t.c.SpringBootTestContextBootstrapper : Using TestExecutionListeners: [org.springframework.test.context.web.ServletTestExecutionListener@72cde7cc, org.springframework.test.context.support.DirtiesContextBeforeModesTestExecutionListener@5fd4f8f5, org.springframework.boot.test.autoconfigure.SpringBootDependencyInjectionTestExecutionListener@696da30b, org.springframework.test.context.support.DirtiesContextTestExecutionListener@4e7912d8, org.springframework.test.context.transaction.TransactionalTestExecutionListener@53976f5c, org.springframework.test.context.jdbc.SqlScriptsTestExecutionListener@2bfc268b, org.springframework.boot.test.autoconfigure.web.servlet.MockMvcPrintOnlyOnFailureTestExecutionListener@2f8dad04, org.springframework.boot.test.autoconfigure.web.client.MockRestServiceServerResetTestExecutionListener@29e495ff, org.springframework.boot.test.mock.mockito.ResetMocksTestExecutionListener@41e1e210, org.springframework.boot.test.autoconfigure.web.servlet.WebDriverTestExecutionListener@be35cd9, org.springframework.boot.test.autoconfigure.restdocs.RestDocsTestExecutionListener@4944252c, org.springframework.boot.test.mock.mockito.MockitoTestExecutionListener@44821a96]
05-Mar-2019 19:16:34 2019-03-05 19:16:34.037  INFO   --- [           main] .b.t.c.SpringBootTestContextBootstrapper : Neither @ContextConfiguration nor @ContextHierarchy found for test class [org.springframework.cloud.dataflow.acceptance.test.TransformTests], using SpringBootContextLoader
05-Mar-2019 19:16:34 2019-03-05 19:16:34.053  INFO   --- [           main] .b.t.c.SpringBootTestContextBootstrapper : Loaded default TestExecutionListener class names from location [META-INF/spring.factories]: [org.springframework.boot.test.mock.mockito.MockitoTestExecutionListener, org.springframework.boot.test.mock.mockito.ResetMocksTestExecutionListener, org.springframework.boot.test.autoconfigure.restdocs.RestDocsTestExecutionListener, org.springframework.boot.test.autoconfigure.web.client.MockRestServiceServerResetTestExecutionListener, org.springframework.boot.test.autoconfigure.web.servlet.MockMvcPrintOnlyOnFailureTestExecutionListener, org.springframework.boot.test.autoconfigure.web.servlet.WebDriverTestExecutionListener, org.springframework.test.context.web.ServletTestExecutionListener, org.springframework.test.context.support.DirtiesContextBeforeModesTestExecutionListener, org.springframework.test.context.support.DependencyInjectionTestExecutionListener, org.springframework.test.context.support.DirtiesContextTestExecutionListener, org.springframework.test.context.transaction.TransactionalTestExecutionListener, org.springframework.test.context.jdbc.SqlScriptsTestExecutionListener]
05-Mar-2019 19:16:34 2019-03-05 19:16:34.059  INFO   --- [           main] .b.t.c.SpringBootTestContextBootstrapper : Using TestExecutionListeners: [org.springframework.test.context.web.ServletTestExecutionListener@52af26ee, org.springframework.test.context.support.DirtiesContextBeforeModesTestExecutionListener@6fd83fc1, org.springframework.boot.test.autoconfigure.SpringBootDependencyInjectionTestExecutionListener@4f2b503c, org.springframework.test.context.support.DirtiesContextTestExecutionListener@bae7dc0, org.springframework.test.context.transaction.TransactionalTestExecutionListener@209da20d, org.springframework.test.context.jdbc.SqlScriptsTestExecutionListener@e15b7e8, org.springframework.boot.test.autoconfigure.web.servlet.MockMvcPrintOnlyOnFailureTestExecutionListener@1b2abca6, org.springframework.boot.test.autoconfigure.web.client.MockRestServiceServerResetTestExecutionListener@6392827e, org.springframework.boot.test.mock.mockito.ResetMocksTestExecutionListener@2ed2d9cb, org.springframework.boot.test.autoconfigure.web.servlet.WebDriverTestExecutionListener@d5b810e, org.springframework.boot.test.autoconfigure.restdocs.RestDocsTestExecutionListener@43dac38f, org.springframework.boot.test.mock.mockito.MockitoTestExecutionListener@342c38f8]
05-Mar-2019 19:16:34 2019-03-05 19:16:34.077  INFO   --- [           main] .b.t.c.SpringBootTestContextBootstrapper : Neither @ContextConfiguration nor @ContextHierarchy found for test class [org.springframework.cloud.dataflow.acceptance.test.NamedChannelTests], using SpringBootContextLoader
05-Mar-2019 19:16:34 2019-03-05 19:16:34.094  INFO   --- [           main] .b.t.c.SpringBootTestContextBootstrapper : Loaded default TestExecutionListener class names from location [META-INF/spring.factories]: [org.springframework.boot.test.mock.mockito.MockitoTestExecutionListener, org.springframework.boot.test.mock.mockito.ResetMocksTestExecutionListener, org.springframework.boot.test.autoconfigure.restdocs.RestDocsTestExecutionListener, org.springframework.boot.test.autoconfigure.web.client.MockRestServiceServerResetTestExecutionListener, org.springframework.boot.test.autoconfigure.web.servlet.MockMvcPrintOnlyOnFailureTestExecutionListener, org.springframework.boot.test.autoconfigure.web.servlet.WebDriverTestExecutionListener, org.springframework.test.context.web.ServletTestExecutionListener, org.springframework.test.context.support.DirtiesContextBeforeModesTestExecutionListener, org.springframework.test.context.support.DependencyInjectionTestExecutionListener, org.springframework.test.context.support.DirtiesContextTestExecutionListener, org.springframework.test.context.transaction.TransactionalTestExecutionListener, org.springframework.test.context.jdbc.SqlScriptsTestExecutionListener]
05-Mar-2019 19:16:34 2019-03-05 19:16:34.099  INFO   --- [           main] .b.t.c.SpringBootTestContextBootstrapper : Using TestExecutionListeners: [org.springframework.test.context.web.ServletTestExecutionListener@231f98ef, org.springframework.test.context.support.DirtiesContextBeforeModesTestExecutionListener@7c137fd5, org.springframework.boot.test.autoconfigure.SpringBootDependencyInjectionTestExecutionListener@183ec003, org.springframework.test.context.support.DirtiesContextTestExecutionListener@7d9d0818, org.springframework.test.context.transaction.TransactionalTestExecutionListener@221a3fa4, org.springframework.test.context.jdbc.SqlScriptsTestExecutionListener@451001e5, org.springframework.boot.test.autoconfigure.web.servlet.MockMvcPrintOnlyOnFailureTestExecutionListener@2b40ff9c, org.springframework.boot.test.autoconfigure.web.client.MockRestServiceServerResetTestExecutionListener@3e08ff24, org.springframework.boot.test.mock.mockito.ResetMocksTestExecutionListener@4d1c005e, org.springframework.boot.test.autoconfigure.web.servlet.WebDriverTestExecutionListener@8462f31, org.springframework.boot.test.autoconfigure.restdocs.RestDocsTestExecutionListener@24569dba, org.springframework.boot.test.mock.mockito.MockitoTestExecutionListener@5ddeb7cb]
05-Mar-2019 19:16:34 Running org.springframework.cloud.dataflow.acceptance.test.AnalyticsTests
05-Mar-2019 19:16:34 2019-03-05 19:16:34.130  INFO   --- [           main] .b.t.c.SpringBootTestContextBootstrapper : Neither @ContextConfiguration nor @ContextHierarchy found for test class [org.springframework.cloud.dataflow.acceptance.test.AnalyticsTests], using SpringBootContextLoader
05-Mar-2019 19:16:34 2019-03-05 19:16:34.142  INFO   --- [           main] .b.t.c.SpringBootTestContextBootstrapper : Loaded default TestExecutionListener class names from location [META-INF/spring.factories]: [org.springframework.boot.test.mock.mockito.MockitoTestExecutionListener, org.springframework.boot.test.mock.mockito.ResetMocksTestExecutionListener, org.springframework.boot.test.autoconfigure.restdocs.RestDocsTestExecutionListener, org.springframework.boot.test.autoconfigure.web.client.MockRestServiceServerResetTestExecutionListener, org.springframework.boot.test.autoconfigure.web.servlet.MockMvcPrintOnlyOnFailureTestExecutionListener, org.springframework.boot.test.autoconfigure.web.servlet.WebDriverTestExecutionListener, org.springframework.test.context.web.ServletTestExecutionListener, org.springframework.test.context.support.DirtiesContextBeforeModesTestExecutionListener, org.springframework.test.context.support.DependencyInjectionTestExecutionListener, org.springframework.test.context.support.DirtiesContextTestExecutionListener, org.springframework.test.context.transaction.TransactionalTestExecutionListener, org.springframework.test.context.jdbc.SqlScriptsTestExecutionListener]
05-Mar-2019 19:16:34 2019-03-05 19:16:34.163  INFO   --- [           main] .b.t.c.SpringBootTestContextBootstrapper : Using TestExecutionListeners: [org.springframework.test.context.web.ServletTestExecutionListener@4149c063, org.springframework.test.context.support.DirtiesContextBeforeModesTestExecutionListener@9cb8225, org.springframework.boot.test.autoconfigure.SpringBootDependencyInjectionTestExecutionListener@76b07f29, org.springframework.test.context.support.DirtiesContextTestExecutionListener@38af9828, org.springframework.test.context.transaction.TransactionalTestExecutionListener@376a0d86, org.springframework.test.context.jdbc.SqlScriptsTestExecutionListener@62656be4, org.springframework.boot.test.autoconfigure.web.servlet.MockMvcPrintOnlyOnFailureTestExecutionListener@17d919b6, org.springframework.boot.test.autoconfigure.web.client.MockRestServiceServerResetTestExecutionListener@53f3bdbd, org.springframework.boot.test.mock.mockito.ResetMocksTestExecutionListener@34129c78, org.springframework.boot.test.autoconfigure.web.servlet.WebDriverTestExecutionListener@7d61eb55, org.springframework.boot.test.autoconfigure.restdocs.RestDocsTestExecutionListener@222a59e6, org.springframework.boot.test.mock.mockito.MockitoTestExecutionListener@6c7a164b]
05-Mar-2019 19:16:34 2019-03-05 19:16:34.765  INFO 10564 --- [           main] s.c.a.AnnotationConfigApplicationContext : Refreshing org.springframework.context.annotation.AnnotationConfigApplicationContext@54e7391d: startup date [Tue Mar 05 19:16:34 UTC 2019]; root of context hierarchy
05-Mar-2019 19:16:34 2019-03-05 19:16:34.996  INFO 10564 --- [           main] trationDelegate$BeanPostProcessorChecker : Bean 'configurationPropertiesRebinderAutoConfiguration' of type [class org.springframework.cloud.autoconfigure.ConfigurationPropertiesRebinderAutoConfiguration$$EnhancerBySpringCGLIB$$95ff43c0] is not eligible for getting processed by all BeanPostProcessors (for example: not eligible for auto-proxying)
05-Mar-2019 19:16:35
05-Mar-2019 19:16:35   .   ____          _            __ _ _
05-Mar-2019 19:16:35 /\\ / ___'_ __ _ _(_)_ __  __ _ \ \ \ \
05-Mar-2019 19:16:35 ( ( )\___ | '_ | '_| | '_ \/ _` | \ \ \ \
05-Mar-2019 19:16:35 \\/  ___)| |_)| | | | | || (_| |  ) ) ) )
05-Mar-2019 19:16:35   '  |____| .__|_| |_|_| |_\__, | / / / /
05-Mar-2019 19:16:35 =========|_|==============|___/=/_/_/_/
05-Mar-2019 19:16:35 :: Spring Boot ::        (v1.4.1.RELEASE)
05-Mar-2019 19:16:35
05-Mar-2019 19:16:35 2019-03-05 19:16:35.318  INFO 10564 --- [           main] c.c.c.ConfigServicePropertySourceLocator : Fetching config from server at: http://localhost:8888
05-Mar-2019 19:16:35 2019-03-05 19:16:35.400  WARN 10564 --- [           main] c.c.c.ConfigServicePropertySourceLocator : Could not locate PropertySource: I/O error on GET request for "http://localhost:8888//blah": Connection refused (Connection refused); nested exception is java.net.ConnectException: Connection refused (Connection refused)
05-Mar-2019 19:16:35 2019-03-05 19:16:35.408  INFO 10564 --- [           main] o.s.c.d.acceptance.test.AnalyticsTests   : The following profiles are active: blah
05-Mar-2019 19:16:35 2019-03-05 19:16:35.615  INFO 10564 --- [           main] o.s.c.d.acceptance.test.AnalyticsTests   : Started AnalyticsTests in 1.383 seconds (JVM running for 2.148)
05-Mar-2019 19:16:35 2019-03-05 19:16:35.936  INFO 10564 --- [           main] junit.logTestName                        : Starting Test analyticsTest(org.springframework.cloud.dataflow.acceptance.test.AnalyticsTests)
05-Mar-2019 19:16:35 2019-03-05 19:16:35.943  INFO 10564 --- [           main] o.s.c.d.acceptance.test.AnalyticsTests   : Importing stream apps from uri resource: http://repo.spring.io/libs-release/org/springframework/cloud/stream/app/spring-cloud-stream-app-descriptor/Einstein.RELEASE/spring-cloud-stream-app-descriptor-Einstein.RELEASE.stream-apps-rabbit-maven
05-Mar-2019 19:16:37 2019-03-05 19:16:37.168  INFO 10564 --- [           main] junit.logTestName                        : Finished Test analyticsTest(org.springframework.cloud.dataflow.acceptance.test.AnalyticsTests)
05-Mar-2019 19:16:37 2019-03-05 19:16:37.168  INFO 10564 --- [           main] o.s.c.d.acceptance.test.AnalyticsTests   : Destroy all streams
05-Mar-2019 19:16:37 Tests run: 1, Failures: 0, Errors: 0, Skipped: 1, Time elapsed: 3.059 sec - in org.springframework.cloud.dataflow.acceptance.test.AnalyticsTests
05-Mar-2019 19:16:37 Running org.springframework.cloud.dataflow.acceptance.test.WoodChuckTests
05-Mar-2019 19:16:37 2019-03-05 19:16:37.188  INFO 10564 --- [           main] .b.t.c.SpringBootTestContextBootstrapper : Neither @ContextConfiguration nor @ContextHierarchy found for test class [org.springframework.cloud.dataflow.acceptance.test.WoodChuckTests], using SpringBootContextLoader
05-Mar-2019 19:16:37 2019-03-05 19:16:37.202  INFO 10564 --- [           main] .b.t.c.SpringBootTestContextBootstrapper : Loaded default TestExecutionListener class names from location [META-INF/spring.factories]: [org.springframework.boot.test.mock.mockito.MockitoTestExecutionListener, org.springframework.boot.test.mock.mockito.ResetMocksTestExecutionListener, org.springframework.boot.test.autoconfigure.restdocs.RestDocsTestExecutionListener, org.springframework.boot.test.autoconfigure.web.client.MockRestServiceServerResetTestExecutionListener, org.springframework.boot.test.autoconfigure.web.servlet.MockMvcPrintOnlyOnFailureTestExecutionListener, org.springframework.boot.test.autoconfigure.web.servlet.WebDriverTestExecutionListener, org.springframework.test.context.web.ServletTestExecutionListener, org.springframework.test.context.support.DirtiesContextBeforeModesTestExecutionListener, org.springframework.test.context.support.DependencyInjectionTestExecutionListener, org.springframework.test.context.support.DirtiesContextTestExecutionListener, org.springframework.test.context.transaction.TransactionalTestExecutionListener, org.springframework.test.context.jdbc.SqlScriptsTestExecutionListener]
05-Mar-2019 19:16:37 2019-03-05 19:16:37.216  INFO 10564 --- [           main] .b.t.c.SpringBootTestContextBootstrapper : Using TestExecutionListeners: [org.springframework.test.context.web.ServletTestExecutionListener@4c1bdcc2, org.springframework.test.context.support.DirtiesContextBeforeModesTestExecutionListener@762637be, org.springframework.boot.test.autoconfigure.SpringBootDependencyInjectionTestExecutionListener@4b97c4ad, org.springframework.test.context.support.DirtiesContextTestExecutionListener@7640a5b1, org.springframework.test.context.transaction.TransactionalTestExecutionListener@642f9a77, org.springframework.test.context.jdbc.SqlScriptsTestExecutionListener@23f3da8b, org.springframework.boot.test.autoconfigure.web.servlet.MockMvcPrintOnlyOnFailureTestExecutionListener@5634d0f4, org.springframework.boot.test.autoconfigure.web.client.MockRestServiceServerResetTestExecutionListener@252a8aae, org.springframework.boot.test.mock.mockito.ResetMocksTestExecutionListener@3d4e405e, org.springframework.boot.test.autoconfigure.web.servlet.WebDriverTestExecutionListener@54e2fe, org.springframework.boot.test.autoconfigure.restdocs.RestDocsTestExecutionListener@70972170, org.springframework.boot.test.mock.mockito.MockitoTestExecutionListener@119aa36]
05-Mar-2019 19:16:37 2019-03-05 19:16:37.311  INFO 10564 --- [           main] junit.logTestName                        : Starting Test testPartitioning(org.springframework.cloud.dataflow.acceptance.test.WoodChuckTests)
05-Mar-2019 19:16:37 2019-03-05 19:16:37.330  INFO 10564 --- [           main] o.s.c.d.acceptance.test.WoodChuckTests   : Creating stream 'WOODCHUCK-TEST'
05-Mar-2019 19:16:37 2019-03-05 19:16:37.480  INFO 10564 --- [           main] o.s.c.d.acceptance.test.WoodChuckTests   : Deploying stream 'WOODCHUCK-TEST' with properties: {app.*.spring.cloud.streamapp.security.enabled=false, app.log.logging.pattern.level=WOODCHUCK-${INSTANCE_INDEX:${CF_INSTANCE_INDEX:${spring.cloud.stream.instanceIndex:0}}} %5p, app.*.logging.file=${PID}-test.log, app.splitter.producer.partitionKeyExpression=payload, app.*.endpoints.logfile.sensitive=false, app.log.spring.cloud.stream.kafka.bindings.input.consumer.autoRebalanceEnabled=false, app.*.management.endpoints.web.exposure.include=*, deployer.log.count=2}
05-Mar-2019 19:16:46 2019-03-05 19:16:46.704  INFO 10564 --- [           main] o.s.c.d.acceptance.test.WoodChuckTests   : Checking: Stream=WOODCHUCK-TEST, status = deploying, status description = The stream is being deployed.
05-Mar-2019 19:16:46 2019-03-05 19:16:46.704  INFO 10564 --- [           main] o.s.c.d.acceptance.test.WoodChuckTests   : Sleeping to check status of Stream=WOODCHUCK-TEST
05-Mar-2019 19:16:51 2019-03-05 19:16:51.825  INFO 10564 --- [           main] o.s.c.d.acceptance.test.WoodChuckTests   : Checking: Stream=WOODCHUCK-TEST, status = deploying, status description = The stream is being deployed.
05-Mar-2019 19:16:51 2019-03-05 19:16:51.826  INFO 10564 --- [           main] o.s.c.d.acceptance.test.WoodChuckTests   : Sleeping to check status of Stream=WOODCHUCK-TEST
05-Mar-2019 19:16:56 2019-03-05 19:16:56.918  INFO 10564 --- [           main] o.s.c.d.acceptance.test.WoodChuckTests   : Checking: Stream=WOODCHUCK-TEST, status = deploying, status description = The stream is being deployed.
05-Mar-2019 19:16:56 2019-03-05 19:16:56.918  INFO 10564 --- [           main] o.s.c.d.acceptance.test.WoodChuckTests   : Sleeping to check status of Stream=WOODCHUCK-TEST
05-Mar-2019 19:17:02 2019-03-05 19:17:02.047  INFO 10564 --- [           main] o.s.c.d.acceptance.test.WoodChuckTests   : Checking: Stream=WOODCHUCK-TEST, status = deploying, status description = The stream is being deployed.
05-Mar-2019 19:17:02 2019-03-05 19:17:02.047  INFO 10564 --- [           main] o.s.c.d.acceptance.test.WoodChuckTests   : Sleeping to check status of Stream=WOODCHUCK-TEST
05-Mar-2019 19:17:07 2019-03-05 19:17:07.134  INFO 10564 --- [           main] o.s.c.d.acceptance.test.WoodChuckTests   : Checking: Stream=WOODCHUCK-TEST, status = deploying, status description = The stream is being deployed.
05-Mar-2019 19:17:07 2019-03-05 19:17:07.135  INFO 10564 --- [           main] o.s.c.d.acceptance.test.WoodChuckTests   : Sleeping to check status of Stream=WOODCHUCK-TEST
05-Mar-2019 19:17:12 2019-03-05 19:17:12.191  INFO 10564 --- [           main] o.s.c.d.acceptance.test.WoodChuckTests   : Checking: Stream=WOODCHUCK-TEST, status = deployed, status description = The stream has been successfully deployed
05-Mar-2019 19:17:12 2019-03-05 19:17:12.262  INFO 10564 --- [           main] o.s.c.d.acceptance.test.WoodChuckTests   : Sleeping to check status of Stream=WOODCHUCK-TEST
05-Mar-2019 19:17:17 2019-03-05 19:17:17.263  INFO 10564 --- [           main] o.s.c.d.acceptance.test.WoodChuckTests   : Stream 'WOODCHUCK-TEST' started with status: deployed
05-Mar-2019 19:17:17 2019-03-05 19:17:17.263  INFO 10564 --- [           main] o.s.c.d.acceptance.test.WoodChuckTests   : App 'log' has instances: {WOODCHUCK-TEST.log-v1-0=http://10.194.6.11:27644, WOODCHUCK-TEST.log-v1-1=http://10.194.6.11:30657}
05-Mar-2019 19:17:17 2019-03-05 19:17:17.263  INFO 10564 --- [           main] o.s.c.d.acceptance.test.WoodChuckTests   : App 'http' has instances: {WOODCHUCK-TEST.http-v1-0=http://10.194.6.11:34665}
05-Mar-2019 19:17:17 2019-03-05 19:17:17.263  INFO 10564 --- [           main] o.s.c.d.acceptance.test.WoodChuckTests   : App 'splitter' has instances: {WOODCHUCK-TEST.splitter-v1-0=http://10.194.6.11:34413}
05-Mar-2019 19:17:17 2019-03-05 19:17:17.263  INFO 10564 --- [           main] o.s.c.d.acceptance.test.WoodChuckTests   : Looking for 'Started HttpSource' in logfile for http
05-Mar-2019 19:17:22 2019-03-05 19:17:22.264  INFO 10564 --- [           main] o.s.c.d.acceptance.test.WoodChuckTests   : Requesting log for app WOODCHUCK-TEST.http-v1-0
05-Mar-2019 19:17:22 2019-03-05 19:17:22.405  INFO 10564 --- [           main] o.s.c.d.acceptance.test.WoodChuckTests   : Retrieved logfile from 'http://10.194.6.11:34665/actuator/logfile
05-Mar-2019 19:17:22 2019-03-05 19:17:22.409  INFO 10564 --- [           main] o.s.c.d.acceptance.test.WoodChuckTests   : Matched all 'Started HttpSource' in logfile for app http (source WOODCHUCK-TEST.http-v1-0)
05-Mar-2019 19:17:22 2019-03-05 19:17:22.409  INFO 10564 --- [           main] o.s.c.d.acceptance.test.WoodChuckTests   : Looking for 'Started SplitterProcessor' in logfile for splitter
05-Mar-2019 19:17:27 2019-03-05 19:17:27.410  INFO 10564 --- [           main] o.s.c.d.acceptance.test.WoodChuckTests   : Requesting log for app WOODCHUCK-TEST.splitter-v1-0
05-Mar-2019 19:17:27 2019-03-05 19:17:27.556  INFO 10564 --- [           main] o.s.c.d.acceptance.test.WoodChuckTests   : Retrieved logfile from 'http://10.194.6.11:34413/actuator/logfile
05-Mar-2019 19:17:27 2019-03-05 19:17:27.556  INFO 10564 --- [           main] o.s.c.d.acceptance.test.WoodChuckTests   : Matched all 'Started SplitterProcessor' in logfile for app splitter (source WOODCHUCK-TEST.splitter-v1-0)
05-Mar-2019 19:17:27 2019-03-05 19:17:27.557  INFO 10564 --- [           main] o.s.c.d.acceptance.test.WoodChuckTests   : Looking for 'Started LogSink' in logfile for log
05-Mar-2019 19:17:32 2019-03-05 19:17:32.557  INFO 10564 --- [           main] o.s.c.d.acceptance.test.WoodChuckTests   : Requesting log for app WOODCHUCK-TEST.log-v1-0
05-Mar-2019 19:17:32 2019-03-05 19:17:32.712  INFO 10564 --- [           main] o.s.c.d.acceptance.test.WoodChuckTests   : Retrieved logfile from 'http://10.194.6.11:27644/actuator/logfile
05-Mar-2019 19:17:32 2019-03-05 19:17:32.713  INFO 10564 --- [           main] o.s.c.d.acceptance.test.WoodChuckTests   : Requesting log for app WOODCHUCK-TEST.log-v1-1
05-Mar-2019 19:17:32 2019-03-05 19:17:32.864  INFO 10564 --- [           main] o.s.c.d.acceptance.test.WoodChuckTests   : Retrieved logfile from 'http://10.194.6.11:30657/actuator/logfile
05-Mar-2019 19:17:32 2019-03-05 19:17:32.864  INFO 10564 --- [           main] o.s.c.d.acceptance.test.WoodChuckTests   : Matched all 'Started LogSink' in logfile for app log (source WOODCHUCK-TEST.log-v1-0)
05-Mar-2019 19:17:32 2019-03-05 19:17:32.935  INFO 10564 --- [           main] o.s.c.d.acceptance.test.WoodChuckTests   : Looking for 'WOODCHUCK-0,How,chuck' in logfile for log
05-Mar-2019 19:17:37 2019-03-05 19:17:37.935  INFO 10564 --- [           main] o.s.c.d.acceptance.test.WoodChuckTests   : Requesting log for app WOODCHUCK-TEST.log-v1-0
05-Mar-2019 19:17:37 2019-03-05 19:17:37.944  INFO 10564 --- [           main] o.s.c.d.acceptance.test.WoodChuckTests   : Retrieved logfile from 'http://10.194.6.11:27644/actuator/logfile
05-Mar-2019 19:17:37 2019-03-05 19:17:37.944  INFO 10564 --- [           main] o.s.c.d.acceptance.test.WoodChuckTests   : Requesting log for app WOODCHUCK-TEST.log-v1-1
05-Mar-2019 19:17:37 2019-03-05 19:17:37.952  INFO 10564 --- [           main] o.s.c.d.acceptance.test.WoodChuckTests   : Retrieved logfile from 'http://10.194.6.11:30657/actuator/logfile
05-Mar-2019 19:17:37 2019-03-05 19:17:37.952  INFO 10564 --- [           main] o.s.c.d.acceptance.test.WoodChuckTests   : Matched all 'WOODCHUCK-0,How,chuck' in logfile for app log (source WOODCHUCK-TEST.log-v1-0)
05-Mar-2019 19:17:37 2019-03-05 19:17:37.953  INFO 10564 --- [           main] o.s.c.d.acceptance.test.WoodChuckTests   : Looking for 'WOODCHUCK-1,much,wood,would,if,a,woodchuck,could' in logfile for log
05-Mar-2019 19:17:42 2019-03-05 19:17:42.953  INFO 10564 --- [           main] o.s.c.d.acceptance.test.WoodChuckTests   : Requesting log for app WOODCHUCK-TEST.log-v1-0
05-Mar-2019 19:17:42 2019-03-05 19:17:42.962  INFO 10564 --- [           main] o.s.c.d.acceptance.test.WoodChuckTests   : Retrieved logfile from 'http://10.194.6.11:27644/actuator/logfile
05-Mar-2019 19:17:42 2019-03-05 19:17:42.963  INFO 10564 --- [           main] o.s.c.d.acceptance.test.WoodChuckTests   : Requesting log for app WOODCHUCK-TEST.log-v1-1
05-Mar-2019 19:17:42 2019-03-05 19:17:42.979  INFO 10564 --- [           main] o.s.c.d.acceptance.test.WoodChuckTests   : Retrieved logfile from 'http://10.194.6.11:30657/actuator/logfile
05-Mar-2019 19:17:42 2019-03-05 19:17:42.980  INFO 10564 --- [           main] o.s.c.d.acceptance.test.WoodChuckTests   : Matched all 'WOODCHUCK-1,much,wood,would,if,a,woodchuck,could' in logfile for app log (source WOODCHUCK-TEST.log-v1-1)
05-Mar-2019 19:17:42 2019-03-05 19:17:42.981  INFO 10564 --- [           main] junit.logTestName                        : Test testPartitioning(org.springframework.cloud.dataflow.acceptance.test.WoodChuckTests) Succeeded
05-Mar-2019 19:17:42 2019-03-05 19:17:42.981  INFO 10564 --- [           main] junit.logTestName                        : Finished Test testPartitioning(org.springframework.cloud.dataflow.acceptance.test.WoodChuckTests)
05-Mar-2019 19:17:42 2019-03-05 19:17:42.981  INFO 10564 --- [           main] o.s.c.d.acceptance.test.WoodChuckTests   : Destroy all streams
05-Mar-2019 19:17:43 Tests run: 1, Failures: 0, Errors: 0, Skipped: 0, Time elapsed: 66.226 sec - in org.springframework.cloud.dataflow.acceptance.test.WoodChuckTests
05-Mar-2019 19:17:43 Running org.springframework.cloud.dataflow.acceptance.test.HttpSourceTests
05-Mar-2019 19:17:43 2019-03-05 19:17:43.450  INFO 10564 --- [           main] .b.t.c.SpringBootTestContextBootstrapper : Neither @ContextConfiguration nor @ContextHierarchy found for test class [org.springframework.cloud.dataflow.acceptance.test.HttpSourceTests], using SpringBootContextLoader
05-Mar-2019 19:17:43 2019-03-05 19:17:43.472  INFO 10564 --- [           main] .b.t.c.SpringBootTestContextBootstrapper : Loaded default TestExecutionListener class names from location [META-INF/spring.factories]: [org.springframework.boot.test.mock.mockito.MockitoTestExecutionListener, org.springframework.boot.test.mock.mockito.ResetMocksTestExecutionListener, org.springframework.boot.test.autoconfigure.restdocs.RestDocsTestExecutionListener, org.springframework.boot.test.autoconfigure.web.client.MockRestServiceServerResetTestExecutionListener, org.springframework.boot.test.autoconfigure.web.servlet.MockMvcPrintOnlyOnFailureTestExecutionListener, org.springframework.boot.test.autoconfigure.web.servlet.WebDriverTestExecutionListener, org.springframework.test.context.web.ServletTestExecutionListener, org.springframework.test.context.support.DirtiesContextBeforeModesTestExecutionListener, org.springframework.test.context.support.DependencyInjectionTestExecutionListener, org.springframework.test.context.support.DirtiesContextTestExecutionListener, org.springframework.test.context.transaction.TransactionalTestExecutionListener, org.springframework.test.context.jdbc.SqlScriptsTestExecutionListener]
05-Mar-2019 19:17:43 2019-03-05 19:17:43.493  INFO 10564 --- [           main] .b.t.c.SpringBootTestContextBootstrapper : Using TestExecutionListeners: [org.springframework.test.context.web.ServletTestExecutionListener@2264ea32, org.springframework.test.context.support.DirtiesContextBeforeModesTestExecutionListener@7d3c09ec, org.springframework.boot.test.autoconfigure.SpringBootDependencyInjectionTestExecutionListener@71e4b308, org.springframework.test.context.support.DirtiesContextTestExecutionListener@11900483, org.springframework.test.context.transaction.TransactionalTestExecutionListener@14a049f9, org.springframework.test.context.jdbc.SqlScriptsTestExecutionListener@94e51e8, org.springframework.boot.test.autoconfigure.web.servlet.MockMvcPrintOnlyOnFailureTestExecutionListener@5de6cf3a, org.springframework.boot.test.autoconfigure.web.client.MockRestServiceServerResetTestExecutionListener@4cc36c19, org.springframework.boot.test.mock.mockito.ResetMocksTestExecutionListener@5a3a1bf9, org.springframework.boot.test.autoconfigure.web.servlet.WebDriverTestExecutionListener@2100d047, org.springframework.boot.test.autoconfigure.restdocs.RestDocsTestExecutionListener@4af45442, org.springframework.boot.test.mock.mockito.MockitoTestExecutionListener@1d805aa1]
05-Mar-2019 19:17:43 2019-03-05 19:17:43.621  INFO 10564 --- [           main] junit.logTestName                        : Starting Test httpSourceTests(org.springframework.cloud.dataflow.acceptance.test.HttpSourceTests)
05-Mar-2019 19:17:43 2019-03-05 19:17:43.622  INFO 10564 --- [           main] o.s.c.d.acceptance.test.HttpSourceTests  : Creating stream 'HTTP-TEST'
05-Mar-2019 19:17:43 2019-03-05 19:17:43.657  INFO 10564 --- [           main] o.s.c.d.acceptance.test.HttpSourceTests  : Deploying stream 'HTTP-TEST' with properties: {app.*.spring.cloud.streamapp.security.enabled=false, app.*.logging.file=${PID}-test.log, app.*.endpoints.logfile.sensitive=false, app.*.management.endpoints.web.exposure.include=*}
05-Mar-2019 19:17:44 2019-03-05 19:17:44.247  INFO 10564 --- [           main] o.s.c.d.acceptance.test.HttpSourceTests  : Checking: Stream=HTTP-TEST, status = deploying, status description = The stream is being deployed.
05-Mar-2019 19:17:44 2019-03-05 19:17:44.247  INFO 10564 --- [           main] o.s.c.d.acceptance.test.HttpSourceTests  : Sleeping to check status of Stream=HTTP-TEST
05-Mar-2019 19:17:49 2019-03-05 19:17:49.309  INFO 10564 --- [           main] o.s.c.d.acceptance.test.HttpSourceTests  : Checking: Stream=HTTP-TEST, status = deploying, status description = The stream is being deployed.
05-Mar-2019 19:17:49 2019-03-05 19:17:49.309  INFO 10564 --- [           main] o.s.c.d.acceptance.test.HttpSourceTests  : Sleeping to check status of Stream=HTTP-TEST
05-Mar-2019 19:17:54 2019-03-05 19:17:54.409  INFO 10564 --- [           main] o.s.c.d.acceptance.test.HttpSourceTests  : Checking: Stream=HTTP-TEST, status = deploying, status description = The stream is being deployed.
05-Mar-2019 19:17:54 2019-03-05 19:17:54.409  INFO 10564 --- [           main] o.s.c.d.acceptance.test.HttpSourceTests  : Sleeping to check status of Stream=HTTP-TEST
05-Mar-2019 19:17:59 2019-03-05 19:17:59.476  INFO 10564 --- [           main] o.s.c.d.acceptance.test.HttpSourceTests  : Checking: Stream=HTTP-TEST, status = deployed, status description = The stream has been successfully deployed
05-Mar-2019 19:17:59 2019-03-05 19:17:59.523  INFO 10564 --- [           main] o.s.c.d.acceptance.test.HttpSourceTests  : Sleeping to check status of Stream=HTTP-TEST
05-Mar-2019 19:18:04 2019-03-05 19:18:04.523  INFO 10564 --- [           main] o.s.c.d.acceptance.test.HttpSourceTests  : Stream 'HTTP-TEST' started with status: deployed
05-Mar-2019 19:18:04 2019-03-05 19:18:04.524  INFO 10564 --- [           main] o.s.c.d.acceptance.test.HttpSourceTests  : App 'log' has instances: {HTTP-TEST.log-v1-0=http://10.194.6.11:43393}
05-Mar-2019 19:18:04 2019-03-05 19:18:04.524  INFO 10564 --- [           main] o.s.c.d.acceptance.test.HttpSourceTests  : App 'http' has instances: {HTTP-TEST.http-v1-0=http://10.194.6.11:44616}
05-Mar-2019 19:18:04 2019-03-05 19:18:04.530  INFO 10564 --- [           main] o.s.c.d.acceptance.test.HttpSourceTests  : Looking for 'Started HttpSource' in logfile for http
05-Mar-2019 19:18:09 2019-03-05 19:18:09.531  INFO 10564 --- [           main] o.s.c.d.acceptance.test.HttpSourceTests  : Requesting log for app HTTP-TEST.http-v1-0
05-Mar-2019 19:18:09 2019-03-05 19:18:09.705  INFO 10564 --- [           main] o.s.c.d.acceptance.test.HttpSourceTests  : Retrieved logfile from 'http://10.194.6.11:44616/actuator/logfile
05-Mar-2019 19:18:09 2019-03-05 19:18:09.705  INFO 10564 --- [           main] o.s.c.d.acceptance.test.HttpSourceTests  : Matched all 'Started HttpSource' in logfile for app http (source HTTP-TEST.http-v1-0)
05-Mar-2019 19:18:09 2019-03-05 19:18:09.705  INFO 10564 --- [           main] o.s.c.d.acceptance.test.HttpSourceTests  : Looking for 'Started LogSink' in logfile for log
05-Mar-2019 19:18:14 2019-03-05 19:18:14.705  INFO 10564 --- [           main] o.s.c.d.acceptance.test.HttpSourceTests  : Requesting log for app HTTP-TEST.log-v1-0
05-Mar-2019 19:18:14 2019-03-05 19:18:14.840  INFO 10564 --- [           main] o.s.c.d.acceptance.test.HttpSourceTests  : Retrieved logfile from 'http://10.194.6.11:43393/actuator/logfile
05-Mar-2019 19:18:14 2019-03-05 19:18:14.840  INFO 10564 --- [           main] o.s.c.d.acceptance.test.HttpSourceTests  : Matched all 'Started LogSink' in logfile for app log (source HTTP-TEST.log-v1-0)
05-Mar-2019 19:18:14 2019-03-05 19:18:14.902  INFO 10564 --- [           main] o.s.c.d.acceptance.test.HttpSourceTests  : Looking for '8c915ffa-886a-4d1f-bb1a-2bf48e12fa5f' in logfile for log
05-Mar-2019 19:18:19 2019-03-05 19:18:19.903  INFO 10564 --- [           main] o.s.c.d.acceptance.test.HttpSourceTests  : Requesting log for app HTTP-TEST.log-v1-0
05-Mar-2019 19:18:19 2019-03-05 19:18:19.914  INFO 10564 --- [           main] o.s.c.d.acceptance.test.HttpSourceTests  : Retrieved logfile from 'http://10.194.6.11:43393/actuator/logfile
05-Mar-2019 19:18:19 2019-03-05 19:18:19.914  INFO 10564 --- [           main] o.s.c.d.acceptance.test.HttpSourceTests  : Matched all '8c915ffa-886a-4d1f-bb1a-2bf48e12fa5f' in logfile for app log (source HTTP-TEST.log-v1-0)
05-Mar-2019 19:18:19 2019-03-05 19:18:19.916  INFO 10564 --- [           main] junit.logTestName                        : Test httpSourceTests(org.springframework.cloud.dataflow.acceptance.test.HttpSourceTests) Succeeded
05-Mar-2019 19:18:19 2019-03-05 19:18:19.916  INFO 10564 --- [           main] junit.logTestName                        : Finished Test httpSourceTests(org.springframework.cloud.dataflow.acceptance.test.HttpSourceTests)
05-Mar-2019 19:18:19 2019-03-05 19:18:19.916  INFO 10564 --- [           main] o.s.c.d.acceptance.test.HttpSourceTests  : Destroy all streams
05-Mar-2019 19:18:20 Tests run: 1, Failures: 0, Errors: 0, Skipped: 0, Time elapsed: 36.686 sec - in org.springframework.cloud.dataflow.acceptance.test.HttpSourceTests
05-Mar-2019 19:18:20 Running org.springframework.cloud.dataflow.acceptance.test.TimestampTaskTests
05-Mar-2019 19:18:20 2019-03-05 19:18:20.180  INFO 10564 --- [           main] o.s.c.support.GenericApplicationContext  : Refreshing org.springframework.context.support.GenericApplicationContext@2c88a3e8: startup date [Tue Mar 05 19:18:20 UTC 2019]; root of context hierarchy
05-Mar-2019 19:18:20 2019-03-05 19:18:20.326  INFO 10564 --- [           main] junit.logTestName                        : Starting Test timeStampTests(org.springframework.cloud.dataflow.acceptance.test.TimestampTaskTests)
05-Mar-2019 19:18:20 2019-03-05 19:18:20.327  INFO 10564 --- [           main] o.s.c.d.a.test.AbstractTaskTests         : Importing task apps from uri resource: http://repo.spring.io/libs-release/org/springframework/cloud/task/app/spring-cloud-task-app-descriptor/Dearborn.SR1/spring-cloud-task-app-descriptor-Dearborn.SR1.task-apps-maven
05-Mar-2019 19:18:20 2019-03-05 19:18:20.467  INFO 10564 --- [           main] o.s.c.d.a.test.AbstractTaskTests         : Done importing task apps.
05-Mar-2019 19:18:27 2019-03-05 19:18:27.900  INFO 10564 --- [           main] junit.logTestName                        : Test timeStampTests(org.springframework.cloud.dataflow.acceptance.test.TimestampTaskTests) Succeeded
05-Mar-2019 19:18:27 2019-03-05 19:18:27.901  INFO 10564 --- [           main] junit.logTestName                        : Finished Test timeStampTests(org.springframework.cloud.dataflow.acceptance.test.TimestampTaskTests)
05-Mar-2019 19:18:27 2019-03-05 19:18:27.973  INFO 10564 --- [           main] junit.logTestName                        : Starting Test timeStampTestsMultipleLaunch(org.springframework.cloud.dataflow.acceptance.test.TimestampTaskTests)
05-Mar-2019 19:18:38 2019-03-05 19:18:38.386  INFO 10564 --- [           main] junit.logTestName                        : Test timeStampTestsMultipleLaunch(org.springframework.cloud.dataflow.acceptance.test.TimestampTaskTests) Succeeded
05-Mar-2019 19:18:38 2019-03-05 19:18:38.386  INFO 10564 --- [           main] junit.logTestName                        : Finished Test timeStampTestsMultipleLaunch(org.springframework.cloud.dataflow.acceptance.test.TimestampTaskTests)
05-Mar-2019 19:18:38 Tests run: 2, Failures: 0, Errors: 0, Skipped: 0, Time elapsed: 18.247 sec - in org.springframework.cloud.dataflow.acceptance.test.TimestampTaskTests
05-Mar-2019 19:18:38 Running org.springframework.cloud.dataflow.acceptance.test.TickTockTests
05-Mar-2019 19:18:38 2019-03-05 19:18:38.387  INFO 10564 --- [           main] .b.t.c.SpringBootTestContextBootstrapper : Neither @ContextConfiguration nor @ContextHierarchy found for test class [org.springframework.cloud.dataflow.acceptance.test.TickTockTests], using SpringBootContextLoader
05-Mar-2019 19:18:38 2019-03-05 19:18:38.399  INFO 10564 --- [           main] .b.t.c.SpringBootTestContextBootstrapper : Loaded default TestExecutionListener class names from location [META-INF/spring.factories]: [org.springframework.boot.test.mock.mockito.MockitoTestExecutionListener, org.springframework.boot.test.mock.mockito.ResetMocksTestExecutionListener, org.springframework.boot.test.autoconfigure.restdocs.RestDocsTestExecutionListener, org.springframework.boot.test.autoconfigure.web.client.MockRestServiceServerResetTestExecutionListener, org.springframework.boot.test.autoconfigure.web.servlet.MockMvcPrintOnlyOnFailureTestExecutionListener, org.springframework.boot.test.autoconfigure.web.servlet.WebDriverTestExecutionListener, org.springframework.test.context.web.ServletTestExecutionListener, org.springframework.test.context.support.DirtiesContextBeforeModesTestExecutionListener, org.springframework.test.context.support.DependencyInjectionTestExecutionListener, org.springframework.test.context.support.DirtiesContextTestExecutionListener, org.springframework.test.context.transaction.TransactionalTestExecutionListener, org.springframework.test.context.jdbc.SqlScriptsTestExecutionListener]
05-Mar-2019 19:18:38 2019-03-05 19:18:38.407  INFO 10564 --- [           main] .b.t.c.SpringBootTestContextBootstrapper : Using TestExecutionListeners: [org.springframework.test.context.web.ServletTestExecutionListener@54067fdc, org.springframework.test.context.support.DirtiesContextBeforeModesTestExecutionListener@4098dd77, org.springframework.boot.test.autoconfigure.SpringBootDependencyInjectionTestExecutionListener@43aeb5e0, org.springframework.test.context.support.DirtiesContextTestExecutionListener@2274160, org.springframework.test.context.transaction.TransactionalTestExecutionListener@65383667, org.springframework.test.context.jdbc.SqlScriptsTestExecutionListener@63cd2cd2, org.springframework.boot.test.autoconfigure.web.servlet.MockMvcPrintOnlyOnFailureTestExecutionListener@557a84fe, org.springframework.boot.test.autoconfigure.web.client.MockRestServiceServerResetTestExecutionListener@6deee370, org.springframework.boot.test.mock.mockito.ResetMocksTestExecutionListener@49c17ba4, org.springframework.boot.test.autoconfigure.web.servlet.WebDriverTestExecutionListener@43e065f2, org.springframework.boot.test.autoconfigure.restdocs.RestDocsTestExecutionListener@423c5404, org.springframework.boot.test.mock.mockito.MockitoTestExecutionListener@5853ca50]
05-Mar-2019 19:18:38 2019-03-05 19:18:38.478  INFO 10564 --- [           main] junit.logTestName                        : Starting Test tickTockUpdateRollbackTests(org.springframework.cloud.dataflow.acceptance.test.TickTockTests)
05-Mar-2019 19:18:38 2019-03-05 19:18:38.502  INFO 10564 --- [           main] o.s.c.d.acceptance.test.TickTockTests    : Creating stream 'TICKTOCK'
05-Mar-2019 19:18:38 2019-03-05 19:18:38.523  INFO 10564 --- [           main] o.s.c.d.acceptance.test.TickTockTests    : Deploying stream 'TICKTOCK' with properties: {app.*.spring.cloud.streamapp.security.enabled=false, app.*.logging.file=${PID}-test.log, app.*.endpoints.logfile.sensitive=false, app.log.log.expression='TICKTOCK - TIMESTAMP: '.concat(payload), app.*.management.endpoints.web.exposure.include=*}
05-Mar-2019 19:18:41 2019-03-05 19:18:41.049  INFO 10564 --- [           main] o.s.c.d.acceptance.test.TickTockTests    : Checking: Stream=TICKTOCK, status = deploying, status description = The stream is being deployed.
05-Mar-2019 19:18:41 2019-03-05 19:18:41.049  INFO 10564 --- [           main] o.s.c.d.acceptance.test.TickTockTests    : Sleeping to check status of Stream=TICKTOCK
05-Mar-2019 19:18:46 2019-03-05 19:18:46.117  INFO 10564 --- [           main] o.s.c.d.acceptance.test.TickTockTests    : Checking: Stream=TICKTOCK, status = deploying, status description = The stream is being deployed.
05-Mar-2019 19:18:46 2019-03-05 19:18:46.117  INFO 10564 --- [           main] o.s.c.d.acceptance.test.TickTockTests    : Sleeping to check status of Stream=TICKTOCK
05-Mar-2019 19:18:51 2019-03-05 19:18:51.169  INFO 10564 --- [           main] o.s.c.d.acceptance.test.TickTockTests    : Checking: Stream=TICKTOCK, status = deploying, status description = The stream is being deployed.
05-Mar-2019 19:18:51 2019-03-05 19:18:51.169  INFO 10564 --- [           main] o.s.c.d.acceptance.test.TickTockTests    : Sleeping to check status of Stream=TICKTOCK
05-Mar-2019 19:18:56 2019-03-05 19:18:56.209  INFO 10564 --- [           main] o.s.c.d.acceptance.test.TickTockTests    : Checking: Stream=TICKTOCK, status = deployed, status description = The stream has been successfully deployed
05-Mar-2019 19:18:56 2019-03-05 19:18:56.266  INFO 10564 --- [           main] o.s.c.d.acceptance.test.TickTockTests    : Sleeping to check status of Stream=TICKTOCK
05-Mar-2019 19:19:01 2019-03-05 19:19:01.267  INFO 10564 --- [           main] o.s.c.d.acceptance.test.TickTockTests    : Stream 'TICKTOCK' started with status: deployed
05-Mar-2019 19:19:01 2019-03-05 19:19:01.267  INFO 10564 --- [           main] o.s.c.d.acceptance.test.TickTockTests    : App 'log' has instances: {TICKTOCK.log-v1-0=http://10.194.6.11:54359}
05-Mar-2019 19:19:01 2019-03-05 19:19:01.267  INFO 10564 --- [           main] o.s.c.d.acceptance.test.TickTockTests    : App 'time' has instances: {TICKTOCK.time-v1-0=http://10.194.6.11:43439}
05-Mar-2019 19:19:01 2019-03-05 19:19:01.267  INFO 10564 --- [           main] o.s.c.d.acceptance.test.TickTockTests    : Looking for 'Started TimeSource' in logfile for time
05-Mar-2019 19:19:06 2019-03-05 19:19:06.267  INFO 10564 --- [           main] o.s.c.d.acceptance.test.TickTockTests    : Requesting log for app TICKTOCK.time-v1-0
05-Mar-2019 19:19:06 2019-03-05 19:19:06.405  INFO 10564 --- [           main] o.s.c.d.acceptance.test.TickTockTests    : Retrieved logfile from 'http://10.194.6.11:43439/actuator/logfile
05-Mar-2019 19:19:06 2019-03-05 19:19:06.405  INFO 10564 --- [           main] o.s.c.d.acceptance.test.TickTockTests    : Matched all 'Started TimeSource' in logfile for app time (source TICKTOCK.time-v1-0)
05-Mar-2019 19:19:06 2019-03-05 19:19:06.405  INFO 10564 --- [           main] o.s.c.d.acceptance.test.TickTockTests    : Looking for 'Started LogSink' in logfile for log
05-Mar-2019 19:19:11 2019-03-05 19:19:11.405  INFO 10564 --- [           main] o.s.c.d.acceptance.test.TickTockTests    : Requesting log for app TICKTOCK.log-v1-0
05-Mar-2019 19:19:11 2019-03-05 19:19:11.554  INFO 10564 --- [           main] o.s.c.d.acceptance.test.TickTockTests    : Retrieved logfile from 'http://10.194.6.11:54359/actuator/logfile
05-Mar-2019 19:19:11 2019-03-05 19:19:11.554  INFO 10564 --- [           main] o.s.c.d.acceptance.test.TickTockTests    : Matched all 'Started LogSink' in logfile for app log (source TICKTOCK.log-v1-0)
05-Mar-2019 19:19:11 2019-03-05 19:19:11.554  INFO 10564 --- [           main] o.s.c.d.acceptance.test.TickTockTests    : Looking for 'TICKTOCK - TIMESTAMP:' in logfile for log
05-Mar-2019 19:19:16 2019-03-05 19:19:16.555  INFO 10564 --- [           main] o.s.c.d.acceptance.test.TickTockTests    : Requesting log for app TICKTOCK.log-v1-0
05-Mar-2019 19:19:16 2019-03-05 19:19:16.565  INFO 10564 --- [           main] o.s.c.d.acceptance.test.TickTockTests    : Retrieved logfile from 'http://10.194.6.11:54359/actuator/logfile
05-Mar-2019 19:19:16 2019-03-05 19:19:16.565  INFO 10564 --- [           main] o.s.c.d.acceptance.test.TickTockTests    : Matched all 'TICKTOCK - TIMESTAMP:' in logfile for app log (source TICKTOCK.log-v1-0)
05-Mar-2019 19:19:16 2019-03-05 19:19:16.566  INFO 10564 --- [           main] o.s.c.d.acceptance.test.TickTockTests    : Updating stream 'TICKTOCK'
05-Mar-2019 19:19:17 2019-03-05 19:19:17.106  INFO 10564 --- [           main] o.s.c.d.acceptance.test.TickTockTests    : Checking: Stream=TICKTOCK, status = deploying, status description = The stream is being deployed.
05-Mar-2019 19:19:17 2019-03-05 19:19:17.106  INFO 10564 --- [           main] o.s.c.d.acceptance.test.TickTockTests    : Sleeping to check status of Stream=TICKTOCK
05-Mar-2019 19:19:22 2019-03-05 19:19:22.144  INFO 10564 --- [           main] o.s.c.d.acceptance.test.TickTockTests    : Checking: Stream=TICKTOCK, status = deploying, status description = The stream is being deployed.
05-Mar-2019 19:19:22 2019-03-05 19:19:22.144  INFO 10564 --- [           main] o.s.c.d.acceptance.test.TickTockTests    : Sleeping to check status of Stream=TICKTOCK
05-Mar-2019 19:19:27 2019-03-05 19:19:27.200  INFO 10564 --- [           main] o.s.c.d.acceptance.test.TickTockTests    : Checking: Stream=TICKTOCK, status = deployed, status description = The stream has been successfully deployed
05-Mar-2019 19:19:27 2019-03-05 19:19:27.234  INFO 10564 --- [           main] o.s.c.d.acceptance.test.TickTockTests    : Sleeping to check status of Stream=TICKTOCK
05-Mar-2019 19:19:32 2019-03-05 19:19:32.234  INFO 10564 --- [           main] o.s.c.d.acceptance.test.TickTockTests    : Stream 'TICKTOCK' started with status: deployed
05-Mar-2019 19:19:32 2019-03-05 19:19:32.234  INFO 10564 --- [           main] o.s.c.d.acceptance.test.TickTockTests    : App 'log' has instances: {TICKTOCK.log-v1-0=http://10.194.6.11:54359, TICKTOCK.log-v2-0=http://10.194.6.11:38831}
05-Mar-2019 19:19:32 2019-03-05 19:19:32.235  INFO 10564 --- [           main] o.s.c.d.acceptance.test.TickTockTests    : App 'time' has instances: {TICKTOCK.time-v1-0=http://10.194.6.11:43439}
05-Mar-2019 19:19:32 2019-03-05 19:19:32.235  INFO 10564 --- [           main] o.s.c.d.acceptance.test.TickTockTests    : Looking for 'Started LogSink' in logfile for log
05-Mar-2019 19:19:37 2019-03-05 19:19:37.235  INFO 10564 --- [           main] o.s.c.d.acceptance.test.TickTockTests    : Requesting log for app TICKTOCK.log-v1-0
05-Mar-2019 19:19:37 2019-03-05 19:19:37.240  WARN 10564 --- [           main] o.s.c.d.acceptance.test.TickTockTests    : Error while trying to access logfile from 'http://10.194.6.11:54359/logfile' due to : org.springframework.web.client.ResourceAccessException: I/O error on GET request for "http://10.194.6.11:54359/logfile": Connection refused (Connection refused); nested exception is java.net.ConnectException: Connection refused (Connection refused)
05-Mar-2019 19:19:37 2019-03-05 19:19:37.240  INFO 10564 --- [           main] o.s.c.d.acceptance.test.TickTockTests    : Requesting log for app TICKTOCK.log-v2-0
05-Mar-2019 19:19:37 2019-03-05 19:19:37.373  INFO 10564 --- [           main] o.s.c.d.acceptance.test.TickTockTests    : Retrieved logfile from 'http://10.194.6.11:38831/actuator/logfile
05-Mar-2019 19:19:37 2019-03-05 19:19:37.373  INFO 10564 --- [           main] o.s.c.d.acceptance.test.TickTockTests    : Matched all 'Started LogSink' in logfile for app log (source TICKTOCK.log-v2-0)
05-Mar-2019 19:19:37 2019-03-05 19:19:37.373  INFO 10564 --- [           main] o.s.c.d.acceptance.test.TickTockTests    : Looking for 'TICKTOCK Updated - TIMESTAMP:' in logfile for log
05-Mar-2019 19:19:42 2019-03-05 19:19:42.373  INFO 10564 --- [           main] o.s.c.d.acceptance.test.TickTockTests    : Requesting log for app TICKTOCK.log-v1-0
05-Mar-2019 19:19:42 2019-03-05 19:19:42.374  WARN 10564 --- [           main] o.s.c.d.acceptance.test.TickTockTests    : Error while trying to access logfile from 'http://10.194.6.11:54359/logfile' due to : org.springframework.web.client.ResourceAccessException: I/O error on GET request for "http://10.194.6.11:54359/logfile": Connection refused (Connection refused); nested exception is java.net.ConnectException: Connection refused (Connection refused)
05-Mar-2019 19:19:42 2019-03-05 19:19:42.375  INFO 10564 --- [           main] o.s.c.d.acceptance.test.TickTockTests    : Requesting log for app TICKTOCK.log-v2-0
05-Mar-2019 19:19:42 2019-03-05 19:19:42.382  INFO 10564 --- [           main] o.s.c.d.acceptance.test.TickTockTests    : Retrieved logfile from 'http://10.194.6.11:38831/actuator/logfile
05-Mar-2019 19:19:42 2019-03-05 19:19:42.382  INFO 10564 --- [           main] o.s.c.d.acceptance.test.TickTockTests    : Matched all 'TICKTOCK Updated - TIMESTAMP:' in logfile for app log (source TICKTOCK.log-v2-0)
05-Mar-2019 19:19:42 2019-03-05 19:19:42.382  INFO 10564 --- [           main] o.s.c.d.acceptance.test.TickTockTests    : Rolling back the stream 'TICKTOCK' to the version 0
05-Mar-2019 19:19:42 2019-03-05 19:19:42.686  INFO 10564 --- [           main] o.s.c.d.acceptance.test.TickTockTests    : Checking: Stream=TICKTOCK, status = deploying, status description = The stream is being deployed.
05-Mar-2019 19:19:42 2019-03-05 19:19:42.686  INFO 10564 --- [           main] o.s.c.d.acceptance.test.TickTockTests    : Sleeping to check status of Stream=TICKTOCK
05-Mar-2019 19:19:47 2019-03-05 19:19:47.728  INFO 10564 --- [           main] o.s.c.d.acceptance.test.TickTockTests    : Checking: Stream=TICKTOCK, status = deploying, status description = The stream is being deployed.
05-Mar-2019 19:19:47 2019-03-05 19:19:47.728  INFO 10564 --- [           main] o.s.c.d.acceptance.test.TickTockTests    : Sleeping to check status of Stream=TICKTOCK
05-Mar-2019 19:19:52 2019-03-05 19:19:52.757  INFO 10564 --- [           main] o.s.c.d.acceptance.test.TickTockTests    : Checking: Stream=TICKTOCK, status = deployed, status description = The stream has been successfully deployed
05-Mar-2019 19:19:52 2019-03-05 19:19:52.798  INFO 10564 --- [           main] o.s.c.d.acceptance.test.TickTockTests    : Sleeping to check status of Stream=TICKTOCK
05-Mar-2019 19:19:57 2019-03-05 19:19:57.798  INFO 10564 --- [           main] o.s.c.d.acceptance.test.TickTockTests    : Stream 'TICKTOCK' started with status: deployed
05-Mar-2019 19:19:57 2019-03-05 19:19:57.799  INFO 10564 --- [           main] o.s.c.d.acceptance.test.TickTockTests    : App 'log' has instances: {TICKTOCK.log-v1-0=http://10.194.6.11:54359, TICKTOCK.log-v3-0=http://10.194.6.11:53723, TICKTOCK.log-v2-0=http://10.194.6.11:38831}
05-Mar-2019 19:19:57 2019-03-05 19:19:57.799  INFO 10564 --- [           main] o.s.c.d.acceptance.test.TickTockTests    : App 'time' has instances: {TICKTOCK.time-v1-0=http://10.194.6.11:43439}
05-Mar-2019 19:19:57 2019-03-05 19:19:57.799  INFO 10564 --- [           main] o.s.c.d.acceptance.test.TickTockTests    : Looking for 'TICKTOCK - TIMESTAMP:' in logfile for log
05-Mar-2019 19:20:02 2019-03-05 19:20:02.799  INFO 10564 --- [           main] o.s.c.d.acceptance.test.TickTockTests    : Requesting log for app TICKTOCK.log-v1-0
05-Mar-2019 19:20:02 2019-03-05 19:20:02.800  WARN 10564 --- [           main] o.s.c.d.acceptance.test.TickTockTests    : Error while trying to access logfile from 'http://10.194.6.11:54359/logfile' due to : org.springframework.web.client.ResourceAccessException: I/O error on GET request for "http://10.194.6.11:54359/logfile": Connection refused (Connection refused); nested exception is java.net.ConnectException: Connection refused (Connection refused)
05-Mar-2019 19:20:02 2019-03-05 19:20:02.800  INFO 10564 --- [           main] o.s.c.d.acceptance.test.TickTockTests    : Requesting log for app TICKTOCK.log-v3-0
05-Mar-2019 19:20:02 2019-03-05 19:20:02.940  INFO 10564 --- [           main] o.s.c.d.acceptance.test.TickTockTests    : Retrieved logfile from 'http://10.194.6.11:53723/actuator/logfile
05-Mar-2019 19:20:02 2019-03-05 19:20:02.940  INFO 10564 --- [           main] o.s.c.d.acceptance.test.TickTockTests    : Requesting log for app TICKTOCK.log-v2-0
05-Mar-2019 19:20:02 2019-03-05 19:20:02.941  WARN 10564 --- [           main] o.s.c.d.acceptance.test.TickTockTests    : Error while trying to access logfile from 'http://10.194.6.11:38831/logfile' due to : org.springframework.web.client.ResourceAccessException: I/O error on GET request for "http://10.194.6.11:38831/logfile": Connection refused (Connection refused); nested exception is java.net.ConnectException: Connection refused (Connection refused)
05-Mar-2019 19:20:02 2019-03-05 19:20:02.941  INFO 10564 --- [           main] o.s.c.d.acceptance.test.TickTockTests    : Matched all 'TICKTOCK - TIMESTAMP:' in logfile for app log (source TICKTOCK.log-v3-0)
05-Mar-2019 19:20:02 2019-03-05 19:20:02.943  INFO 10564 --- [           main] junit.logTestName                        : Test tickTockUpdateRollbackTests(org.springframework.cloud.dataflow.acceptance.test.TickTockTests) Succeeded
05-Mar-2019 19:20:02 2019-03-05 19:20:02.943  INFO 10564 --- [           main] junit.logTestName                        : Finished Test tickTockUpdateRollbackTests(org.springframework.cloud.dataflow.acceptance.test.TickTockTests)
05-Mar-2019 19:20:02 2019-03-05 19:20:02.943  INFO 10564 --- [           main] o.s.c.d.acceptance.test.TickTockTests    : Destroy all streams
05-Mar-2019 19:20:03 2019-03-05 19:20:03.191  INFO 10564 --- [           main] junit.logTestName                        : Starting Test tickTockTests(org.springframework.cloud.dataflow.acceptance.test.TickTockTests)
05-Mar-2019 19:20:03 2019-03-05 19:20:03.192  INFO 10564 --- [           main] o.s.c.d.acceptance.test.TickTockTests    : Creating stream 'TICKTOCK'
05-Mar-2019 19:20:03 2019-03-05 19:20:03.216  INFO 10564 --- [           main] o.s.c.d.acceptance.test.TickTockTests    : Deploying stream 'TICKTOCK' with properties: {app.*.spring.cloud.streamapp.security.enabled=false, app.*.logging.file=${PID}-test.log, app.*.endpoints.logfile.sensitive=false, app.log.log.expression='TICKTOCK - TIMESTAMP: '.concat(payload), app.*.management.endpoints.web.exposure.include=*}
05-Mar-2019 19:20:03 2019-03-05 19:20:03.680  INFO 10564 --- [           main] o.s.c.d.acceptance.test.TickTockTests    : Checking: Stream=TICKTOCK, status = deploying, status description = The stream is being deployed.
05-Mar-2019 19:20:03 2019-03-05 19:20:03.680  INFO 10564 --- [           main] o.s.c.d.acceptance.test.TickTockTests    : Sleeping to check status of Stream=TICKTOCK
05-Mar-2019 19:20:08 2019-03-05 19:20:08.725  INFO 10564 --- [           main] o.s.c.d.acceptance.test.TickTockTests    : Checking: Stream=TICKTOCK, status = deploying, status description = The stream is being deployed.
05-Mar-2019 19:20:08 2019-03-05 19:20:08.725  INFO 10564 --- [           main] o.s.c.d.acceptance.test.TickTockTests    : Sleeping to check status of Stream=TICKTOCK
05-Mar-2019 19:20:13 2019-03-05 19:20:13.771  INFO 10564 --- [           main] o.s.c.d.acceptance.test.TickTockTests    : Checking: Stream=TICKTOCK, status = deploying, status description = The stream is being deployed.
05-Mar-2019 19:20:13 2019-03-05 19:20:13.772  INFO 10564 --- [           main] o.s.c.d.acceptance.test.TickTockTests    : Sleeping to check status of Stream=TICKTOCK
05-Mar-2019 19:20:18 2019-03-05 19:20:18.836  INFO 10564 --- [           main] o.s.c.d.acceptance.test.TickTockTests    : Checking: Stream=TICKTOCK, status = deployed, status description = The stream has been successfully deployed
05-Mar-2019 19:20:18 2019-03-05 19:20:18.889  INFO 10564 --- [           main] o.s.c.d.acceptance.test.TickTockTests    : Sleeping to check status of Stream=TICKTOCK
05-Mar-2019 19:20:23 2019-03-05 19:20:23.890  INFO 10564 --- [           main] o.s.c.d.acceptance.test.TickTockTests    : Stream 'TICKTOCK' started with status: deployed
05-Mar-2019 19:20:23 2019-03-05 19:20:23.890  INFO 10564 --- [           main] o.s.c.d.acceptance.test.TickTockTests    : App 'log' has instances: {TICKTOCK.log-v4-0=http://10.194.6.11:51104}
05-Mar-2019 19:20:23 2019-03-05 19:20:23.890  INFO 10564 --- [           main] o.s.c.d.acceptance.test.TickTockTests    : App 'time' has instances: {TICKTOCK.time-v4-0=http://10.194.6.11:46075}
05-Mar-2019 19:20:23 2019-03-05 19:20:23.890  INFO 10564 --- [           main] o.s.c.d.acceptance.test.TickTockTests    : Looking for 'Started TimeSource' in logfile for time
05-Mar-2019 19:20:28 2019-03-05 19:20:28.890  INFO 10564 --- [           main] o.s.c.d.acceptance.test.TickTockTests    : Requesting log for app TICKTOCK.time-v4-0
05-Mar-2019 19:20:29 2019-03-05 19:20:29.029  INFO 10564 --- [           main] o.s.c.d.acceptance.test.TickTockTests    : Retrieved logfile from 'http://10.194.6.11:46075/actuator/logfile
05-Mar-2019 19:20:29 2019-03-05 19:20:29.029  INFO 10564 --- [           main] o.s.c.d.acceptance.test.TickTockTests    : Matched all 'Started TimeSource' in logfile for app time (source TICKTOCK.time-v4-0)
05-Mar-2019 19:20:29 2019-03-05 19:20:29.029  INFO 10564 --- [           main] o.s.c.d.acceptance.test.TickTockTests    : Looking for 'Started LogSink' in logfile for log
05-Mar-2019 19:20:34 2019-03-05 19:20:34.029  INFO 10564 --- [           main] o.s.c.d.acceptance.test.TickTockTests    : Requesting log for app TICKTOCK.log-v4-0
05-Mar-2019 19:20:34 2019-03-05 19:20:34.167  INFO 10564 --- [           main] o.s.c.d.acceptance.test.TickTockTests    : Retrieved logfile from 'http://10.194.6.11:51104/actuator/logfile
05-Mar-2019 19:20:34 2019-03-05 19:20:34.167  INFO 10564 --- [           main] o.s.c.d.acceptance.test.TickTockTests    : Matched all 'Started LogSink' in logfile for app log (source TICKTOCK.log-v4-0)
05-Mar-2019 19:20:34 2019-03-05 19:20:34.167  INFO 10564 --- [           main] o.s.c.d.acceptance.test.TickTockTests    : Looking for 'TICKTOCK - TIMESTAMP:' in logfile for log
05-Mar-2019 19:20:39 2019-03-05 19:20:39.167  INFO 10564 --- [           main] o.s.c.d.acceptance.test.TickTockTests    : Requesting log for app TICKTOCK.log-v4-0
05-Mar-2019 19:20:39 2019-03-05 19:20:39.174  INFO 10564 --- [           main] o.s.c.d.acceptance.test.TickTockTests    : Retrieved logfile from 'http://10.194.6.11:51104/actuator/logfile
05-Mar-2019 19:20:39 2019-03-05 19:20:39.174  INFO 10564 --- [           main] o.s.c.d.acceptance.test.TickTockTests    : Matched all 'TICKTOCK - TIMESTAMP:' in logfile for app log (source TICKTOCK.log-v4-0)
05-Mar-2019 19:20:39 2019-03-05 19:20:39.175  INFO 10564 --- [           main] junit.logTestName                        : Test tickTockTests(org.springframework.cloud.dataflow.acceptance.test.TickTockTests) Succeeded
05-Mar-2019 19:20:39 2019-03-05 19:20:39.175  INFO 10564 --- [           main] junit.logTestName                        : Finished Test tickTockTests(org.springframework.cloud.dataflow.acceptance.test.TickTockTests)
05-Mar-2019 19:20:39 2019-03-05 19:20:39.175  INFO 10564 --- [           main] o.s.c.d.acceptance.test.TickTockTests    : Destroy all streams
05-Mar-2019 19:20:39 Tests run: 3, Failures: 0, Errors: 0, Skipped: 1, Time elapsed: 120.978 sec - in org.springframework.cloud.dataflow.acceptance.test.TickTockTests
05-Mar-2019 19:20:39 Running org.springframework.cloud.dataflow.acceptance.test.TransformTests
05-Mar-2019 19:20:39 2019-03-05 19:20:39.362  INFO 10564 --- [           main] .b.t.c.SpringBootTestContextBootstrapper : Neither @ContextConfiguration nor @ContextHierarchy found for test class [org.springframework.cloud.dataflow.acceptance.test.TransformTests], using SpringBootContextLoader
05-Mar-2019 19:20:39 2019-03-05 19:20:39.371  INFO 10564 --- [           main] .b.t.c.SpringBootTestContextBootstrapper : Loaded default TestExecutionListener class names from location [META-INF/spring.factories]: [org.springframework.boot.test.mock.mockito.MockitoTestExecutionListener, org.springframework.boot.test.mock.mockito.ResetMocksTestExecutionListener, org.springframework.boot.test.autoconfigure.restdocs.RestDocsTestExecutionListener, org.springframework.boot.test.autoconfigure.web.client.MockRestServiceServerResetTestExecutionListener, org.springframework.boot.test.autoconfigure.web.servlet.MockMvcPrintOnlyOnFailureTestExecutionListener, org.springframework.boot.test.autoconfigure.web.servlet.WebDriverTestExecutionListener, org.springframework.test.context.web.ServletTestExecutionListener, org.springframework.test.context.support.DirtiesContextBeforeModesTestExecutionListener, org.springframework.test.context.support.DependencyInjectionTestExecutionListener, org.springframework.test.context.support.DirtiesContextTestExecutionListener, org.springframework.test.context.transaction.TransactionalTestExecutionListener, org.springframework.test.context.jdbc.SqlScriptsTestExecutionListener]
05-Mar-2019 19:20:39 2019-03-05 19:20:39.373  INFO 10564 --- [           main] .b.t.c.SpringBootTestContextBootstrapper : Using TestExecutionListeners: [org.springframework.test.context.web.ServletTestExecutionListener@56b859a6, org.springframework.test.context.support.DirtiesContextBeforeModesTestExecutionListener@590adb41, org.springframework.boot.test.autoconfigure.SpringBootDependencyInjectionTestExecutionListener@42aae04d, org.springframework.test.context.support.DirtiesContextTestExecutionListener@43bf5397, org.springframework.test.context.transaction.TransactionalTestExecutionListener@575e572f, org.springframework.test.context.jdbc.SqlScriptsTestExecutionListener@58015e56, org.springframework.boot.test.autoconfigure.web.servlet.MockMvcPrintOnlyOnFailureTestExecutionListener@4d3c6593, org.springframework.boot.test.autoconfigure.web.client.MockRestServiceServerResetTestExecutionListener@7426a448, org.springframework.boot.test.mock.mockito.ResetMocksTestExecutionListener@516462cc, org.springframework.boot.test.autoconfigure.web.servlet.WebDriverTestExecutionListener@3456558, org.springframework.boot.test.autoconfigure.restdocs.RestDocsTestExecutionListener@2dfb885e, org.springframework.boot.test.mock.mockito.MockitoTestExecutionListener@6cbe7d4d]
05-Mar-2019 19:20:39 2019-03-05 19:20:39.448  INFO 10564 --- [           main] junit.logTestName                        : Starting Test transformTests(org.springframework.cloud.dataflow.acceptance.test.TransformTests)
05-Mar-2019 19:20:39 2019-03-05 19:20:39.453  INFO 10564 --- [           main] o.s.c.d.acceptance.test.TransformTests   : Creating stream 'TRANSFORM-TEST'
05-Mar-2019 19:20:39 2019-03-05 19:20:39.501  INFO 10564 --- [           main] o.s.c.d.acceptance.test.TransformTests   : Deploying stream 'TRANSFORM-TEST' with properties: {app.*.spring.cloud.streamapp.security.enabled=false, app.*.logging.file=${PID}-test.log, app.*.endpoints.logfile.sensitive=false, app.*.management.endpoints.web.exposure.include=*}
05-Mar-2019 19:20:42 2019-03-05 19:20:42.356  INFO 10564 --- [           main] o.s.c.d.acceptance.test.TransformTests   : Checking: Stream=TRANSFORM-TEST, status = deploying, status description = The stream is being deployed.
05-Mar-2019 19:20:42 2019-03-05 19:20:42.356  INFO 10564 --- [           main] o.s.c.d.acceptance.test.TransformTests   : Sleeping to check status of Stream=TRANSFORM-TEST
05-Mar-2019 19:20:47 2019-03-05 19:20:47.417  INFO 10564 --- [           main] o.s.c.d.acceptance.test.TransformTests   : Checking: Stream=TRANSFORM-TEST, status = deploying, status description = The stream is being deployed.
05-Mar-2019 19:20:47 2019-03-05 19:20:47.417  INFO 10564 --- [           main] o.s.c.d.acceptance.test.TransformTests   : Sleeping to check status of Stream=TRANSFORM-TEST
05-Mar-2019 19:20:52 2019-03-05 19:20:52.481  INFO 10564 --- [           main] o.s.c.d.acceptance.test.TransformTests   : Checking: Stream=TRANSFORM-TEST, status = deploying, status description = The stream is being deployed.
05-Mar-2019 19:20:52 2019-03-05 19:20:52.481  INFO 10564 --- [           main] o.s.c.d.acceptance.test.TransformTests   : Sleeping to check status of Stream=TRANSFORM-TEST
05-Mar-2019 19:20:57 2019-03-05 19:20:57.531  INFO 10564 --- [           main] o.s.c.d.acceptance.test.TransformTests   : Checking: Stream=TRANSFORM-TEST, status = deploying, status description = The stream is being deployed.
05-Mar-2019 19:20:57 2019-03-05 19:20:57.531  INFO 10564 --- [           main] o.s.c.d.acceptance.test.TransformTests   : Sleeping to check status of Stream=TRANSFORM-TEST
05-Mar-2019 19:21:02 2019-03-05 19:21:02.578  INFO 10564 --- [           main] o.s.c.d.acceptance.test.TransformTests   : Checking: Stream=TRANSFORM-TEST, status = deployed, status description = The stream has been successfully deployed
05-Mar-2019 19:21:02 2019-03-05 19:21:02.623  INFO 10564 --- [           main] o.s.c.d.acceptance.test.TransformTests   : Sleeping to check status of Stream=TRANSFORM-TEST
05-Mar-2019 19:21:07 2019-03-05 19:21:07.624  INFO 10564 --- [           main] o.s.c.d.acceptance.test.TransformTests   : Stream 'TRANSFORM-TEST' started with status: deployed
05-Mar-2019 19:21:07 2019-03-05 19:21:07.625  INFO 10564 --- [           main] o.s.c.d.acceptance.test.TransformTests   : App 'transform' has instances: {TRANSFORM-TEST.transform-v1-0=http://10.194.6.11:49760}
05-Mar-2019 19:21:07 2019-03-05 19:21:07.625  INFO 10564 --- [           main] o.s.c.d.acceptance.test.TransformTests   : App 'log' has instances: {TRANSFORM-TEST.log-v1-0=http://10.194.6.11:48145}
05-Mar-2019 19:21:07 2019-03-05 19:21:07.625  INFO 10564 --- [           main] o.s.c.d.acceptance.test.TransformTests   : App 'http' has instances: {TRANSFORM-TEST.http-v1-0=http://10.194.6.11:46878}
05-Mar-2019 19:21:07 2019-03-05 19:21:07.625  INFO 10564 --- [           main] o.s.c.d.acceptance.test.TransformTests   : Looking for 'Started HttpSource' in logfile for http
05-Mar-2019 19:21:12 2019-03-05 19:21:12.625  INFO 10564 --- [           main] o.s.c.d.acceptance.test.TransformTests   : Requesting log for app TRANSFORM-TEST.http-v1-0
05-Mar-2019 19:21:12 2019-03-05 19:21:12.795  INFO 10564 --- [           main] o.s.c.d.acceptance.test.TransformTests   : Retrieved logfile from 'http://10.194.6.11:46878/actuator/logfile
05-Mar-2019 19:21:12 2019-03-05 19:21:12.795  INFO 10564 --- [           main] o.s.c.d.acceptance.test.TransformTests   : Matched all 'Started HttpSource' in logfile for app http (source TRANSFORM-TEST.http-v1-0)
05-Mar-2019 19:21:12 2019-03-05 19:21:12.849  INFO 10564 --- [           main] o.s.c.d.acceptance.test.TransformTests   : Looking for 'Started LogSink' in logfile for log
05-Mar-2019 19:21:17 2019-03-05 19:21:17.850  INFO 10564 --- [           main] o.s.c.d.acceptance.test.TransformTests   : Requesting log for app TRANSFORM-TEST.log-v1-0
05-Mar-2019 19:21:17 2019-03-05 19:21:17.980  INFO 10564 --- [           main] o.s.c.d.acceptance.test.TransformTests   : Retrieved logfile from 'http://10.194.6.11:48145/actuator/logfile
05-Mar-2019 19:21:17 2019-03-05 19:21:17.980  INFO 10564 --- [           main] o.s.c.d.acceptance.test.TransformTests   : Matched all 'Started LogSink' in logfile for app log (source TRANSFORM-TEST.log-v1-0)
05-Mar-2019 19:21:17 2019-03-05 19:21:17.980  INFO 10564 --- [           main] o.s.c.d.acceptance.test.TransformTests   : Looking for 'ABCDEFG' in logfile for log
05-Mar-2019 19:21:22 2019-03-05 19:21:22.980  INFO 10564 --- [           main] o.s.c.d.acceptance.test.TransformTests   : Requesting log for app TRANSFORM-TEST.log-v1-0
05-Mar-2019 19:21:22 2019-03-05 19:21:22.990  INFO 10564 --- [           main] o.s.c.d.acceptance.test.TransformTests   : Retrieved logfile from 'http://10.194.6.11:48145/actuator/logfile
05-Mar-2019 19:21:22 2019-03-05 19:21:22.991  INFO 10564 --- [           main] o.s.c.d.acceptance.test.TransformTests   : Matched all 'ABCDEFG' in logfile for app log (source TRANSFORM-TEST.log-v1-0)
05-Mar-2019 19:21:22 2019-03-05 19:21:22.992  INFO 10564 --- [           main] junit.logTestName                        : Test transformTests(org.springframework.cloud.dataflow.acceptance.test.TransformTests) Succeeded
05-Mar-2019 19:21:22 2019-03-05 19:21:22.992  INFO 10564 --- [           main] junit.logTestName                        : Finished Test transformTests(org.springframework.cloud.dataflow.acceptance.test.TransformTests)
05-Mar-2019 19:21:22 2019-03-05 19:21:22.992  INFO 10564 --- [           main] o.s.c.d.acceptance.test.TransformTests   : Destroy all streams
05-Mar-2019 19:21:23 Tests run: 1, Failures: 0, Errors: 0, Skipped: 0, Time elapsed: 44.203 sec - in org.springframework.cloud.dataflow.acceptance.test.TransformTests
05-Mar-2019 19:21:23 Running org.springframework.cloud.dataflow.acceptance.test.SchedulerTests
05-Mar-2019 19:21:23 2019-03-05 19:21:23.661  INFO 10564 --- [           main] s.c.a.AnnotationConfigApplicationContext : Refreshing org.springframework.context.annotation.AnnotationConfigApplicationContext@32a2a6be: startup date [Tue Mar 05 19:21:23 UTC 2019]; root of context hierarchy
05-Mar-2019 19:21:23 2019-03-05 19:21:23.686  INFO 10564 --- [           main] trationDelegate$BeanPostProcessorChecker : Bean 'configurationPropertiesRebinderAutoConfiguration' of type [class org.springframework.cloud.autoconfigure.ConfigurationPropertiesRebinderAutoConfiguration$$EnhancerBySpringCGLIB$$95ff43c0] is not eligible for getting processed by all BeanPostProcessors (for example: not eligible for auto-proxying)
05-Mar-2019 19:21:23
05-Mar-2019 19:21:23   .   ____          _            __ _ _
05-Mar-2019 19:21:23 /\\ / ___'_ __ _ _(_)_ __  __ _ \ \ \ \
05-Mar-2019 19:21:23 ( ( )\___ | '_ | '_| | '_ \/ _` | \ \ \ \
05-Mar-2019 19:21:23 \\/  ___)| |_)| | | | | || (_| |  ) ) ) )
05-Mar-2019 19:21:23   '  |____| .__|_| |_|_| |_\__, | / / / /
05-Mar-2019 19:21:23 =========|_|==============|___/=/_/_/_/
05-Mar-2019 19:21:23 :: Spring Boot ::        (v1.4.1.RELEASE)
05-Mar-2019 19:21:23
05-Mar-2019 19:21:23 2019-03-05 19:21:23.802  INFO 10564 --- [           main] c.c.c.ConfigServicePropertySourceLocator : Fetching config from server at: http://localhost:8888
05-Mar-2019 19:21:23 2019-03-05 19:21:23.804  WARN 10564 --- [           main] c.c.c.ConfigServicePropertySourceLocator : Could not locate PropertySource: I/O error on GET request for "http://localhost:8888//blah": Connection refused (Connection refused); nested exception is java.net.ConnectException: Connection refused (Connection refused)
05-Mar-2019 19:21:23 2019-03-05 19:21:23.805  INFO 10564 --- [           main] o.a.maven.surefire.booter.ForkedBooter   : The following profiles are active: blah
05-Mar-2019 19:21:23 2019-03-05 19:21:23.807  INFO 10564 --- [           main] s.c.a.AnnotationConfigApplicationContext : Refreshing org.springframework.context.annotation.AnnotationConfigApplicationContext@7c281eb8: startup date [Tue Mar 05 19:21:23 UTC 2019]; parent: org.springframework.context.annotation.AnnotationConfigApplicationContext@32a2a6be
05-Mar-2019 19:21:23 2019-03-05 19:21:23.900  INFO 10564 --- [           main] o.a.maven.surefire.booter.ForkedBooter   : Started ForkedBooter in 0.325 seconds (JVM running for 290.433)
05-Mar-2019 19:21:23 2019-03-05 19:21:23.900  INFO 10564 --- [           main] s.c.a.AnnotationConfigApplicationContext : Closing org.springframework.context.annotation.AnnotationConfigApplicationContext@7c281eb8: startup date [Tue Mar 05 19:21:23 UTC 2019]; parent: org.springframework.context.annotation.AnnotationConfigApplicationContext@32a2a6be
05-Mar-2019 19:21:23 2019-03-05 19:21:23.902 ERROR 10564 --- [           main] o.s.c.d.a.test.util.SchedulerRule        : SCHEDULER IS NOT AVAILABLE, SKIPPING TESTS
05-Mar-2019 19:21:23
05-Mar-2019 19:21:23 java.lang.IllegalArgumentException: no SchedulerOperations bean is available.  Skipping test.
05-Mar-2019 19:21:23         at org.springframework.util.Assert.notNull(Assert.java:115)
05-Mar-2019 19:21:23         at org.springframework.cloud.dataflow.acceptance.test.util.SchedulerRule.obtainResource(SchedulerRule.java:57)
05-Mar-2019 19:21:23         at org.springframework.cloud.scheduler.spi.junit.AbstractExternalResourceTestSupport.apply(AbstractExternalResourceTestSupport.java:58)
05-Mar-2019 19:21:23         at org.junit.rules.RunRules.applyAll(RunRules.java:26)
05-Mar-2019 19:21:23         at org.junit.rules.RunRules.<init>(RunRules.java:15)
05-Mar-2019 19:21:23         at org.junit.runners.ParentRunner.withClassRules(ParentRunner.java:245)
05-Mar-2019 19:21:23         at org.junit.runners.ParentRunner.classBlock(ParentRunner.java:194)
05-Mar-2019 19:21:23         at org.junit.runners.ParentRunner.run(ParentRunner.java:362)
05-Mar-2019 19:21:23         at org.springframework.test.context.junit4.SpringJUnit4ClassRunner.run(SpringJUnit4ClassRunner.java:191)
05-Mar-2019 19:21:23         at org.apache.maven.surefire.junit4.JUnit4Provider.execute(JUnit4Provider.java:283)
05-Mar-2019 19:21:23         at org.apache.maven.surefire.junit4.JUnit4Provider.executeWithRerun(JUnit4Provider.java:173)
05-Mar-2019 19:21:23         at org.apache.maven.surefire.junit4.JUnit4Provider.executeTestSet(JUnit4Provider.java:153)
05-Mar-2019 19:21:23         at org.apache.maven.surefire.junit4.JUnit4Provider.invoke(JUnit4Provider.java:128)
05-Mar-2019 19:21:23         at org.apache.maven.surefire.booter.ForkedBooter.invokeProviderInSameClassLoader(ForkedBooter.java:203)
05-Mar-2019 19:21:23         at org.apache.maven.surefire.booter.ForkedBooter.runSuitesInProcess(ForkedBooter.java:155)
05-Mar-2019 19:21:23         at org.apache.maven.surefire.booter.ForkedBooter.main(ForkedBooter.java:103)
05-Mar-2019 19:21:23
05-Mar-2019 19:21:23 Tests run: 1, Failures: 0, Errors: 0, Skipped: 1, Time elapsed: 0.333 sec - in org.springframework.cloud.dataflow.acceptance.test.SchedulerTests
05-Mar-2019 19:21:23 Running org.springframework.cloud.dataflow.acceptance.test.NamedChannelTests
05-Mar-2019 19:21:23 2019-03-05 19:21:23.904  INFO 10564 --- [           main] .b.t.c.SpringBootTestContextBootstrapper : Neither @ContextConfiguration nor @ContextHierarchy found for test class [org.springframework.cloud.dataflow.acceptance.test.NamedChannelTests], using SpringBootContextLoader
05-Mar-2019 19:21:23 2019-03-05 19:21:23.909  INFO 10564 --- [           main] .b.t.c.SpringBootTestContextBootstrapper : Loaded default TestExecutionListener class names from location [META-INF/spring.factories]: [org.springframework.boot.test.mock.mockito.MockitoTestExecutionListener, org.springframework.boot.test.mock.mockito.ResetMocksTestExecutionListener, org.springframework.boot.test.autoconfigure.restdocs.RestDocsTestExecutionListener, org.springframework.boot.test.autoconfigure.web.client.MockRestServiceServerResetTestExecutionListener, org.springframework.boot.test.autoconfigure.web.servlet.MockMvcPrintOnlyOnFailureTestExecutionListener, org.springframework.boot.test.autoconfigure.web.servlet.WebDriverTestExecutionListener, org.springframework.test.context.web.ServletTestExecutionListener, org.springframework.test.context.support.DirtiesContextBeforeModesTestExecutionListener, org.springframework.test.context.support.DependencyInjectionTestExecutionListener, org.springframework.test.context.support.DirtiesContextTestExecutionListener, org.springframework.test.context.transaction.TransactionalTestExecutionListener, org.springframework.test.context.jdbc.SqlScriptsTestExecutionListener]
05-Mar-2019 19:21:23 2019-03-05 19:21:23.912  INFO 10564 --- [           main] .b.t.c.SpringBootTestContextBootstrapper : Using TestExecutionListeners: [org.springframework.test.context.web.ServletTestExecutionListener@2e62ead7, org.springframework.test.context.support.DirtiesContextBeforeModesTestExecutionListener@3b98b809, org.springframework.boot.test.autoconfigure.SpringBootDependencyInjectionTestExecutionListener@bf75b5c, org.springframework.test.context.support.DirtiesContextTestExecutionListener@16da476c, org.springframework.test.context.transaction.TransactionalTestExecutionListener@2fd72332, org.springframework.test.context.jdbc.SqlScriptsTestExecutionListener@51f18e31, org.springframework.boot.test.autoconfigure.web.servlet.MockMvcPrintOnlyOnFailureTestExecutionListener@60ed12e8, org.springframework.boot.test.autoconfigure.web.client.MockRestServiceServerResetTestExecutionListener@24c8d8be, org.springframework.boot.test.mock.mockito.ResetMocksTestExecutionListener@3290b1a6, org.springframework.boot.test.autoconfigure.web.servlet.WebDriverTestExecutionListener@6fcd31c3, org.springframework.boot.test.autoconfigure.restdocs.RestDocsTestExecutionListener@67bf0480, org.springframework.boot.test.mock.mockito.MockitoTestExecutionListener@5503de1]
05-Mar-2019 19:21:23 2019-03-05 19:21:23.982  INFO 10564 --- [           main] junit.logTestName                        : Starting Test testDestination(org.springframework.cloud.dataflow.acceptance.test.NamedChannelTests)
05-Mar-2019 19:21:23 2019-03-05 19:21:23.983  INFO 10564 --- [           main] o.s.c.d.a.test.NamedChannelTests         : Creating stream 'LOG-DESTINATION-SINK'
05-Mar-2019 19:21:24 2019-03-05 19:21:24.008  INFO 10564 --- [           main] o.s.c.d.a.test.NamedChannelTests         : Deploying stream 'LOG-DESTINATION-SINK' with properties: {app.*.spring.cloud.streamapp.security.enabled=false, app.*.logging.file=${PID}-test.log, app.*.endpoints.logfile.sensitive=false, app.*.management.endpoints.web.exposure.include=*}
05-Mar-2019 19:21:24 2019-03-05 19:21:24.350  INFO 10564 --- [           main] o.s.c.d.a.test.NamedChannelTests         : Checking: Stream=LOG-DESTINATION-SINK, status = deploying, status description = The stream is being deployed.
05-Mar-2019 19:21:24 2019-03-05 19:21:24.350  INFO 10564 --- [           main] o.s.c.d.a.test.NamedChannelTests         : Sleeping to check status of Stream=LOG-DESTINATION-SINK
05-Mar-2019 19:21:29 2019-03-05 19:21:29.389  INFO 10564 --- [           main] o.s.c.d.a.test.NamedChannelTests         : Checking: Stream=LOG-DESTINATION-SINK, status = deploying, status description = The stream is being deployed.
05-Mar-2019 19:21:29 2019-03-05 19:21:29.389  INFO 10564 --- [           main] o.s.c.d.a.test.NamedChannelTests         : Sleeping to check status of Stream=LOG-DESTINATION-SINK
05-Mar-2019 19:21:34 2019-03-05 19:21:34.420  INFO 10564 --- [           main] o.s.c.d.a.test.NamedChannelTests         : Checking: Stream=LOG-DESTINATION-SINK, status = deployed, status description = The stream has been successfully deployed
05-Mar-2019 19:21:34 2019-03-05 19:21:34.453  INFO 10564 --- [           main] o.s.c.d.a.test.NamedChannelTests         : Sleeping to check status of Stream=LOG-DESTINATION-SINK
05-Mar-2019 19:21:39 2019-03-05 19:21:39.453  INFO 10564 --- [           main] o.s.c.d.a.test.NamedChannelTests         : Stream 'LOG-DESTINATION-SINK' started with status: deployed
05-Mar-2019 19:21:39 2019-03-05 19:21:39.453  INFO 10564 --- [           main] o.s.c.d.a.test.NamedChannelTests         : App 'log' has instances: {LOG-DESTINATION-SINK.log-v1-0=http://10.194.6.11:33727}
05-Mar-2019 19:21:39 2019-03-05 19:21:39.453  INFO 10564 --- [           main] o.s.c.d.a.test.NamedChannelTests         : Looking for 'Started LogSink' in logfile for log
05-Mar-2019 19:21:44 2019-03-05 19:21:44.453  INFO 10564 --- [           main] o.s.c.d.a.test.NamedChannelTests         : Requesting log for app LOG-DESTINATION-SINK.log-v1-0
05-Mar-2019 19:21:44 2019-03-05 19:21:44.586  INFO 10564 --- [           main] o.s.c.d.a.test.NamedChannelTests         : Retrieved logfile from 'http://10.194.6.11:33727/actuator/logfile
05-Mar-2019 19:21:44 2019-03-05 19:21:44.587  INFO 10564 --- [           main] o.s.c.d.a.test.NamedChannelTests         : Matched all 'Started LogSink' in logfile for app log (source LOG-DESTINATION-SINK.log-v1-0)
05-Mar-2019 19:21:44 2019-03-05 19:21:44.587  INFO 10564 --- [           main] o.s.c.d.a.test.NamedChannelTests         : Creating stream 'HTTP-DESTINATION-SOURCE'
05-Mar-2019 19:21:44 2019-03-05 19:21:44.609  INFO 10564 --- [           main] o.s.c.d.a.test.NamedChannelTests         : Deploying stream 'HTTP-DESTINATION-SOURCE' with properties: {app.*.spring.cloud.streamapp.security.enabled=false, app.*.logging.file=${PID}-test.log, app.*.endpoints.logfile.sensitive=false, app.*.management.endpoints.web.exposure.include=*}
05-Mar-2019 19:21:44 2019-03-05 19:21:44.891  INFO 10564 --- [           main] o.s.c.d.a.test.NamedChannelTests         : Checking: Stream=HTTP-DESTINATION-SOURCE, status = deploying, status description = The stream is being deployed.
05-Mar-2019 19:21:44 2019-03-05 19:21:44.892  INFO 10564 --- [           main] o.s.c.d.a.test.NamedChannelTests         : Sleeping to check status of Stream=HTTP-DESTINATION-SOURCE
05-Mar-2019 19:21:49 2019-03-05 19:21:49.938  INFO 10564 --- [           main] o.s.c.d.a.test.NamedChannelTests         : Checking: Stream=HTTP-DESTINATION-SOURCE, status = deploying, status description = The stream is being deployed.
05-Mar-2019 19:21:49 2019-03-05 19:21:49.938  INFO 10564 --- [           main] o.s.c.d.a.test.NamedChannelTests         : Sleeping to check status of Stream=HTTP-DESTINATION-SOURCE
05-Mar-2019 19:21:54 2019-03-05 19:21:54.979  INFO 10564 --- [           main] o.s.c.d.a.test.NamedChannelTests         : Checking: Stream=HTTP-DESTINATION-SOURCE, status = deployed, status description = The stream has been successfully deployed
05-Mar-2019 19:21:55 2019-03-05 19:21:55.019  INFO 10564 --- [           main] o.s.c.d.a.test.NamedChannelTests         : Sleeping to check status of Stream=HTTP-DESTINATION-SOURCE
05-Mar-2019 19:22:00 2019-03-05 19:22:00.019  INFO 10564 --- [           main] o.s.c.d.a.test.NamedChannelTests         : Stream 'HTTP-DESTINATION-SOURCE' started with status: deployed
05-Mar-2019 19:22:00 2019-03-05 19:22:00.020  INFO 10564 --- [           main] o.s.c.d.a.test.NamedChannelTests         : App 'http' has instances: {HTTP-DESTINATION-SOURCE.http-v1-0=http://10.194.6.11:26984}
05-Mar-2019 19:22:00 2019-03-05 19:22:00.020  INFO 10564 --- [           main] o.s.c.d.a.test.NamedChannelTests         : Looking for 'Started HttpSource' in logfile for http
05-Mar-2019 19:22:05 2019-03-05 19:22:05.020  INFO 10564 --- [           main] o.s.c.d.a.test.NamedChannelTests         : Requesting log for app HTTP-DESTINATION-SOURCE.http-v1-0
05-Mar-2019 19:22:05 2019-03-05 19:22:05.190  INFO 10564 --- [           main] o.s.c.d.a.test.NamedChannelTests         : Retrieved logfile from 'http://10.194.6.11:26984/actuator/logfile
05-Mar-2019 19:22:05 2019-03-05 19:22:05.191  INFO 10564 --- [           main] o.s.c.d.a.test.NamedChannelTests         : Matched all 'Started HttpSource' in logfile for app http (source HTTP-DESTINATION-SOURCE.http-v1-0)
05-Mar-2019 19:22:05 2019-03-05 19:22:05.245  INFO 10564 --- [           main] o.s.c.d.a.test.NamedChannelTests         : Looking for 'abcdefg' in logfile for log
05-Mar-2019 19:22:10 2019-03-05 19:22:10.246  INFO 10564 --- [           main] o.s.c.d.a.test.NamedChannelTests         : Requesting log for app LOG-DESTINATION-SINK.log-v1-0
05-Mar-2019 19:22:10 2019-03-05 19:22:10.259  INFO 10564 --- [           main] o.s.c.d.a.test.NamedChannelTests         : Retrieved logfile from 'http://10.194.6.11:33727/actuator/logfile
05-Mar-2019 19:22:10 2019-03-05 19:22:10.259  INFO 10564 --- [           main] o.s.c.d.a.test.NamedChannelTests         : Matched all 'abcdefg' in logfile for app log (source LOG-DESTINATION-SINK.log-v1-0)
05-Mar-2019 19:22:10 2019-03-05 19:22:10.261  INFO 10564 --- [           main] junit.logTestName                        : Test testDestination(org.springframework.cloud.dataflow.acceptance.test.NamedChannelTests) Succeeded
05-Mar-2019 19:22:10 2019-03-05 19:22:10.261  INFO 10564 --- [           main] junit.logTestName                        : Finished Test testDestination(org.springframework.cloud.dataflow.acceptance.test.NamedChannelTests)
05-Mar-2019 19:22:10 2019-03-05 19:22:10.261  INFO 10564 --- [           main] o.s.c.d.a.test.NamedChannelTests         : Destroy all streams
05-Mar-2019 19:22:10 2019-03-05 19:22:10.530  INFO 10564 --- [           main] junit.logTestName                        : Starting Test testTap(org.springframework.cloud.dataflow.acceptance.test.NamedChannelTests)
05-Mar-2019 19:22:10 2019-03-05 19:22:10.531  INFO 10564 --- [           main] o.s.c.d.a.test.NamedChannelTests         : Creating stream 'TAPHTTP'
05-Mar-2019 19:22:10 2019-03-05 19:22:10.562  INFO 10564 --- [           main] o.s.c.d.a.test.NamedChannelTests         : Deploying stream 'TAPHTTP' with properties: {app.*.spring.cloud.streamapp.security.enabled=false, app.*.logging.file=${PID}-test.log, app.*.endpoints.logfile.sensitive=false, app.*.management.endpoints.web.exposure.include=*}
05-Mar-2019 19:22:11 2019-03-05 19:22:10.999  INFO 10564 --- [           main] o.s.c.d.a.test.NamedChannelTests         : Checking: Stream=TAPHTTP, status = deploying, status description = The stream is being deployed.
05-Mar-2019 19:22:11 2019-03-05 19:22:11.000  INFO 10564 --- [           main] o.s.c.d.a.test.NamedChannelTests         : Sleeping to check status of Stream=TAPHTTP
05-Mar-2019 19:22:16 2019-03-05 19:22:16.044  INFO 10564 --- [           main] o.s.c.d.a.test.NamedChannelTests         : Checking: Stream=TAPHTTP, status = deploying, status description = The stream is being deployed.
05-Mar-2019 19:22:16 2019-03-05 19:22:16.044  INFO 10564 --- [           main] o.s.c.d.a.test.NamedChannelTests         : Sleeping to check status of Stream=TAPHTTP
05-Mar-2019 19:22:21 2019-03-05 19:22:21.092  INFO 10564 --- [           main] o.s.c.d.a.test.NamedChannelTests         : Checking: Stream=TAPHTTP, status = deploying, status description = The stream is being deployed.
05-Mar-2019 19:22:21 2019-03-05 19:22:21.092  INFO 10564 --- [           main] o.s.c.d.a.test.NamedChannelTests         : Sleeping to check status of Stream=TAPHTTP
05-Mar-2019 19:22:26 2019-03-05 19:22:26.132  INFO 10564 --- [           main] o.s.c.d.a.test.NamedChannelTests         : Checking: Stream=TAPHTTP, status = deployed, status description = The stream has been successfully deployed
05-Mar-2019 19:22:26 2019-03-05 19:22:26.164  INFO 10564 --- [           main] o.s.c.d.a.test.NamedChannelTests         : Sleeping to check status of Stream=TAPHTTP
05-Mar-2019 19:22:31 2019-03-05 19:22:31.164  INFO 10564 --- [           main] o.s.c.d.a.test.NamedChannelTests         : Stream 'TAPHTTP' started with status: deployed
05-Mar-2019 19:22:31 2019-03-05 19:22:31.164  INFO 10564 --- [           main] o.s.c.d.a.test.NamedChannelTests         : App 'log' has instances: {TAPHTTP.log-v1-0=http://10.194.6.11:45498}
05-Mar-2019 19:22:31 2019-03-05 19:22:31.165  INFO 10564 --- [           main] o.s.c.d.a.test.NamedChannelTests         : App 'http' has instances: {TAPHTTP.http-v1-0=http://10.194.6.11:31604}
05-Mar-2019 19:22:31 2019-03-05 19:22:31.165  INFO 10564 --- [           main] o.s.c.d.a.test.NamedChannelTests         : Looking for 'Started HttpSource' in logfile for http
05-Mar-2019 19:22:36 2019-03-05 19:22:36.165  INFO 10564 --- [           main] o.s.c.d.a.test.NamedChannelTests         : Requesting log for app TAPHTTP.http-v1-0
05-Mar-2019 19:22:36 2019-03-05 19:22:36.319  INFO 10564 --- [           main] o.s.c.d.a.test.NamedChannelTests         : Retrieved logfile from 'http://10.194.6.11:31604/actuator/logfile
05-Mar-2019 19:22:36 2019-03-05 19:22:36.319  INFO 10564 --- [           main] o.s.c.d.a.test.NamedChannelTests         : Matched all 'Started HttpSource' in logfile for app http (source TAPHTTP.http-v1-0)
05-Mar-2019 19:22:36 2019-03-05 19:22:36.319  INFO 10564 --- [           main] o.s.c.d.a.test.NamedChannelTests         : Looking for 'Started LogSink' in logfile for log
05-Mar-2019 19:22:41 2019-03-05 19:22:41.319  INFO 10564 --- [           main] o.s.c.d.a.test.NamedChannelTests         : Requesting log for app TAPHTTP.log-v1-0
05-Mar-2019 19:22:41 2019-03-05 19:22:41.463  INFO 10564 --- [           main] o.s.c.d.a.test.NamedChannelTests         : Retrieved logfile from 'http://10.194.6.11:45498/actuator/logfile
05-Mar-2019 19:22:41 2019-03-05 19:22:41.463  INFO 10564 --- [           main] o.s.c.d.a.test.NamedChannelTests         : Matched all 'Started LogSink' in logfile for app log (source TAPHTTP.log-v1-0)
05-Mar-2019 19:22:41 2019-03-05 19:22:41.463  INFO 10564 --- [           main] o.s.c.d.a.test.NamedChannelTests         : Creating stream 'TAPSTREAM'
05-Mar-2019 19:22:41 2019-03-05 19:22:41.485  INFO 10564 --- [           main] o.s.c.d.a.test.NamedChannelTests         : Deploying stream 'TAPSTREAM' with properties: {app.*.spring.cloud.streamapp.security.enabled=false, app.*.logging.file=${PID}-test.log, app.*.endpoints.logfile.sensitive=false, app.*.management.endpoints.web.exposure.include=*}
05-Mar-2019 19:22:41 2019-03-05 19:22:41.824  INFO 10564 --- [           main] o.s.c.d.a.test.NamedChannelTests         : Checking: Stream=TAPSTREAM, status = deploying, status description = The stream is being deployed.
05-Mar-2019 19:22:41 2019-03-05 19:22:41.824  INFO 10564 --- [           main] o.s.c.d.a.test.NamedChannelTests         : Sleeping to check status of Stream=TAPSTREAM
05-Mar-2019 19:22:46 2019-03-05 19:22:46.884  INFO 10564 --- [           main] o.s.c.d.a.test.NamedChannelTests         : Checking: Stream=TAPSTREAM, status = deploying, status description = The stream is being deployed.
05-Mar-2019 19:22:46 2019-03-05 19:22:46.884  INFO 10564 --- [           main] o.s.c.d.a.test.NamedChannelTests         : Sleeping to check status of Stream=TAPSTREAM
05-Mar-2019 19:22:51 2019-03-05 19:22:51.924  INFO 10564 --- [           main] o.s.c.d.a.test.NamedChannelTests         : Checking: Stream=TAPSTREAM, status = deployed, status description = The stream has been successfully deployed
05-Mar-2019 19:22:51 2019-03-05 19:22:51.972  INFO 10564 --- [           main] o.s.c.d.a.test.NamedChannelTests         : Sleeping to check status of Stream=TAPSTREAM
05-Mar-2019 19:22:56 2019-03-05 19:22:56.972  INFO 10564 --- [           main] o.s.c.d.a.test.NamedChannelTests         : Stream 'TAPSTREAM' started with status: deployed
05-Mar-2019 19:22:56 2019-03-05 19:22:56.972  INFO 10564 --- [           main] o.s.c.d.a.test.NamedChannelTests         : App 'log' has instances: {TAPSTREAM.log-v1-0=http://10.194.6.11:32411}
05-Mar-2019 19:22:56 2019-03-05 19:22:56.972  INFO 10564 --- [           main] o.s.c.d.a.test.NamedChannelTests         : Looking for 'Started LogSink' in logfile for log
05-Mar-2019 19:23:01 2019-03-05 19:23:01.973  INFO 10564 --- [           main] o.s.c.d.a.test.NamedChannelTests         : Requesting log for app TAPSTREAM.log-v1-0
05-Mar-2019 19:23:02 2019-03-05 19:23:02.120  INFO 10564 --- [           main] o.s.c.d.a.test.NamedChannelTests         : Retrieved logfile from 'http://10.194.6.11:32411/actuator/logfile
05-Mar-2019 19:23:02 2019-03-05 19:23:02.120  INFO 10564 --- [           main] o.s.c.d.a.test.NamedChannelTests         : Matched all 'Started LogSink' in logfile for app log (source TAPSTREAM.log-v1-0)
05-Mar-2019 19:23:02 2019-03-05 19:23:02.195  INFO 10564 --- [           main] o.s.c.d.a.test.NamedChannelTests         : Looking for 'abcdefg' in logfile for log
05-Mar-2019 19:23:07 2019-03-05 19:23:07.195  INFO 10564 --- [           main] o.s.c.d.a.test.NamedChannelTests         : Requesting log for app TAPSTREAM.log-v1-0
05-Mar-2019 19:23:07 2019-03-05 19:23:07.203  INFO 10564 --- [           main] o.s.c.d.a.test.NamedChannelTests         : Retrieved logfile from 'http://10.194.6.11:32411/actuator/logfile
05-Mar-2019 19:23:07 2019-03-05 19:23:07.203  INFO 10564 --- [           main] o.s.c.d.a.test.NamedChannelTests         : Matched all 'abcdefg' in logfile for app log (source TAPSTREAM.log-v1-0)
05-Mar-2019 19:23:07 2019-03-05 19:23:07.204  INFO 10564 --- [           main] junit.logTestName                        : Test testTap(org.springframework.cloud.dataflow.acceptance.test.NamedChannelTests) Succeeded
05-Mar-2019 19:23:07 2019-03-05 19:23:07.204  INFO 10564 --- [           main] junit.logTestName                        : Finished Test testTap(org.springframework.cloud.dataflow.acceptance.test.NamedChannelTests)
05-Mar-2019 19:23:07 2019-03-05 19:23:07.204  INFO 10564 --- [           main] o.s.c.d.a.test.NamedChannelTests         : Destroy all streams
05-Mar-2019 19:23:07 2019-03-05 19:23:07.573  INFO 10564 --- [           main] junit.logTestName                        : Starting Test manyToOneTest(org.springframework.cloud.dataflow.acceptance.test.NamedChannelTests)
05-Mar-2019 19:23:07 2019-03-05 19:23:07.574  INFO 10564 --- [           main] o.s.c.d.a.test.NamedChannelTests         : Creating stream 'MANY-TO-ONE'
05-Mar-2019 19:23:07 2019-03-05 19:23:07.594  INFO 10564 --- [           main] o.s.c.d.a.test.NamedChannelTests         : Deploying stream 'MANY-TO-ONE' with properties: {app.*.spring.cloud.streamapp.security.enabled=false, app.*.logging.file=${PID}-test.log, app.*.endpoints.logfile.sensitive=false, app.*.management.endpoints.web.exposure.include=*}
05-Mar-2019 19:23:07 2019-03-05 19:23:07.863  INFO 10564 --- [           main] o.s.c.d.a.test.NamedChannelTests         : Checking: Stream=MANY-TO-ONE, status = deploying, status description = The stream is being deployed.
05-Mar-2019 19:23:07 2019-03-05 19:23:07.863  INFO 10564 --- [           main] o.s.c.d.a.test.NamedChannelTests         : Sleeping to check status of Stream=MANY-TO-ONE
05-Mar-2019 19:23:12 2019-03-05 19:23:12.895  INFO 10564 --- [           main] o.s.c.d.a.test.NamedChannelTests         : Checking: Stream=MANY-TO-ONE, status = deploying, status description = The stream is being deployed.
05-Mar-2019 19:23:12 2019-03-05 19:23:12.895  INFO 10564 --- [           main] o.s.c.d.a.test.NamedChannelTests         : Sleeping to check status of Stream=MANY-TO-ONE
05-Mar-2019 19:23:17 2019-03-05 19:23:17.921  INFO 10564 --- [           main] o.s.c.d.a.test.NamedChannelTests         : Checking: Stream=MANY-TO-ONE, status = deployed, status description = The stream has been successfully deployed
05-Mar-2019 19:23:17 2019-03-05 19:23:17.968  INFO 10564 --- [           main] o.s.c.d.a.test.NamedChannelTests         : Sleeping to check status of Stream=MANY-TO-ONE
05-Mar-2019 19:23:22 2019-03-05 19:23:22.968  INFO 10564 --- [           main] o.s.c.d.a.test.NamedChannelTests         : Stream 'MANY-TO-ONE' started with status: deployed
05-Mar-2019 19:23:22 2019-03-05 19:23:22.968  INFO 10564 --- [           main] o.s.c.d.a.test.NamedChannelTests         : App 'log' has instances: {MANY-TO-ONE.log-v1-0=http://10.194.6.11:23736}
05-Mar-2019 19:23:22 2019-03-05 19:23:22.969  INFO 10564 --- [           main] o.s.c.d.a.test.NamedChannelTests         : Looking for 'Started LogSink' in logfile for log
05-Mar-2019 19:23:27 2019-03-05 19:23:27.969  INFO 10564 --- [           main] o.s.c.d.a.test.NamedChannelTests         : Requesting log for app MANY-TO-ONE.log-v1-0
05-Mar-2019 19:23:28 2019-03-05 19:23:28.106  INFO 10564 --- [           main] o.s.c.d.a.test.NamedChannelTests         : Retrieved logfile from 'http://10.194.6.11:23736/actuator/logfile
05-Mar-2019 19:23:28 2019-03-05 19:23:28.106  INFO 10564 --- [           main] o.s.c.d.a.test.NamedChannelTests         : Matched all 'Started LogSink' in logfile for app log (source MANY-TO-ONE.log-v1-0)
05-Mar-2019 19:23:28 2019-03-05 19:23:28.106  INFO 10564 --- [           main] o.s.c.d.a.test.NamedChannelTests         : Creating stream 'HTTP-SOURCE-1'
05-Mar-2019 19:23:28 2019-03-05 19:23:28.128  INFO 10564 --- [           main] o.s.c.d.a.test.NamedChannelTests         : Deploying stream 'HTTP-SOURCE-1' with properties: {app.*.spring.cloud.streamapp.security.enabled=false, app.*.logging.file=${PID}-test.log, app.*.endpoints.logfile.sensitive=false, app.*.management.endpoints.web.exposure.include=*}
05-Mar-2019 19:23:28 2019-03-05 19:23:28.457  INFO 10564 --- [           main] o.s.c.d.a.test.NamedChannelTests         : Checking: Stream=HTTP-SOURCE-1, status = deploying, status description = The stream is being deployed.
05-Mar-2019 19:23:28 2019-03-05 19:23:28.457  INFO 10564 --- [           main] o.s.c.d.a.test.NamedChannelTests         : Sleeping to check status of Stream=HTTP-SOURCE-1
05-Mar-2019 19:23:33 2019-03-05 19:23:33.502  INFO 10564 --- [           main] o.s.c.d.a.test.NamedChannelTests         : Checking: Stream=HTTP-SOURCE-1, status = deploying, status description = The stream is being deployed.
05-Mar-2019 19:23:33 2019-03-05 19:23:33.502  INFO 10564 --- [           main] o.s.c.d.a.test.NamedChannelTests         : Sleeping to check status of Stream=HTTP-SOURCE-1
05-Mar-2019 19:23:38 2019-03-05 19:23:38.564  INFO 10564 --- [           main] o.s.c.d.a.test.NamedChannelTests         : Checking: Stream=HTTP-SOURCE-1, status = deployed, status description = The stream has been successfully deployed
05-Mar-2019 19:23:38 2019-03-05 19:23:38.610  INFO 10564 --- [           main] o.s.c.d.a.test.NamedChannelTests         : Sleeping to check status of Stream=HTTP-SOURCE-1
05-Mar-2019 19:23:43 2019-03-05 19:23:43.611  INFO 10564 --- [           main] o.s.c.d.a.test.NamedChannelTests         : Stream 'HTTP-SOURCE-1' started with status: deployed
05-Mar-2019 19:23:43 2019-03-05 19:23:43.611  INFO 10564 --- [           main] o.s.c.d.a.test.NamedChannelTests         : App 'http' has instances: {HTTP-SOURCE-1.http-v1-0=http://10.194.6.11:26055}
05-Mar-2019 19:23:43 2019-03-05 19:23:43.611  INFO 10564 --- [           main] o.s.c.d.a.test.NamedChannelTests         : Looking for 'Started HttpSource' in logfile for http
05-Mar-2019 19:23:48 2019-03-05 19:23:48.611  INFO 10564 --- [           main] o.s.c.d.a.test.NamedChannelTests         : Requesting log for app HTTP-SOURCE-1.http-v1-0
05-Mar-2019 19:23:48 2019-03-05 19:23:48.797  INFO 10564 --- [           main] o.s.c.d.a.test.NamedChannelTests         : Retrieved logfile from 'http://10.194.6.11:26055/actuator/logfile
05-Mar-2019 19:23:48 2019-03-05 19:23:48.797  INFO 10564 --- [           main] o.s.c.d.a.test.NamedChannelTests         : Matched all 'Started HttpSource' in logfile for app http (source HTTP-SOURCE-1.http-v1-0)
05-Mar-2019 19:23:48 2019-03-05 19:23:48.797  INFO 10564 --- [           main] o.s.c.d.a.test.NamedChannelTests         : Creating stream 'HTTP-SOURCE-2'
05-Mar-2019 19:23:48 2019-03-05 19:23:48.816  INFO 10564 --- [           main] o.s.c.d.a.test.NamedChannelTests         : Deploying stream 'HTTP-SOURCE-2' with properties: {app.*.spring.cloud.streamapp.security.enabled=false, app.*.logging.file=${PID}-test.log, app.*.endpoints.logfile.sensitive=false, app.*.management.endpoints.web.exposure.include=*}
05-Mar-2019 19:23:49 2019-03-05 19:23:49.122  INFO 10564 --- [           main] o.s.c.d.a.test.NamedChannelTests         : Checking: Stream=HTTP-SOURCE-2, status = deploying, status description = The stream is being deployed.
05-Mar-2019 19:23:49 2019-03-05 19:23:49.122  INFO 10564 --- [           main] o.s.c.d.a.test.NamedChannelTests         : Sleeping to check status of Stream=HTTP-SOURCE-2
05-Mar-2019 19:23:54 2019-03-05 19:23:54.195  INFO 10564 --- [           main] o.s.c.d.a.test.NamedChannelTests         : Checking: Stream=HTTP-SOURCE-2, status = deploying, status description = The stream is being deployed.
05-Mar-2019 19:23:54 2019-03-05 19:23:54.195  INFO 10564 --- [           main] o.s.c.d.a.test.NamedChannelTests         : Sleeping to check status of Stream=HTTP-SOURCE-2
05-Mar-2019 19:23:59 2019-03-05 19:23:59.278  INFO 10564 --- [           main] o.s.c.d.a.test.NamedChannelTests         : Checking: Stream=HTTP-SOURCE-2, status = deployed, status description = The stream has been successfully deployed
05-Mar-2019 19:23:59 2019-03-05 19:23:59.312  INFO 10564 --- [           main] o.s.c.d.a.test.NamedChannelTests         : Sleeping to check status of Stream=HTTP-SOURCE-2
05-Mar-2019 19:24:04 2019-03-05 19:24:04.313  INFO 10564 --- [           main] o.s.c.d.a.test.NamedChannelTests         : Stream 'HTTP-SOURCE-2' started with status: deployed
05-Mar-2019 19:24:04 2019-03-05 19:24:04.313  INFO 10564 --- [           main] o.s.c.d.a.test.NamedChannelTests         : App 'http' has instances: {HTTP-SOURCE-2.http-v1-0=http://10.194.6.11:25143}
05-Mar-2019 19:24:04 2019-03-05 19:24:04.313  INFO 10564 --- [           main] o.s.c.d.a.test.NamedChannelTests         : Looking for 'Started HttpSource' in logfile for http
05-Mar-2019 19:24:09 2019-03-05 19:24:09.313  INFO 10564 --- [           main] o.s.c.d.a.test.NamedChannelTests         : Requesting log for app HTTP-SOURCE-2.http-v1-0
05-Mar-2019 19:24:09 2019-03-05 19:24:09.458  INFO 10564 --- [           main] o.s.c.d.a.test.NamedChannelTests         : Retrieved logfile from 'http://10.194.6.11:25143/actuator/logfile
05-Mar-2019 19:24:09 2019-03-05 19:24:09.458  INFO 10564 --- [           main] o.s.c.d.a.test.NamedChannelTests         : Matched all 'Started HttpSource' in logfile for app http (source HTTP-SOURCE-2.http-v1-0)
05-Mar-2019 19:24:09 2019-03-05 19:24:09.542  INFO 10564 --- [           main] o.s.c.d.a.test.NamedChannelTests         : Looking for 'abcdefg' in logfile for log
05-Mar-2019 19:24:14 2019-03-05 19:24:14.542  INFO 10564 --- [           main] o.s.c.d.a.test.NamedChannelTests         : Requesting log for app MANY-TO-ONE.log-v1-0
05-Mar-2019 19:24:14 2019-03-05 19:24:14.552  INFO 10564 --- [           main] o.s.c.d.a.test.NamedChannelTests         : Retrieved logfile from 'http://10.194.6.11:23736/actuator/logfile
05-Mar-2019 19:24:14 2019-03-05 19:24:14.552  INFO 10564 --- [           main] o.s.c.d.a.test.NamedChannelTests         : Matched all 'abcdefg' in logfile for app log (source MANY-TO-ONE.log-v1-0)
05-Mar-2019 19:24:14 2019-03-05 19:24:14.598  INFO 10564 --- [           main] o.s.c.d.a.test.NamedChannelTests         : Looking for 'hijklmn' in logfile for log
05-Mar-2019 19:24:19 2019-03-05 19:24:19.599  INFO 10564 --- [           main] o.s.c.d.a.test.NamedChannelTests         : Requesting log for app MANY-TO-ONE.log-v1-0
05-Mar-2019 19:24:19 2019-03-05 19:24:19.606  INFO 10564 --- [           main] o.s.c.d.a.test.NamedChannelTests         : Retrieved logfile from 'http://10.194.6.11:23736/actuator/logfile
05-Mar-2019 19:24:19 2019-03-05 19:24:19.606  INFO 10564 --- [           main] o.s.c.d.a.test.NamedChannelTests         : Matched all 'hijklmn' in logfile for app log (source MANY-TO-ONE.log-v1-0)
05-Mar-2019 19:24:19 2019-03-05 19:24:19.607  INFO 10564 --- [           main] junit.logTestName                        : Test manyToOneTest(org.springframework.cloud.dataflow.acceptance.test.NamedChannelTests) Succeeded
05-Mar-2019 19:24:19 2019-03-05 19:24:19.607  INFO 10564 --- [           main] junit.logTestName                        : Finished Test manyToOneTest(org.springframework.cloud.dataflow.acceptance.test.NamedChannelTests)
05-Mar-2019 19:24:19 2019-03-05 19:24:19.608  INFO 10564 --- [           main] o.s.c.d.a.test.NamedChannelTests         : Destroy all streams
05-Mar-2019 19:24:20 Tests run: 4, Failures: 0, Errors: 0, Skipped: 1, Time elapsed: 176.111 sec - in org.springframework.cloud.dataflow.acceptance.test.NamedChannelTests
05-Mar-2019 19:24:20 Running org.springframework.cloud.dataflow.acceptance.test.util.PlatformHelperTests
05-Mar-2019 19:24:20 Tests run: 3, Failures: 0, Errors: 0, Skipped: 0, Time elapsed: 0.092 sec - in org.springframework.cloud.dataflow.acceptance.test.util.PlatformHelperTests
05-Mar-2019 19:24:20 Running org.springframework.cloud.dataflow.acceptance.test.util.ApplicationTests
05-Mar-2019 19:24:20 Tests run: 2, Failures: 0, Errors: 0, Skipped: 0, Time elapsed: 0.001 sec - in org.springframework.cloud.dataflow.acceptance.test.util.ApplicationTests
05-Mar-2019 19:24:20 2019-03-05 19:24:20.121  INFO 10564 --- [       Thread-6] o.s.c.support.GenericApplicationContext  : Closing org.springframework.context.support.GenericApplicationContext@2c88a3e8: startup date [Tue Mar 05 19:18:20 UTC 2019]; root of context hierarchy
05-Mar-2019 19:24:20
05-Mar-2019 19:24:20 Results :
05-Mar-2019 19:24:20
05-Mar-2019 19:24:20 Tests run: 19, Failures: 0, Errors: 0, Skipped: 4
05-Mar-2019 19:24:20
05-Mar-2019 19:24:20 [INFO]
05-Mar-2019 19:24:20 [INFO] >>> maven-surefire-report-plugin:3.0.0-M3:report (default-cli) > [surefire]test @ spring-cloud-dataflow-acceptance-tests >>>
05-Mar-2019 19:24:20 [INFO]
05-Mar-2019 19:24:20 [INFO] --- maven-checkstyle-plugin:2.17:check (checkstyle-validation) @ spring-cloud-dataflow-acceptance-tests ---
05-Mar-2019 19:24:20 [INFO]
05-Mar-2019 19:24:20 [INFO] --- maven-resources-plugin:2.6:resources (default-resources) @ spring-cloud-dataflow-acceptance-tests ---
05-Mar-2019 19:24:20 [INFO] Using 'UTF-8' encoding to copy filtered resources.
05-Mar-2019 19:24:20 [INFO] skip non existing resourceDirectory /opt/bamboo-home/xml-data/build-dir/SCDT-LOCAL20XSKIPPER20X-RABBIT/src/main/resources
05-Mar-2019 19:24:20 [INFO] skip non existing resourceDirectory /opt/bamboo-home/xml-data/build-dir/SCDT-LOCAL20XSKIPPER20X-RABBIT/src/main/resources
05-Mar-2019 19:24:20 [INFO]
05-Mar-2019 19:24:20 [INFO] --- maven-compiler-plugin:3.1:compile (default-compile) @ spring-cloud-dataflow-acceptance-tests ---
05-Mar-2019 19:24:20 [INFO] Nothing to compile - all classes are up to date
05-Mar-2019 19:24:20 [INFO]
05-Mar-2019 19:24:20 [INFO] --- maven-resources-plugin:2.6:testResources (default-testResources) @ spring-cloud-dataflow-acceptance-tests ---
05-Mar-2019 19:24:20 [INFO] Using 'UTF-8' encoding to copy filtered resources.
05-Mar-2019 19:24:20 [INFO] Copying 1 resource
05-Mar-2019 19:24:20 [INFO]
05-Mar-2019 19:24:20 [INFO] --- maven-compiler-plugin:3.1:testCompile (default-testCompile) @ spring-cloud-dataflow-acceptance-tests ---
05-Mar-2019 19:24:20 [INFO] Nothing to compile - all classes are up to date
05-Mar-2019 19:24:20 [INFO]
05-Mar-2019 19:24:20 [INFO] --- maven-surefire-plugin:2.18.1:test (default-test) @ spring-cloud-dataflow-acceptance-tests ---
05-Mar-2019 19:24:20 [INFO] Skipping execution of surefire because it has already been run for this configuration
05-Mar-2019 19:24:20 [INFO]
05-Mar-2019 19:24:20 [INFO] <<< maven-surefire-report-plugin:3.0.0-M3:report (default-cli) < [surefire]test @ spring-cloud-dataflow-acceptance-tests <<<
05-Mar-2019 19:24:20 [INFO]
05-Mar-2019 19:24:20 [INFO] --- maven-surefire-report-plugin:3.0.0-M3:report (default-cli) @ spring-cloud-dataflow-acceptance-tests ---
05-Mar-2019 19:24:20 [WARNING] Unable to locate Test Source XRef to link to - DISABLED
05-Mar-2019 19:24:20 [INFO] ------------------------------------------------------------------------
05-Mar-2019 19:24:20 [INFO] BUILD SUCCESS
05-Mar-2019 19:24:20 [INFO] ------------------------------------------------------------------------
05-Mar-2019 19:24:20 [INFO] Total time: 07:50 min
05-Mar-2019 19:24:20 [INFO] Finished at: 2019-03-05T19:24:20+00:00
05-Mar-2019 19:24:20 [INFO] Final Memory: 60M/462M
05-Mar-2019 19:24:20 [INFO] ------------------------------------------------------------------------
05-Mar-2019 19:24:20 Clean up, clean up, everybody everywhere; clean up clean up, everybody do your share!
05-Mar-2019 19:24:20 Killing process PID [10453]
05-Mar-2019 19:24:20 Killing process PID [10311]
05-Mar-2019 19:24:21 No stopped containers
05-Mar-2019 19:24:21 Stopping mysql_mysql_1 ...
05-Mar-2019 19:24:23
05-Mar-2019 19:24:23 Stopping mysql_mysql_1 ... done
05-Mar-2019 19:24:23 Removing mysql_mysql_1 ...
05-Mar-2019 19:24:23
05-Mar-2019 19:24:23 Removing mysql_mysql_1 ... done
05-Mar-2019 19:24:23 Going to remove mysql_mysql_1
05-Mar-2019 19:24:24 No stopped containers
05-Mar-2019 19:24:24
05-Mar-2019 19:24:24 Finished task 'Execute Acceptance Tests' with result: Success
05-Mar-2019 19:24:24 Starting task 'JUnit Parser' of type 'com.atlassian.bamboo.plugins.testresultparser:task.testresultparser.junit'
05-Mar-2019 19:24:24 Parsing test results under /opt/bamboo-home/xml-data/build-dir/SCDT-LOCAL20XSKIPPER20X-RABBIT...
05-Mar-2019 19:24:24 Finished task 'JUnit Parser' with result: Success
05-Mar-2019 19:24:24 Starting task 'clean up' of type 'com.atlassian.bamboo.plugins.scripttask:task.builder.script'
05-Mar-2019 19:24:24
Beginning to execute external process for build 'Spring Cloud Data Flow Acceptance Tests - Local + SCDF-2.0.0.BS + Skipper 2.0.0.BS - Run Data Flow Acceptance Tests for Rabbit #44 (SCDT-LOCAL20XSKIPPER20X-RABBIT-44)'
... running command line:
/opt/bamboo-home/temp/SCDT-LOCAL20XSKIPPER20X-RABBIT-44-ScriptBuildTask-1186951381456690201.sh
... in: /opt/bamboo-home/xml-data/build-dir/SCDT-LOCAL20XSKIPPER20X-RABBIT
... using extra environment variables:
bamboo_planRepository_1_branch=master
bamboo_********_username_password=********
bamboo_signing_store_password=********
bamboo_capability_system_builder_ant_Ant_1_9=/opt/ant-1.9
bamboo_capability_system_builder_ant_Ant_1_8=/opt/ant-1.8
bamboo_planRepository_1_branchDisplayName=master
bamboo_repository_274694331_git_username=spring-buildmaster
bamboo_capability_system_jdk_OpenJDK_7u181=/opt/openjdk-7
bamboo_repository_revision_number=4d6bba78ca2b8629684e8fda0b50bfa8dd69649c
bamboo_capability_system_builder_node_Node_js_6=/usr/bin/node
bamboo_RIAK_BIN=/usr/sbin/riak
bamboo_buildKey=SCDT-LOCAL20XSKIPPER20X-RABBIT
bamboo_repository_274694331_branch_name=master
bamboo_bintray_password=********
bamboo_sonar_token_password=********
bamboo_shortJobName=Run Data Flow Acceptance Tests for Rabbit
bamboo_capability_system_builder_gradle___gradlew=./gradlew
bamboo_buildResultsUrl=https://build.spring.io/browse/SCDT-LOCAL20XSKIPPER20X-RABBIT-44
bamboo_capability_system_builder_mvn3_Maven_3_3=/opt/maven-3.3
bamboo_capability_system_builder_mvn3_Maven_3_2=/opt/maven-3.2
bamboo_capability_system_builder_mvn3_Maven_3_1=/opt/maven-3.1
bamboo_planRepository_repositoryUrl=https://github.com/spring-cloud/spring-cloud-dataflow-acceptance-tests.git
bamboo_agentId=208568322
bamboo_capability_system_builder_mvn3_Maven_3_5=/opt/maven-3.5
bamboo_capability_system_builder_mvn3_Maven_3_0=/opt/maven-3.0
bamboo_planRepository_revision=4d6bba78ca2b8629684e8fda0b50bfa8dd69649c
bamboo_planRepository_previousRevision=4d6bba78ca2b8629684e8fda0b50bfa8dd69649c
bamboo_capability_remote_build=true
bamboo_repository_branch_name=master
bamboo_sonatype_token_password=********
bamboo_repository_274694331_name=Git
bamboo_scdf_acceptance_tests_password=********
bamboo_dependenciesDisabled=false
bamboo_repository_274694331_git_branch=master
bamboo_capability_Agent=bamboo-01.af.pivotal.io
bamboo_planRepository_branch=master
bamboo_planRepository_1_type=gitv2
bamboo_planRepository_branchName=master
bamboo_sonar_password=********
bamboo_hg_cache_directory=/opt/bamboo-home/xml-data/build-dir/_hg-repositories-cache
bamboo_planRepository_1_username=spring-buildmaster
bamboo_repository_274694331_git_repositoryUrl=https://github.com/spring-cloud/spring-cloud-dataflow-acceptance-tests.git
bamboo_planRepository_type=gitv2
bamboo_ManualBuildTriggerReason_userName=sabby
bamboo_git_cache_directory=/opt/bamboo-home/xml-data/build-dir/_git-repositories-cache
bamboo_artifactory_username=buildmaster
bamboo_tmp_directory=/opt/bamboo-home/temp
bamboo_planKey=SCDT-LOCAL20XSKIPPER20X
bamboo_planRepository_username=spring-buildmaster
bamboo_JDK8_HOME=/opt/jdk-8
bamboo_repository_274694331_previous_revision_number=4d6bba78ca2b8629684e8fda0b50bfa8dd69649c
bamboo_planRepository_1_branchName=master
bamboo_sonar_version=5.6.3
bamboo_capability_system_jdk_JDK_1_11=/opt/jdk-11
bamboo_resultsUrl=https://build.spring.io/browse/SCDT-LOCAL20XSKIPPER20X-RABBIT-44
bamboo_capability_system_jdk_JDK_1_10=/opt/jdk-10
bamboo_build_working_directory=/opt/bamboo-home/xml-data/build-dir/SCDT-LOCAL20XSKIPPER20X-RABBIT
bamboo_planRepository_1_name=Git
bamboo_capability_system_os=ubuntu1604
bamboo_nexusPush_stagingProfile=buildmaster
bamboo_shortPlanName=Local + SCDF-2.0.0.BS + Skipper 2.0.0.BS
bamboo_planRepository_name=Git
bamboo_buildNumber=44
bamboo_planName=Spring Cloud Data Flow Acceptance Tests - Local + SCDF-2.0.0.BS + Skipper 2.0.0.BS
bamboo_JDK7_HOME=/opt/jdk-7
bamboo_build_commandline_com_atlassian_bamboo_plugins_scripttask_task_builder_script_7=/opt/bamboo-home/temp/SCDT-LOCAL20XSKIPPER20X-RABBIT-44-ScriptBuildTask-5306690754829538350.sh
bamboo_shortPlanKey=LOCAL20XSKIPPER20X
bamboo_shortJobKey=RABBIT
bamboo_artifactory_password=********
bamboo_buildTimeStamp=2019-03-05T19:14:30.455Z
bamboo_repository_previous_revision_number=4d6bba78ca2b8629684e8fda0b50bfa8dd69649c
bamboo_sonar_username=buildmaster
bamboo_********_password=********
bamboo_repository_git_branch=master
bamboo_buildResultKey=SCDT-LOCAL20XSKIPPER20X-RABBIT-44
bamboo_nexusPush_close=true
bamboo_buildPlanName=Spring Cloud Data Flow Acceptance Tests - Local + SCDF-2.0.0.BS + Skipper 2.0.0.BS - Run Data Flow Acceptance Tests for Rabbit
bamboo_repository_274694331_revision_number=4d6bba78ca2b8629684e8fda0b50bfa8dd69649c
bamboo_planRepository_1_revision=4d6bba78ca2b8629684e8fda0b50bfa8dd69649c
bamboo_repository_name=Git
bamboo_signing_key_password=********
bamboo_buildFailed=false
bamboo_capability_system_docker_executable=/usr/bin/docker
bamboo_capability_system_builder_groovy_Groovy_2_4=/opt/groovy-2.4
bamboo_capability_system_builder_command_Bash=/bin/bash
bamboo_jobFailed=false
bamboo_agentWorkingDirectory=/opt/bamboo-home/xml-data/build-dir
bamboo_capability_system_git_executable=/usr/bin/git
bamboo_repository_git_username=spring-buildmaster
bamboo_planRepository_1_previousRevision=4d6bba78ca2b8629684e8fda0b50bfa8dd69649c
bamboo_capability_os_family=unix
bamboo_planRepository_branchDisplayName=master
bamboo_capability_system_builder_maven_Artifactory_Maven_3_5=/opt/maven-3.5
bamboo_capability_system_builder_maven_Artifactory_Maven_3_3=/opt/maven-3.3
bamboo_capability_system_builder_maven_Artifactory_Maven_3_2=/opt/maven-3.2
bamboo_s3_properties=/home/bamboo/tools/s3.properties
bamboo_capability_system_builder_maven_Artifactory_Maven_3_1=/opt/maven-3.1
bamboo_capability_system_builder_maven_Artifactory_Maven_3_0=/opt/maven-3.0
bamboo_plan_storageTag=plan-274497908
bamboo_bintray_username_password=********
bamboo_repository_git_repositoryUrl=https://github.com/spring-cloud/spring-cloud-dataflow-acceptance-tests.git
bamboo_working_directory=/opt/bamboo-home/xml-data/build-dir/SCDT-LOCAL20XSKIPPER20X-RABBIT
bamboo_planRepository_1_repositoryUrl=https://github.com/spring-cloud/spring-cloud-dataflow-acceptance-tests.git
bamboo_capability_system_jdk_JDK_1_8=/opt/jdk-8
bamboo_capability_system_jdk_JDK_1_9=/opt/jdk-9
bamboo_capability_system_jdk_JDK_1_6=/opt/jdk-6
bamboo_sonatype_password=********
bamboo_capability_system_jdk_JDK_1_7=/opt/jdk-7
bamboo_sonar_ip=10.194.6.9
05-Mar-2019 19:24:24 CLEANING UP RESOURCES AFTER RUNNING TESTS
05-Mar-2019 19:24:24 Environment variable JAVA_HOME must be set
05-Mar-2019 19:24:24 FINISHED CLEANING UP RESOURCES
05-Mar-2019 19:24:24 Finished task 'clean up' with result: Success
05-Mar-2019 19:24:24 Running post build plugin 'Docker Container Cleanup'
05-Mar-2019 19:24:24 Running post build plugin 'NCover Results Collector'
05-Mar-2019 19:24:24 Running post build plugin 'Artifactory Release Management Staging'
05-Mar-2019 19:24:24 Running post build plugin 'Artifactory Build Info Copier'
05-Mar-2019 19:24:24 Running post build plugin 'Artifactory Gradle Properties Info Copier'
05-Mar-2019 19:24:24 Running post build plugin 'Clover Results Collector'
05-Mar-2019 19:24:24 Running post build plugin 'npm Cache Cleanup'
05-Mar-2019 19:24:24 Running post build plugin 'Artifact Copier'
05-Mar-2019 19:24:24 Publishing an artifact: Test Results
05-Mar-2019 19:24:24 Finished publishing of artifact Job artifact: [Test Results], pattern: [**/target/surefire-reports/**/*.*] in 38.22 ms
05-Mar-2019 19:24:24 Publishing an artifact: App and Server Logs
05-Mar-2019 19:24:24 Finished publishing of artifact Job artifact: [App and Server Logs], pattern: [**/*.log] anchored at: [local] in 34.78 ms
05-Mar-2019 19:24:24 Successfully removed working directory at '/opt/bamboo-home/xml-data/build-dir/SCDT-LOCAL20XSKIPPER20X-RABBIT'
05-Mar-2019 19:24:24 Finalising the build...
05-Mar-2019 19:24:24 Stopping timer.
05-Mar-2019 19:24:24 Build SCDT-LOCAL20XSKIPPER20X-RABBIT-44 completed.
05-Mar-2019 19:24:24 Running on server: post build plugin 'NCover Results Collector'
05-Mar-2019 19:24:24 Running on server: post build plugin 'Build Hanging Detection Configuration'
05-Mar-2019 19:24:24 Running on server: post build plugin 'Clover Delta Calculator'
05-Mar-2019 19:24:24 Running on server: post build plugin 'Maven Dependencies Postprocessor'
05-Mar-2019 19:24:24 All post build plugins have finished
05-Mar-2019 19:24:24 Generating build results summary...
05-Mar-2019 19:24:24 Saving build results to disk...
05-Mar-2019 19:24:24 Logging substituted variables...
05-Mar-2019 19:24:24 Indexing build results...
05-Mar-2019 19:24:24 Finished building SCDT-LOCAL20XSKIPPER20X-RABBIT-44.