Build: #284 failed Scheduled

Stages & jobs

  1. Test Stage - Rabbit

  2. Test Stage - Kafka

Build result summary

Details

Completed
Duration
22 minutes
Labels
None
Revision
a89b17c89ddf395bb82ba09359cd0dd6b0b2fd27 a89b17c89ddf395bb82ba09359cd0dd6b0b2fd27
Total tests
17
Failing since
#282 (Scheduled – )
Fixed in
#286 (Scheduled)

Responsible

This build has been failing since #282
No one has taken responsibility

Configuration changes

Plan configuration has changed since the last successful build. See the plan audit log for more details.

Tests

New test failures 3
Status Test View job Duration
Collapse Failed HttpSourceTests httpSourceTests History
Run Data Flow Acceptance Tests for Rabbit 2 mins
org.springframework.cloud.dataflow.rest.client.DataFlowClientException: Error reading from URL [http://bit.ly/Celsius-SR1-stream-applications-rabbit-maven]

	at org.springframework.cloud.dataflow.rest.client.VndErrorResponseErrorHandler.handleError(VndErrorResponseErrorHandler.java:63)
	at org.springframework.web.client.RestTemplate.handleResponse(RestTemplate.java:667)
	at org.springframework.web.client.RestTemplate.doExecute(RestTemplate.java:620)
	at org.springframework.web.client.RestTemplate.execute(RestTemplate.java:580)
	at org.springframework.web.client.RestTemplate.postForObject(RestTemplate.java:380)
	at org.springframework.cloud.dataflow.rest.client.AppRegistryTemplate.importFromResource(AppRegistryTemplate.java:106)
(34 more lines...)
Collapse Failed NamedChannelTests testDestination History
Run Data Flow Acceptance Tests for Rabbit 2 mins
org.springframework.cloud.dataflow.rest.client.DataFlowClientException: Error reading from URL [http://bit.ly/Celsius-SR1-stream-applications-rabbit-maven]

	at org.springframework.cloud.dataflow.rest.client.VndErrorResponseErrorHandler.handleError(VndErrorResponseErrorHandler.java:63)
	at org.springframework.web.client.RestTemplate.handleResponse(RestTemplate.java:667)
	at org.springframework.web.client.RestTemplate.doExecute(RestTemplate.java:620)
	at org.springframework.web.client.RestTemplate.execute(RestTemplate.java:580)
	at org.springframework.web.client.RestTemplate.postForObject(RestTemplate.java:380)
	at org.springframework.cloud.dataflow.rest.client.AppRegistryTemplate.importFromResource(AppRegistryTemplate.java:106)
(34 more lines...)
Collapse Failed TickTockTests tickTockTestsFromConfigServer History
Run Data Flow Acceptance Tests for Rabbit 2 mins
org.springframework.cloud.dataflow.rest.client.DataFlowClientException: Error reading from URL [http://bit.ly/Celsius-SR1-stream-applications-rabbit-maven]

	at org.springframework.cloud.dataflow.rest.client.VndErrorResponseErrorHandler.handleError(VndErrorResponseErrorHandler.java:63)
	at org.springframework.web.client.RestTemplate.handleResponse(RestTemplate.java:667)
	at org.springframework.web.client.RestTemplate.doExecute(RestTemplate.java:620)
	at org.springframework.web.client.RestTemplate.execute(RestTemplate.java:580)
	at org.springframework.web.client.RestTemplate.postForObject(RestTemplate.java:380)
	at org.springframework.cloud.dataflow.rest.client.AppRegistryTemplate.importFromResource(AppRegistryTemplate.java:106)
(34 more lines...)
Existing test failures 4
Status Test Failing since View job Duration
org.springframework.cloud.dataflow.rest.client.DataFlowClientException: Error reading from URL [http://bit.ly/Celsius-SR1-stream-applications-rabbit-maven]

	at org.springframework.cloud.dataflow.rest.client.VndErrorResponseErrorHandler.handleError(VndErrorResponseErrorHandler.java:63)
	at org.springframework.web.client.RestTemplate.handleResponse(RestTemplate.java:667)
	at org.springframework.web.client.RestTemplate.doExecute(RestTemplate.java:620)
	at org.springframework.web.client.RestTemplate.execute(RestTemplate.java:580)
	at org.springframework.web.client.RestTemplate.postForObject(RestTemplate.java:380)
	at org.springframework.cloud.dataflow.rest.client.AppRegistryTemplate.importFromResource(AppRegistryTemplate.java:106)
(34 more lines...)
org.springframework.cloud.dataflow.rest.client.DataFlowClientException: Error reading from URL [http://bit.ly/Clark-GA-task-applications-maven]

	at org.springframework.cloud.dataflow.rest.client.VndErrorResponseErrorHandler.handleError(VndErrorResponseErrorHandler.java:63)
	at org.springframework.web.client.RestTemplate.handleResponse(RestTemplate.java:667)
	at org.springframework.web.client.RestTemplate.doExecute(RestTemplate.java:620)
	at org.springframework.web.client.RestTemplate.execute(RestTemplate.java:580)
	at org.springframework.web.client.RestTemplate.postForObject(RestTemplate.java:380)
	at org.springframework.cloud.dataflow.rest.client.AppRegistryTemplate.importFromResource(AppRegistryTemplate.java:106)
(33 more lines...)
org.springframework.cloud.dataflow.rest.client.DataFlowClientException: Error reading from URL [http://bit.ly/Clark-GA-task-applications-maven]

	at org.springframework.cloud.dataflow.rest.client.VndErrorResponseErrorHandler.handleError(VndErrorResponseErrorHandler.java:63)
	at org.springframework.web.client.RestTemplate.handleResponse(RestTemplate.java:667)
	at org.springframework.web.client.RestTemplate.doExecute(RestTemplate.java:620)
	at org.springframework.web.client.RestTemplate.execute(RestTemplate.java:580)
	at org.springframework.web.client.RestTemplate.postForObject(RestTemplate.java:380)
	at org.springframework.cloud.dataflow.rest.client.AppRegistryTemplate.importFromResource(AppRegistryTemplate.java:106)
(33 more lines...)
org.springframework.cloud.dataflow.rest.client.DataFlowClientException: Error reading from URL [http://bit.ly/Celsius-SR1-stream-applications-rabbit-maven]

	at org.springframework.cloud.dataflow.rest.client.VndErrorResponseErrorHandler.handleError(VndErrorResponseErrorHandler.java:63)
	at org.springframework.web.client.RestTemplate.handleResponse(RestTemplate.java:667)
	at org.springframework.web.client.RestTemplate.doExecute(RestTemplate.java:620)
	at org.springframework.web.client.RestTemplate.execute(RestTemplate.java:580)
	at org.springframework.web.client.RestTemplate.postForObject(RestTemplate.java:380)
	at org.springframework.cloud.dataflow.rest.client.AppRegistryTemplate.importFromResource(AppRegistryTemplate.java:106)
(34 more lines...)
Fixed tests 2
Status Test Failing since View job Duration
Successful NamedChannelTests testTap History
Failing since build #283 (Scheduled with changes by Mark Pollack) Run Data Flow Acceptance Tests for Rabbit 1 min
Successful NamedChannelTests manyToOneTest History
Failing since build #283 (Scheduled with changes by Mark Pollack) Run Data Flow Acceptance Tests for Rabbit 1 min