Build: #640 was successful

Job: Run Data Flow Acceptance Tests for Kafka was successful

Stages & jobs

  1. Test Stage - Kafka

  2. Test Stage - Rabbit

Build log

The build generated 728 lines of output. Download or view full build log

15-Jan-2019 05:00:00 Build Spring Cloud Data Flow Acceptance Tests - Local + SCDF-1.7.4.BS + Classic (5am) - Run Data Flow Acceptance Tests for Kafka #640 (SCDT-LOCALCLASSIC-KAFKA-640) started building on agent bamboo-11.af.pivotal.io
15-Jan-2019 05:00:00 Remote agent on host bamboo-11.af.pivotal.io
15-Jan-2019 05:00:00 Build working directory is /opt/bamboo-home/xml-data/build-dir/SCDT-LOCALCLASSIC-KAFKA
15-Jan-2019 05:00:00 Executing build Spring Cloud Data Flow Acceptance Tests - Local + SCDF-1.7.4.BS + Classic (5am) - Run Data Flow Acceptance Tests for Kafka #640 (SCDT-LOCALCLASSIC-KAFKA-640)
15-Jan-2019 05:00:00 Starting task 'Checkout Default Repository' of type 'com.atlassian.bamboo.plugins.vcs:task.vcs.checkout'
15-Jan-2019 05:00:00 Checking out into /opt/bamboo-home/xml-data/build-dir/SCDT-LOCALCLASSIC-KAFKA
15-Jan-2019 05:00:00 Updating source code to revision: 81cf8e7d743b9305b6fcf979b96acb05142e6edc
15-Jan-2019 05:00:00 Creating local git repository in '/opt/bamboo-home/xml-data/build-dir/SCDT-LOCALCLASSIC-KAFKA/.git'.
15-Jan-2019 05:00:00 Initialized empty Git repository in /opt/bamboo-home/xml-data/build-dir/SCDT-LOCALCLASSIC-KAFKA/.git/
15-Jan-2019 05:00:01 Fetching 'refs/heads/master' from 'https://github.com/spring-cloud/spring-cloud-dataflow-acceptance-tests.git'.
15-Jan-2019 05:00:05 From https://github.com/spring-cloud/spring-cloud-dataflow-acceptance-tests
15-Jan-2019 05:00:05 * [new branch]      master     -> master
15-Jan-2019 05:00:05 Checking out revision 81cf8e7d743b9305b6fcf979b96acb05142e6edc.
15-Jan-2019 05:00:05 Already on 'master'
15-Jan-2019 05:00:05 Updated source code to revision: 81cf8e7d743b9305b6fcf979b96acb05142e6edc
15-Jan-2019 05:00:05 Finished task 'Checkout Default Repository' with result: Success
15-Jan-2019 05:00:05 Running pre-build action: Artifactory Release Staging
15-Jan-2019 05:00:05 Running pre-build action: VCS Version Collector
15-Jan-2019 05:00:05 Starting task 'Execute Acceptance Tests' of type 'com.atlassian.bamboo.plugins.scripttask:task.builder.script'
15-Jan-2019 05:00:05
Beginning to execute external process for build 'Spring Cloud Data Flow Acceptance Tests - Local + SCDF-1.7.4.BS + Classic (5am) - Run Data Flow Acceptance Tests for Kafka #640 (SCDT-LOCALCLASSIC-KAFKA-640)'
... running command line:
/opt/bamboo-home/temp/SCDT-LOCALCLASSIC-KAFKA-640-ScriptBuildTask-7433468594624560747.sh
... in: /opt/bamboo-home/xml-data/build-dir/SCDT-LOCALCLASSIC-KAFKA
... using extra environment variables:
bamboo_planRepository_1_branch=master
bamboo_********_username_password=********
bamboo_signing_store_password=********
bamboo_capability_system_builder_ant_Ant_1_9=/opt/ant-1.9
bamboo_capability_system_builder_ant_Ant_1_8=/opt/ant-1.8
bamboo_planRepository_1_branchDisplayName=master
bamboo_capability_system_jdk_OpenJDK_7u181=/opt/openjdk-7
bamboo_repository_revision_number=81cf8e7d743b9305b6fcf979b96acb05142e6edc
bamboo_repository_247857231_previous_revision_number=4ffaad07559ccd9b8e54cbb085682eae686a1384
bamboo_capability_system_builder_node_Node_js_6=/usr/bin/node
bamboo_RIAK_BIN=/usr/sbin/riak
bamboo_buildKey=SCDT-LOCALCLASSIC-KAFKA
bamboo_sonar_token_password=********
bamboo_shortJobName=Run Data Flow Acceptance Tests for Kafka
bamboo_capability_system_builder_gradle___gradlew=./gradlew
bamboo_buildResultsUrl=https://build.spring.io/browse/SCDT-LOCALCLASSIC-KAFKA-640
bamboo_capability_system_builder_mvn3_Maven_3_3=/opt/maven-3.3
bamboo_capability_system_builder_mvn3_Maven_3_2=/opt/maven-3.2
bamboo_capability_system_builder_mvn3_Maven_3_1=/opt/maven-3.1
bamboo_planRepository_repositoryUrl=https://github.com/spring-cloud/spring-cloud-dataflow-acceptance-tests.git
bamboo_agentId=208568331
bamboo_capability_system_builder_mvn3_Maven_3_5=/opt/maven-3.5
bamboo_capability_system_builder_mvn3_Maven_3_0=/opt/maven-3.0
bamboo_planRepository_revision=81cf8e7d743b9305b6fcf979b96acb05142e6edc
bamboo_planRepository_previousRevision=4ffaad07559ccd9b8e54cbb085682eae686a1384
bamboo_capability_remote_build=true
bamboo_repository_branch_name=master
bamboo_repository_247857231_branch_name=master
bamboo_scdf_acceptance_tests_password=********
JAVA_HOME=/opt/jdk-8
bamboo_capability_Agent=bamboo-11.af.pivotal.io
bamboo_planRepository_branch=master
bamboo_planRepository_1_type=gitv2
bamboo_planRepository_branchName=master
bamboo_repository_247857231_name=Git
bamboo_sonar_password=********
bamboo_hg_cache_directory=/opt/bamboo-home/xml-data/build-dir/_hg-repositories-cache
bamboo_planRepository_1_username=spring-buildmaster
bamboo_planRepository_type=gitv2
bamboo_git_cache_directory=/opt/bamboo-home/xml-data/build-dir/_git-repositories-cache
bamboo_repository_247857231_revision_number=81cf8e7d743b9305b6fcf979b96acb05142e6edc
bamboo_repository_247857231_git_branch=master
bamboo_artifactory_username=buildmaster
bamboo_tmp_directory=/opt/bamboo-home/temp
bamboo_planKey=SCDT-LOCALCLASSIC
bamboo_planRepository_username=spring-buildmaster
bamboo_repository_247857231_git_repositoryUrl=https://github.com/spring-cloud/spring-cloud-dataflow-acceptance-tests.git
bamboo_JDK8_HOME=/opt/jdk-8
bamboo_planRepository_1_branchName=master
bamboo_sonar_version=5.6.3
bamboo_capability_system_jdk_JDK_1_11=/opt/jdk-11
bamboo_resultsUrl=https://build.spring.io/browse/SCDT-LOCALCLASSIC-KAFKA-640
bamboo_capability_system_jdk_JDK_1_10=/opt/jdk-10
bamboo_build_working_directory=/opt/bamboo-home/xml-data/build-dir/SCDT-LOCALCLASSIC-KAFKA
bamboo_planRepository_1_name=Git
bamboo_capability_system_os=ubuntu1604
bamboo_nexusPush_stagingProfile=buildmaster
bamboo_shortPlanName=Local + SCDF-1.7.4.BS + Classic (5am)
bamboo_planRepository_name=Git
bamboo_buildNumber=640
bamboo_planName=Spring Cloud Data Flow Acceptance Tests - Local + SCDF-1.7.4.BS + Classic (5am)
bamboo_JDK7_HOME=/opt/jdk-7
bamboo_shortPlanKey=LOCALCLASSIC
bamboo_shortJobKey=KAFKA
bamboo_artifactory_password=********
bamboo_buildTimeStamp=2019-01-15T05:00:00.854Z
bamboo_repository_previous_revision_number=4ffaad07559ccd9b8e54cbb085682eae686a1384
bamboo_sonar_username=buildmaster
bamboo_********_password=********
bamboo_repository_git_branch=master
bamboo_buildResultKey=SCDT-LOCALCLASSIC-KAFKA-640
bamboo_nexusPush_close=true
bamboo_buildPlanName=Spring Cloud Data Flow Acceptance Tests - Local + SCDF-1.7.4.BS + Classic (5am) - Run Data Flow Acceptance Tests for Kafka
bamboo_planRepository_1_revision=81cf8e7d743b9305b6fcf979b96acb05142e6edc
bamboo_repository_name=Git
bamboo_signing_key_password=********
bamboo_repository_247857231_git_username=spring-buildmaster
bamboo_buildFailed=false
bamboo_capability_system_docker_executable=/usr/bin/docker
bamboo_capability_system_builder_groovy_Groovy_2_4=/opt/groovy-2.4
bamboo_capability_system_builder_command_Bash=/bin/bash
bamboo_agentWorkingDirectory=/opt/bamboo-home/xml-data/build-dir
bamboo_capability_system_git_executable=/usr/bin/git
bamboo_repository_git_username=spring-buildmaster
bamboo_planRepository_1_previousRevision=4ffaad07559ccd9b8e54cbb085682eae686a1384
bamboo_capability_os_family=unix
bamboo_planRepository_branchDisplayName=master
bamboo_capability_system_builder_maven_Artifactory_Maven_3_5=/opt/maven-3.5
bamboo_capability_system_builder_maven_Artifactory_Maven_3_3=/opt/maven-3.3
bamboo_capability_system_builder_maven_Artifactory_Maven_3_2=/opt/maven-3.2
bamboo_s3_properties=/home/bamboo/tools/s3.properties
bamboo_capability_system_builder_maven_Artifactory_Maven_3_1=/opt/maven-3.1
bamboo_capability_system_builder_maven_Artifactory_Maven_3_0=/opt/maven-3.0
bamboo_plan_storageTag=plan-247660696
bamboo_repository_git_repositoryUrl=https://github.com/spring-cloud/spring-cloud-dataflow-acceptance-tests.git
bamboo_working_directory=/opt/bamboo-home/xml-data/build-dir/SCDT-LOCALCLASSIC-KAFKA
bamboo_planRepository_1_repositoryUrl=https://github.com/spring-cloud/spring-cloud-dataflow-acceptance-tests.git
bamboo_capability_system_jdk_JDK_1_8=/opt/jdk-8
bamboo_capability_system_jdk_JDK_1_9=/opt/jdk-9
bamboo_capability_system_jdk_JDK_1_6=/opt/jdk-6
bamboo_capability_system_jdk_JDK_1_7=/opt/jdk-7
bamboo_sonar_ip=10.194.6.9
15-Jan-2019 05:00:05 CLEANING UP RESOURCES BEFORE RUNNING TESTS
15-Jan-2019 05:00:05 Setting the environment variables
15-Jan-2019 05:00:05 Export the unset env. variables from /opt/bamboo-home/xml-data/build-dir/SCDT-LOCALCLASSIC-KAFKA/local/init/env.properties :
15-Jan-2019 05:00:05    SPRING_CLOUD_DATAFLOW_SERVER_DOWNLOAD_URL = http://repo.spring.io/libs-snapshot/org/springframework/cloud/spring-cloud-dataflow-server-local//spring-cloud-dataflow-server-local-.jar
15-Jan-2019 05:00:05    SPRING_CLOUD_SKIPPER_SERVER_DOWNLOAD_URL = http://repo.spring.io/libs-snapshot/org/springframework/cloud/spring-cloud-skipper-server//spring-cloud-skipper-server-.jar
15-Jan-2019 05:00:05    SPRING_DATASOURCE_USERNAME = spring
15-Jan-2019 05:00:05    SPRING_DATASOURCE_PASSWORD = cloud
15-Jan-2019 05:00:05    SPRING_SCHEMA_NAME = dataflow
15-Jan-2019 05:00:05    DOCKER_SERVER = localhost
15-Jan-2019 05:00:05 Setting retries to 60 and WAIT_TIME to 5
15-Jan-2019 05:00:05 Export the unset env. variables from /opt/bamboo-home/xml-data/build-dir/SCDT-LOCALCLASSIC-KAFKA/local/binder/rabbit/env.properties :
15-Jan-2019 05:00:05    STREAM_REGISTRATION_RESOURCE = http://repo.spring.io/libs-release/org/springframework/cloud/stream/app/spring-cloud-stream-app-descriptor/Celsius.SR3/spring-cloud-stream-app-descriptor-Celsius.SR3.stream-apps-rabbit-maven
15-Jan-2019 05:00:05    TASK_REGISTRATION_RESOURCE = http://repo.spring.io/libs-release/org/springframework/cloud/task/app/spring-cloud-task-app-descriptor/Clark.RELEASE/spring-cloud-task-app-descriptor-Clark.RELEASE.task-apps-maven
15-Jan-2019 05:00:05 SCDF SERVER URI: http://localhost:9393
15-Jan-2019 05:00:05 Clean up, clean up, everybody everywhere; clean up clean up, everybody do your share!
15-Jan-2019 05:00:05 No stopped containers
15-Jan-2019 05:00:06 No stopped containers
15-Jan-2019 05:00:06 No stopped containers
15-Jan-2019 05:00:06 FINISHED CLEANING UP RESOURCES
15-Jan-2019 05:00:06 Setting the environment variables
15-Jan-2019 05:00:06 Export the unset env. variables from /opt/bamboo-home/xml-data/build-dir/SCDT-LOCALCLASSIC-KAFKA/local/init/env.properties :
15-Jan-2019 05:00:06    SPRING_CLOUD_DATAFLOW_SERVER_DOWNLOAD_URL = http://repo.spring.io/libs-snapshot/org/springframework/cloud/spring-cloud-dataflow-server-local/1.7.4.BUILD-SNAPSHOT/spring-cloud-dataflow-server-local-1.7.4.BUILD-SNAPSHOT.jar
15-Jan-2019 05:00:06    SPRING_CLOUD_SKIPPER_SERVER_DOWNLOAD_URL = http://repo.spring.io/libs-snapshot/org/springframework/cloud/spring-cloud-skipper-server//spring-cloud-skipper-server-.jar
15-Jan-2019 05:00:06    SPRING_DATASOURCE_USERNAME = spring
15-Jan-2019 05:00:06    SPRING_DATASOURCE_PASSWORD = cloud
15-Jan-2019 05:00:06    SPRING_SCHEMA_NAME = dataflow
15-Jan-2019 05:00:06    DOCKER_SERVER = localhost
15-Jan-2019 05:00:06 Setting retries to 60 and WAIT_TIME to 5
15-Jan-2019 05:00:06 cleaning up any previous mysql docker containers...
15-Jan-2019 05:00:06 done cleaning up.
15-Jan-2019 05:00:06 Could not find a local mysql server, trying docker.
15-Jan-2019 05:00:07 Creating mysql_mysql_1
15-Jan-2019 05:00:07 mysql running on localhost:3306
15-Jan-2019 05:00:07 Service host is localhost
15-Jan-2019 05:00:07 Creating kafka compose file on /opt/bamboo-home/xml-data/build-dir/SCDT-LOCALCLASSIC-KAFKA/local/binder/kafka/docker-compose.yml
15-Jan-2019 05:00:07 cleaning up any previous kafka docker containers...
15-Jan-2019 05:00:07 done cleaning up
15-Jan-2019 05:00:07 Could not find a local kafka server, trying docker.
15-Jan-2019 05:00:07 Creating kafka_zookeeper_1
15-Jan-2019 05:00:07 Creating kafka_kafka_1
15-Jan-2019 05:00:08 kafka running on localhost:9092
15-Jan-2019 05:00:08 Export the unset env. variables from /opt/bamboo-home/xml-data/build-dir/SCDT-LOCALCLASSIC-KAFKA/local/binder/kafka/env.properties :
15-Jan-2019 05:00:08    STREAM_REGISTRATION_RESOURCE = http://repo.spring.io/libs-release/org/springframework/cloud/stream/app/spring-cloud-stream-app-descriptor/Celsius.SR3/spring-cloud-stream-app-descriptor-Celsius.SR3.stream-apps-kafka-10-maven
15-Jan-2019 05:00:08    TASK_REGISTRATION_RESOURCE = http://repo.spring.io/libs-release/org/springframework/cloud/task/app/spring-cloud-task-app-descriptor/Clark.RELEASE/spring-cloud-task-app-descriptor-Clark.RELEASE.task-apps-maven
15-Jan-2019 05:00:08 cleaning up any previous redis docker containers...
15-Jan-2019 05:00:08 done cleaning up.
15-Jan-2019 05:00:09 redis found on localhost
15-Jan-2019 05:00:09 SCDF SERVER URI: http://localhost:9393
15-Jan-2019 05:00:09 Downloading server from http://repo.spring.io/libs-snapshot/org/springframework/cloud/spring-cloud-dataflow-server-local/1.7.4.BUILD-SNAPSHOT/spring-cloud-dataflow-server-local-1.7.4.BUILD-SNAPSHOT.jar
15-Jan-2019 05:00:32 2019-01-15 05:00:32 URL:http://repo.spring.io/libs-snapshot/org/springframework/cloud/spring-cloud-dataflow-server-local/1.7.4.BUILD-SNAPSHOT/spring-cloud-dataflow-server-local-1.7.4.BUILD-SNAPSHOT.jar [66128674/66128674] -> "/opt/bamboo-home/xml-data/build-dir/SCDT-LOCALCLASSIC-KAFKA/local/server/scdf-server.jar" [1]
15-Jan-2019 05:00:32 SPRING_PROFILES_ACTIVE []
15-Jan-2019 05:00:32 executing [nohup /opt/jdk-8/bin/java  -Xmx1024m -Xss1024k -jar /opt/bamboo-home/xml-data/build-dir/SCDT-LOCALCLASSIC-KAFKA/local/server/scdf-server.jar  --spring.datasource.driver-class-name=org.mariadb.jdbc.Driver --spring.datasource.url=jdbc:mysql://localhost/dataflow --spring.datasource.username=spring --spring.datasource.password=cloud  --spring.cloud.dataflow.applicationProperties.stream.spring.cloud.stream.kafka.binder.brokers=localhost --spring.cloud.dataflow.applicationProperties.stream.spring.cloud.stream.kafka.binder.zkNodes=localhost  --spring.redis.host=127.0.0.1 --spring.cloud.deployer.local.workingDirectoriesRoot=/opt/bamboo-home/xml-data/build-dir/SCDT-LOCALCLASSIC-KAFKA/local/server/app-logs > /opt/bamboo-home/xml-data/build-dir/SCDT-LOCALCLASSIC-KAFKA/local/server/scdf-server.log &]
15-Jan-2019 05:00:32 [/opt/bamboo-home/xml-data/build-dir/SCDT-LOCALCLASSIC-KAFKA/local/server] process pid is [7482]
15-Jan-2019 05:00:32 System props are []
15-Jan-2019 05:00:32 Logs are under [/opt/bamboo-home/xml-data/build-dir/SCDT-LOCALCLASSIC-KAFKA/local/server/scdf-server.log] or from nohup [/opt/bamboo-home/xml-data/build-dir/SCDT-LOCALCLASSIC-KAFKA/local/server/nohup.log]
15-Jan-2019 05:00:32 Failed to connect to localhost:9393. Attempt  #1/60... will try again in [5] seconds
15-Jan-2019 05:00:37 Failed to connect to localhost:9393. Attempt  #2/60... will try again in [5] seconds
15-Jan-2019 05:00:42 Failed to connect to localhost:9393. Attempt  #3/60... will try again in [5] seconds
15-Jan-2019 05:00:47 SCDF SERVER ABOUT:
15-Jan-2019 05:00:48 {
15-Jan-2019 05:00:48     "_links": {
15-Jan-2019 05:00:48         "self": {
15-Jan-2019 05:00:48             "href": "http://localhost:9393/about"
15-Jan-2019 05:00:48         }
15-Jan-2019 05:00:48     },
15-Jan-2019 05:00:48     "featureInfo": {
15-Jan-2019 05:00:48         "analyticsEnabled": true,
15-Jan-2019 05:00:48         "schedulerEnabled": false,
15-Jan-2019 05:00:48         "skipperEnabled": false,
15-Jan-2019 05:00:48         "streamsEnabled": true,
15-Jan-2019 05:00:48         "tasksEnabled": true
15-Jan-2019 05:00:48     },
15-Jan-2019 05:00:48     "runtimeEnvironment": {
15-Jan-2019 05:00:48         "appDeployer": {
15-Jan-2019 05:00:48             "deployerImplementationVersion": "1.3.10.RELEASE",
15-Jan-2019 05:00:48             "deployerName": "LocalAppDeployer",
15-Jan-2019 05:00:48             "deployerSpiVersion": "1.3.4.RELEASE",
15-Jan-2019 05:00:48             "javaVersion": "1.8.0_144",
15-Jan-2019 05:00:48             "platformApiVersion": "Linux 4.4.0-141-generic",
15-Jan-2019 05:00:48             "platformClientVersion": "4.4.0-141-generic",
15-Jan-2019 05:00:48             "platformHostVersion": "4.4.0-141-generic",
15-Jan-2019 05:00:48             "platformSpecificInfo": {},
15-Jan-2019 05:00:48             "platformType": "Local",
15-Jan-2019 05:00:48             "springBootVersion": "1.5.16.RELEASE",
15-Jan-2019 05:00:48             "springVersion": "4.3.19.RELEASE"
15-Jan-2019 05:00:48         },
15-Jan-2019 05:00:48         "taskLauncher": {
15-Jan-2019 05:00:48             "deployerImplementationVersion": "1.3.10.RELEASE",
15-Jan-2019 05:00:48             "deployerName": "LocalTaskLauncher",
15-Jan-2019 05:00:48             "deployerSpiVersion": "1.3.4.RELEASE",
15-Jan-2019 05:00:48             "javaVersion": "1.8.0_144",
15-Jan-2019 05:00:48             "platformApiVersion": "Linux 4.4.0-141-generic",
15-Jan-2019 05:00:48             "platformClientVersion": "4.4.0-141-generic",
15-Jan-2019 05:00:48             "platformHostVersion": "4.4.0-141-generic",
15-Jan-2019 05:00:48             "platformSpecificInfo": {},
15-Jan-2019 05:00:48             "platformType": "Local",
15-Jan-2019 05:00:48             "springBootVersion": "1.5.16.RELEASE",
15-Jan-2019 05:00:48             "springVersion": "4.3.19.RELEASE"
15-Jan-2019 05:00:48         }
15-Jan-2019 05:00:48     },
15-Jan-2019 05:00:48     "securityInfo": {
15-Jan-2019 05:00:48         "authenticated": false,
15-Jan-2019 05:00:48         "authenticationEnabled": false,
15-Jan-2019 05:00:48         "authorizationEnabled": false,
15-Jan-2019 05:00:48         "formLogin": false,
15-Jan-2019 05:00:48         "roles": [],
15-Jan-2019 05:00:48         "username": null
15-Jan-2019 05:00:48     },
15-Jan-2019 05:00:48     "versionInfo": {
15-Jan-2019 05:00:48         "core": {
15-Jan-2019 05:00:48             "name": "Spring Cloud Data Flow Core",
15-Jan-2019 05:00:48             "version": "1.7.4.BUILD-SNAPSHOT"
15-Jan-2019 05:00:48         },
15-Jan-2019 05:00:48         "dashboard": {
15-Jan-2019 05:00:48             "name": "Spring Cloud Dataflow UI",
15-Jan-2019 05:00:48             "version": "1.7.2.RELEASE"
15-Jan-2019 05:00:48         },
15-Jan-2019 05:00:48         "implementation": {
15-Jan-2019 05:00:48             "name": "spring-cloud-dataflow-server-local",
15-Jan-2019 05:00:48             "version": "1.7.4.BUILD-SNAPSHOT"
15-Jan-2019 05:00:48         },
15-Jan-2019 05:00:48         "shell": {
15-Jan-2019 05:00:48             "name": "Spring Cloud Data Flow Shell",
15-Jan-2019 05:00:48             "url": "https://repo.spring.io/libs-snapshot/org/springframework/cloud/spring-cloud-dataflow-shell/1.7.4.BUILD-SNAPSHOT/spring-cloud-dataflow-shell-1.7.4.BUILD-SNAPSHOT.jar",
15-Jan-2019 05:00:48             "version": "1.7.4.BUILD-SNAPSHOT"
15-Jan-2019 05:00:48         }
15-Jan-2019 05:00:48     }
15-Jan-2019 05:00:48 }
15-Jan-2019 05:00:49 [INFO] Scanning for projects...
15-Jan-2019 05:00:49 [INFO]                                                                         
15-Jan-2019 05:00:49 [INFO] ------------------------------------------------------------------------
15-Jan-2019 05:00:49 [INFO] Building Data Flow Acceptance Tests 1.1.0.BUILD-SNAPSHOT
15-Jan-2019 05:00:49 [INFO] ------------------------------------------------------------------------
15-Jan-2019 05:00:50 [INFO]
15-Jan-2019 05:00:50 [INFO] --- maven-checkstyle-plugin:2.17:check (checkstyle-validation) @ spring-cloud-dataflow-acceptance-tests ---
15-Jan-2019 05:00:50 [INFO]
15-Jan-2019 05:00:50 [INFO] --- maven-resources-plugin:2.6:resources (default-resources) @ spring-cloud-dataflow-acceptance-tests ---
15-Jan-2019 05:00:50 [INFO] Using 'UTF-8' encoding to copy filtered resources.
15-Jan-2019 05:00:50 [INFO] skip non existing resourceDirectory /opt/bamboo-home/xml-data/build-dir/SCDT-LOCALCLASSIC-KAFKA/src/main/resources
15-Jan-2019 05:00:50 [INFO] skip non existing resourceDirectory /opt/bamboo-home/xml-data/build-dir/SCDT-LOCALCLASSIC-KAFKA/src/main/resources
15-Jan-2019 05:00:50 [INFO]
15-Jan-2019 05:00:50 [INFO] --- maven-compiler-plugin:3.1:compile (default-compile) @ spring-cloud-dataflow-acceptance-tests ---
15-Jan-2019 05:00:50 [INFO] Changes detected - recompiling the module!
15-Jan-2019 05:00:50 [INFO] Compiling 8 source files to /opt/bamboo-home/xml-data/build-dir/SCDT-LOCALCLASSIC-KAFKA/target/classes
15-Jan-2019 05:00:51 [INFO]
15-Jan-2019 05:00:51 [INFO] --- maven-resources-plugin:2.6:testResources (default-testResources) @ spring-cloud-dataflow-acceptance-tests ---
15-Jan-2019 05:00:51 [INFO] Using 'UTF-8' encoding to copy filtered resources.
15-Jan-2019 05:00:51 [INFO] Copying 1 resource
15-Jan-2019 05:00:51 [INFO]
15-Jan-2019 05:00:51 [INFO] --- maven-compiler-plugin:3.1:testCompile (default-testCompile) @ spring-cloud-dataflow-acceptance-tests ---
15-Jan-2019 05:00:51 [INFO] Changes detected - recompiling the module!
15-Jan-2019 05:00:51 [INFO] Compiling 15 source files to /opt/bamboo-home/xml-data/build-dir/SCDT-LOCALCLASSIC-KAFKA/target/test-classes
15-Jan-2019 05:00:51 [WARNING] /opt/bamboo-home/xml-data/build-dir/SCDT-LOCALCLASSIC-KAFKA/src/test/java/org/springframework/cloud/dataflow/acceptance/test/AbstractTaskTests.java: Some input files use unchecked or unsafe operations.
15-Jan-2019 05:00:51 [WARNING] /opt/bamboo-home/xml-data/build-dir/SCDT-LOCALCLASSIC-KAFKA/src/test/java/org/springframework/cloud/dataflow/acceptance/test/AbstractTaskTests.java: Recompile with -Xlint:unchecked for details.
15-Jan-2019 05:00:51 [INFO]
15-Jan-2019 05:00:51 [INFO] --- maven-surefire-plugin:2.18.1:test (default-test) @ spring-cloud-dataflow-acceptance-tests ---
15-Jan-2019 05:00:51 [INFO] Surefire report directory: /opt/bamboo-home/xml-data/build-dir/SCDT-LOCALCLASSIC-KAFKA/target/surefire-reports
15-Jan-2019 05:00:51
15-Jan-2019 05:00:51 -------------------------------------------------------
15-Jan-2019 05:00:51 T E S T S
15-Jan-2019 05:00:51 -------------------------------------------------------
15-Jan-2019 05:00:52 2019-01-15 05:00:52.485  INFO   --- [           main] .b.t.c.SpringBootTestContextBootstrapper : Neither @ContextConfiguration nor @ContextHierarchy found for test class [org.springframework.cloud.dataflow.acceptance.test.AnalyticsTests], using SpringBootContextLoader
15-Jan-2019 05:00:52 2019-01-15 05:00:52.532  INFO   --- [           main] .b.t.c.SpringBootTestContextBootstrapper : Loaded default TestExecutionListener class names from location [META-INF/spring.factories]: [org.springframework.boot.test.mock.mockito.MockitoTestExecutionListener, org.springframework.boot.test.mock.mockito.ResetMocksTestExecutionListener, org.springframework.boot.test.autoconfigure.restdocs.RestDocsTestExecutionListener, org.springframework.boot.test.autoconfigure.web.client.MockRestServiceServerResetTestExecutionListener, org.springframework.boot.test.autoconfigure.web.servlet.MockMvcPrintOnlyOnFailureTestExecutionListener, org.springframework.boot.test.autoconfigure.web.servlet.WebDriverTestExecutionListener, org.springframework.test.context.web.ServletTestExecutionListener, org.springframework.test.context.support.DirtiesContextBeforeModesTestExecutionListener, org.springframework.test.context.support.DependencyInjectionTestExecutionListener, org.springframework.test.context.support.DirtiesContextTestExecutionListener, org.springframework.test.context.transaction.TransactionalTestExecutionListener, org.springframework.test.context.jdbc.SqlScriptsTestExecutionListener]
15-Jan-2019 05:00:52 2019-01-15 05:00:52.549  INFO   --- [           main] .b.t.c.SpringBootTestContextBootstrapper : Using TestExecutionListeners: [org.springframework.test.context.web.ServletTestExecutionListener@636be97c, org.springframework.test.context.support.DirtiesContextBeforeModesTestExecutionListener@50a638b5, org.springframework.boot.test.autoconfigure.SpringBootDependencyInjectionTestExecutionListener@1817d444, org.springframework.test.context.support.DirtiesContextTestExecutionListener@6ca8564a, org.springframework.test.context.transaction.TransactionalTestExecutionListener@50b472aa, org.springframework.test.context.jdbc.SqlScriptsTestExecutionListener@31368b99, org.springframework.boot.test.autoconfigure.web.servlet.MockMvcPrintOnlyOnFailureTestExecutionListener@1725dc0f, org.springframework.boot.test.autoconfigure.web.client.MockRestServiceServerResetTestExecutionListener@3911c2a7, org.springframework.boot.test.mock.mockito.ResetMocksTestExecutionListener@4ac3c60d, org.springframework.boot.test.autoconfigure.web.servlet.WebDriverTestExecutionListener@4facf68f, org.springframework.boot.test.autoconfigure.restdocs.RestDocsTestExecutionListener@76508ed1, org.springframework.boot.test.mock.mockito.MockitoTestExecutionListener@41e36e46]
15-Jan-2019 05:00:52 2019-01-15 05:00:52.551  INFO   --- [           main] .b.t.c.SpringBootTestContextBootstrapper : Neither @ContextConfiguration nor @ContextHierarchy found for test class [org.springframework.cloud.dataflow.acceptance.test.WoodChuckTests], using SpringBootContextLoader
15-Jan-2019 05:00:52 2019-01-15 05:00:52.563  INFO   --- [           main] .b.t.c.SpringBootTestContextBootstrapper : Loaded default TestExecutionListener class names from location [META-INF/spring.factories]: [org.springframework.boot.test.mock.mockito.MockitoTestExecutionListener, org.springframework.boot.test.mock.mockito.ResetMocksTestExecutionListener, org.springframework.boot.test.autoconfigure.restdocs.RestDocsTestExecutionListener, org.springframework.boot.test.autoconfigure.web.client.MockRestServiceServerResetTestExecutionListener, org.springframework.boot.test.autoconfigure.web.servlet.MockMvcPrintOnlyOnFailureTestExecutionListener, org.springframework.boot.test.autoconfigure.web.servlet.WebDriverTestExecutionListener, org.springframework.test.context.web.ServletTestExecutionListener, org.springframework.test.context.support.DirtiesContextBeforeModesTestExecutionListener, org.springframework.test.context.support.DependencyInjectionTestExecutionListener, org.springframework.test.context.support.DirtiesContextTestExecutionListener, org.springframework.test.context.transaction.TransactionalTestExecutionListener, org.springframework.test.context.jdbc.SqlScriptsTestExecutionListener]
15-Jan-2019 05:00:52 2019-01-15 05:00:52.566  INFO   --- [           main] .b.t.c.SpringBootTestContextBootstrapper : Using TestExecutionListeners: [org.springframework.test.context.web.ServletTestExecutionListener@49139829, org.springframework.test.context.support.DirtiesContextBeforeModesTestExecutionListener@9597028, org.springframework.boot.test.autoconfigure.SpringBootDependencyInjectionTestExecutionListener@6069db50, org.springframework.test.context.support.DirtiesContextTestExecutionListener@4efbca5a, org.springframework.test.context.transaction.TransactionalTestExecutionListener@1b7cc17c, org.springframework.test.context.jdbc.SqlScriptsTestExecutionListener@59662a0b, org.springframework.boot.test.autoconfigure.web.servlet.MockMvcPrintOnlyOnFailureTestExecutionListener@77fbd92c, org.springframework.boot.test.autoconfigure.web.client.MockRestServiceServerResetTestExecutionListener@67c27493, org.springframework.boot.test.mock.mockito.ResetMocksTestExecutionListener@1a482e36, org.springframework.boot.test.autoconfigure.web.servlet.WebDriverTestExecutionListener@72967906, org.springframework.boot.test.autoconfigure.restdocs.RestDocsTestExecutionListener@5b8dfcc1, org.springframework.boot.test.mock.mockito.MockitoTestExecutionListener@2f9f7dcf]
15-Jan-2019 05:00:52 2019-01-15 05:00:52.567  INFO   --- [           main] .b.t.c.SpringBootTestContextBootstrapper : Neither @ContextConfiguration nor @ContextHierarchy found for test class [org.springframework.cloud.dataflow.acceptance.test.HttpSourceTests], using SpringBootContextLoader
15-Jan-2019 05:00:52 2019-01-15 05:00:52.576  INFO   --- [           main] .b.t.c.SpringBootTestContextBootstrapper : Loaded default TestExecutionListener class names from location [META-INF/spring.factories]: [org.springframework.boot.test.mock.mockito.MockitoTestExecutionListener, org.springframework.boot.test.mock.mockito.ResetMocksTestExecutionListener, org.springframework.boot.test.autoconfigure.restdocs.RestDocsTestExecutionListener, org.springframework.boot.test.autoconfigure.web.client.MockRestServiceServerResetTestExecutionListener, org.springframework.boot.test.autoconfigure.web.servlet.MockMvcPrintOnlyOnFailureTestExecutionListener, org.springframework.boot.test.autoconfigure.web.servlet.WebDriverTestExecutionListener, org.springframework.test.context.web.ServletTestExecutionListener, org.springframework.test.context.support.DirtiesContextBeforeModesTestExecutionListener, org.springframework.test.context.support.DependencyInjectionTestExecutionListener, org.springframework.test.context.support.DirtiesContextTestExecutionListener, org.springframework.test.context.transaction.TransactionalTestExecutionListener, org.springframework.test.context.jdbc.SqlScriptsTestExecutionListener]
15-Jan-2019 05:00:52 2019-01-15 05:00:52.579  INFO   --- [           main] .b.t.c.SpringBootTestContextBootstrapper : Using TestExecutionListeners: [org.springframework.test.context.web.ServletTestExecutionListener@1a677343, org.springframework.test.context.support.DirtiesContextBeforeModesTestExecutionListener@15de0b3c, org.springframework.boot.test.autoconfigure.SpringBootDependencyInjectionTestExecutionListener@489115ef, org.springframework.test.context.support.DirtiesContextTestExecutionListener@3857f613, org.springframework.test.context.transaction.TransactionalTestExecutionListener@198b6731, org.springframework.test.context.jdbc.SqlScriptsTestExecutionListener@7c6908d7, org.springframework.boot.test.autoconfigure.web.servlet.MockMvcPrintOnlyOnFailureTestExecutionListener@3c9754d8, org.springframework.boot.test.autoconfigure.web.client.MockRestServiceServerResetTestExecutionListener@3bf7ca37, org.springframework.boot.test.mock.mockito.ResetMocksTestExecutionListener@79079097, org.springframework.boot.test.autoconfigure.web.servlet.WebDriverTestExecutionListener@4d1c00d0, org.springframework.boot.test.autoconfigure.restdocs.RestDocsTestExecutionListener@4b2bac3f, org.springframework.boot.test.mock.mockito.MockitoTestExecutionListener@4e08711f]
15-Jan-2019 05:00:52 2019-01-15 05:00:52.595  INFO   --- [           main] .b.t.c.SpringBootTestContextBootstrapper : Neither @ContextConfiguration nor @ContextHierarchy found for test class [org.springframework.cloud.dataflow.acceptance.test.TickTockTests], using SpringBootContextLoader
15-Jan-2019 05:00:52 2019-01-15 05:00:52.603  INFO   --- [           main] .b.t.c.SpringBootTestContextBootstrapper : Loaded default TestExecutionListener class names from location [META-INF/spring.factories]: [org.springframework.boot.test.mock.mockito.MockitoTestExecutionListener, org.springframework.boot.test.mock.mockito.ResetMocksTestExecutionListener, org.springframework.boot.test.autoconfigure.restdocs.RestDocsTestExecutionListener, org.springframework.boot.test.autoconfigure.web.client.MockRestServiceServerResetTestExecutionListener, org.springframework.boot.test.autoconfigure.web.servlet.MockMvcPrintOnlyOnFailureTestExecutionListener, org.springframework.boot.test.autoconfigure.web.servlet.WebDriverTestExecutionListener, org.springframework.test.context.web.ServletTestExecutionListener, org.springframework.test.context.support.DirtiesContextBeforeModesTestExecutionListener, org.springframework.test.context.support.DependencyInjectionTestExecutionListener, org.springframework.test.context.support.DirtiesContextTestExecutionListener, org.springframework.test.context.transaction.TransactionalTestExecutionListener, org.springframework.test.context.jdbc.SqlScriptsTestExecutionListener]
15-Jan-2019 05:00:52 2019-01-15 05:00:52.606  INFO   --- [           main] .b.t.c.SpringBootTestContextBootstrapper : Using TestExecutionListeners: [org.springframework.test.context.web.ServletTestExecutionListener@67080771, org.springframework.test.context.support.DirtiesContextBeforeModesTestExecutionListener@72cde7cc, org.springframework.boot.test.autoconfigure.SpringBootDependencyInjectionTestExecutionListener@5fd4f8f5, org.springframework.test.context.support.DirtiesContextTestExecutionListener@696da30b, org.springframework.test.context.transaction.TransactionalTestExecutionListener@4e7912d8, org.springframework.test.context.jdbc.SqlScriptsTestExecutionListener@53976f5c, org.springframework.boot.test.autoconfigure.web.servlet.MockMvcPrintOnlyOnFailureTestExecutionListener@2bfc268b, org.springframework.boot.test.autoconfigure.web.client.MockRestServiceServerResetTestExecutionListener@2f8dad04, org.springframework.boot.test.mock.mockito.ResetMocksTestExecutionListener@29e495ff, org.springframework.boot.test.autoconfigure.web.servlet.WebDriverTestExecutionListener@41e1e210, org.springframework.boot.test.autoconfigure.restdocs.RestDocsTestExecutionListener@be35cd9, org.springframework.boot.test.mock.mockito.MockitoTestExecutionListener@4944252c]
15-Jan-2019 05:00:52 2019-01-15 05:00:52.607  INFO   --- [           main] .b.t.c.SpringBootTestContextBootstrapper : Neither @ContextConfiguration nor @ContextHierarchy found for test class [org.springframework.cloud.dataflow.acceptance.test.TransformTests], using SpringBootContextLoader
15-Jan-2019 05:00:52 2019-01-15 05:00:52.615  INFO   --- [           main] .b.t.c.SpringBootTestContextBootstrapper : Loaded default TestExecutionListener class names from location [META-INF/spring.factories]: [org.springframework.boot.test.mock.mockito.MockitoTestExecutionListener, org.springframework.boot.test.mock.mockito.ResetMocksTestExecutionListener, org.springframework.boot.test.autoconfigure.restdocs.RestDocsTestExecutionListener, org.springframework.boot.test.autoconfigure.web.client.MockRestServiceServerResetTestExecutionListener, org.springframework.boot.test.autoconfigure.web.servlet.MockMvcPrintOnlyOnFailureTestExecutionListener, org.springframework.boot.test.autoconfigure.web.servlet.WebDriverTestExecutionListener, org.springframework.test.context.web.ServletTestExecutionListener, org.springframework.test.context.support.DirtiesContextBeforeModesTestExecutionListener, org.springframework.test.context.support.DependencyInjectionTestExecutionListener, org.springframework.test.context.support.DirtiesContextTestExecutionListener, org.springframework.test.context.transaction.TransactionalTestExecutionListener, org.springframework.test.context.jdbc.SqlScriptsTestExecutionListener]
15-Jan-2019 05:00:52 2019-01-15 05:00:52.617  INFO   --- [           main] .b.t.c.SpringBootTestContextBootstrapper : Using TestExecutionListeners: [org.springframework.test.context.web.ServletTestExecutionListener@306e95ec, org.springframework.test.context.support.DirtiesContextBeforeModesTestExecutionListener@52af26ee, org.springframework.boot.test.autoconfigure.SpringBootDependencyInjectionTestExecutionListener@6fd83fc1, org.springframework.test.context.support.DirtiesContextTestExecutionListener@4f2b503c, org.springframework.test.context.transaction.TransactionalTestExecutionListener@bae7dc0, org.springframework.test.context.jdbc.SqlScriptsTestExecutionListener@209da20d, org.springframework.boot.test.autoconfigure.web.servlet.MockMvcPrintOnlyOnFailureTestExecutionListener@e15b7e8, org.springframework.boot.test.autoconfigure.web.client.MockRestServiceServerResetTestExecutionListener@1b2abca6, org.springframework.boot.test.mock.mockito.ResetMocksTestExecutionListener@6392827e, org.springframework.boot.test.autoconfigure.web.servlet.WebDriverTestExecutionListener@2ed2d9cb, org.springframework.boot.test.autoconfigure.restdocs.RestDocsTestExecutionListener@d5b810e, org.springframework.boot.test.mock.mockito.MockitoTestExecutionListener@43dac38f]
15-Jan-2019 05:00:52 2019-01-15 05:00:52.627  INFO   --- [           main] .b.t.c.SpringBootTestContextBootstrapper : Neither @ContextConfiguration nor @ContextHierarchy found for test class [org.springframework.cloud.dataflow.acceptance.test.NamedChannelTests], using SpringBootContextLoader
15-Jan-2019 05:00:52 2019-01-15 05:00:52.636  INFO   --- [           main] .b.t.c.SpringBootTestContextBootstrapper : Loaded default TestExecutionListener class names from location [META-INF/spring.factories]: [org.springframework.boot.test.mock.mockito.MockitoTestExecutionListener, org.springframework.boot.test.mock.mockito.ResetMocksTestExecutionListener, org.springframework.boot.test.autoconfigure.restdocs.RestDocsTestExecutionListener, org.springframework.boot.test.autoconfigure.web.client.MockRestServiceServerResetTestExecutionListener, org.springframework.boot.test.autoconfigure.web.servlet.MockMvcPrintOnlyOnFailureTestExecutionListener, org.springframework.boot.test.autoconfigure.web.servlet.WebDriverTestExecutionListener, org.springframework.test.context.web.ServletTestExecutionListener, org.springframework.test.context.support.DirtiesContextBeforeModesTestExecutionListener, org.springframework.test.context.support.DependencyInjectionTestExecutionListener, org.springframework.test.context.support.DirtiesContextTestExecutionListener, org.springframework.test.context.transaction.TransactionalTestExecutionListener, org.springframework.test.context.jdbc.SqlScriptsTestExecutionListener]
15-Jan-2019 05:00:52 2019-01-15 05:00:52.638  INFO   --- [           main] .b.t.c.SpringBootTestContextBootstrapper : Using TestExecutionListeners: [org.springframework.test.context.web.ServletTestExecutionListener@31ea9581, org.springframework.test.context.support.DirtiesContextBeforeModesTestExecutionListener@231f98ef, org.springframework.boot.test.autoconfigure.SpringBootDependencyInjectionTestExecutionListener@7c137fd5, org.springframework.test.context.support.DirtiesContextTestExecutionListener@183ec003, org.springframework.test.context.transaction.TransactionalTestExecutionListener@7d9d0818, org.springframework.test.context.jdbc.SqlScriptsTestExecutionListener@221a3fa4, org.springframework.boot.test.autoconfigure.web.servlet.MockMvcPrintOnlyOnFailureTestExecutionListener@451001e5, org.springframework.boot.test.autoconfigure.web.client.MockRestServiceServerResetTestExecutionListener@2b40ff9c, org.springframework.boot.test.mock.mockito.ResetMocksTestExecutionListener@3e08ff24, org.springframework.boot.test.autoconfigure.web.servlet.WebDriverTestExecutionListener@4d1c005e, org.springframework.boot.test.autoconfigure.restdocs.RestDocsTestExecutionListener@8462f31, org.springframework.boot.test.mock.mockito.MockitoTestExecutionListener@24569dba]
15-Jan-2019 05:00:52 Running org.springframework.cloud.dataflow.acceptance.test.AnalyticsTests
15-Jan-2019 05:00:52 2019-01-15 05:00:52.660  INFO   --- [           main] .b.t.c.SpringBootTestContextBootstrapper : Neither @ContextConfiguration nor @ContextHierarchy found for test class [org.springframework.cloud.dataflow.acceptance.test.AnalyticsTests], using SpringBootContextLoader
15-Jan-2019 05:00:52 2019-01-15 05:00:52.667  INFO   --- [           main] .b.t.c.SpringBootTestContextBootstrapper : Loaded default TestExecutionListener class names from location [META-INF/spring.factories]: [org.springframework.boot.test.mock.mockito.MockitoTestExecutionListener, org.springframework.boot.test.mock.mockito.ResetMocksTestExecutionListener, org.springframework.boot.test.autoconfigure.restdocs.RestDocsTestExecutionListener, org.springframework.boot.test.autoconfigure.web.client.MockRestServiceServerResetTestExecutionListener, org.springframework.boot.test.autoconfigure.web.servlet.MockMvcPrintOnlyOnFailureTestExecutionListener, org.springframework.boot.test.autoconfigure.web.servlet.WebDriverTestExecutionListener, org.springframework.test.context.web.ServletTestExecutionListener, org.springframework.test.context.support.DirtiesContextBeforeModesTestExecutionListener, org.springframework.test.context.support.DependencyInjectionTestExecutionListener, org.springframework.test.context.support.DirtiesContextTestExecutionListener, org.springframework.test.context.transaction.TransactionalTestExecutionListener, org.springframework.test.context.jdbc.SqlScriptsTestExecutionListener]
15-Jan-2019 05:00:52 2019-01-15 05:00:52.680  INFO   --- [           main] .b.t.c.SpringBootTestContextBootstrapper : Using TestExecutionListeners: [org.springframework.test.context.web.ServletTestExecutionListener@4b86805d, org.springframework.test.context.support.DirtiesContextBeforeModesTestExecutionListener@5852c06f, org.springframework.boot.test.autoconfigure.SpringBootDependencyInjectionTestExecutionListener@4149c063, org.springframework.test.context.support.DirtiesContextTestExecutionListener@9cb8225, org.springframework.test.context.transaction.TransactionalTestExecutionListener@76b07f29, org.springframework.test.context.jdbc.SqlScriptsTestExecutionListener@38af9828, org.springframework.boot.test.autoconfigure.web.servlet.MockMvcPrintOnlyOnFailureTestExecutionListener@376a0d86, org.springframework.boot.test.autoconfigure.web.client.MockRestServiceServerResetTestExecutionListener@62656be4, org.springframework.boot.test.mock.mockito.ResetMocksTestExecutionListener@17d919b6, org.springframework.boot.test.autoconfigure.web.servlet.WebDriverTestExecutionListener@53f3bdbd, org.springframework.boot.test.autoconfigure.restdocs.RestDocsTestExecutionListener@34129c78, org.springframework.boot.test.mock.mockito.MockitoTestExecutionListener@7d61eb55]
15-Jan-2019 05:00:53 2019-01-15 05:00:53.293  INFO 7596 --- [           main] s.c.a.AnnotationConfigApplicationContext : Refreshing org.springframework.context.annotation.AnnotationConfigApplicationContext@3228d990: startup date [Tue Jan 15 05:00:53 UTC 2019]; root of context hierarchy
15-Jan-2019 05:00:53 2019-01-15 05:00:53.541  INFO 7596 --- [           main] trationDelegate$BeanPostProcessorChecker : Bean 'configurationPropertiesRebinderAutoConfiguration' of type [class org.springframework.cloud.autoconfigure.ConfigurationPropertiesRebinderAutoConfiguration$$EnhancerBySpringCGLIB$$44458212] is not eligible for getting processed by all BeanPostProcessors (for example: not eligible for auto-proxying)
15-Jan-2019 05:00:53
15-Jan-2019 05:00:53   .   ____          _            __ _ _
15-Jan-2019 05:00:53 /\\ / ___'_ __ _ _(_)_ __  __ _ \ \ \ \
15-Jan-2019 05:00:53 ( ( )\___ | '_ | '_| | '_ \/ _` | \ \ \ \
15-Jan-2019 05:00:53 \\/  ___)| |_)| | | | | || (_| |  ) ) ) )
15-Jan-2019 05:00:53   '  |____| .__|_| |_|_| |_\__, | / / / /
15-Jan-2019 05:00:53 =========|_|==============|___/=/_/_/_/
15-Jan-2019 05:00:53 :: Spring Boot ::        (v1.4.1.RELEASE)
15-Jan-2019 05:00:53
15-Jan-2019 05:00:53 2019-01-15 05:00:53.893  INFO 7596 --- [           main] c.c.c.ConfigServicePropertySourceLocator : Fetching config from server at: http://localhost:8888
15-Jan-2019 05:00:53 2019-01-15 05:00:53.974  WARN 7596 --- [           main] c.c.c.ConfigServicePropertySourceLocator : Could not locate PropertySource: I/O error on GET request for "http://localhost:8888//blah": Connection refused (Connection refused); nested exception is java.net.ConnectException: Connection refused (Connection refused)
15-Jan-2019 05:00:53 2019-01-15 05:00:53.982  INFO 7596 --- [           main] o.s.c.d.acceptance.test.AnalyticsTests   : The following profiles are active: blah
15-Jan-2019 05:00:54 2019-01-15 05:00:54.187  INFO 7596 --- [           main] o.s.c.d.acceptance.test.AnalyticsTests   : Started AnalyticsTests in 1.425 seconds (JVM running for 2.107)
15-Jan-2019 05:00:54 2019-01-15 05:00:54.382  INFO 7596 --- [           main] junit.logTestName                        : Starting Test analyticsTest(org.springframework.cloud.dataflow.acceptance.test.AnalyticsTests)
15-Jan-2019 05:00:54 2019-01-15 05:00:54.387  INFO 7596 --- [           main] o.s.c.d.acceptance.test.AnalyticsTests   : Importing stream apps from uri resource: http://repo.spring.io/libs-release/org/springframework/cloud/stream/app/spring-cloud-stream-app-descriptor/Celsius.SR3/spring-cloud-stream-app-descriptor-Celsius.SR3.stream-apps-kafka-10-maven
15-Jan-2019 05:00:54 2019-01-15 05:00:54.815  INFO 7596 --- [           main] o.s.c.d.acceptance.test.AnalyticsTests   : Creating stream 'httpCounter'
15-Jan-2019 05:00:55 2019-01-15 05:00:55.013  INFO 7596 --- [           main] o.s.c.d.acceptance.test.AnalyticsTests   : Deploying stream 'httpCounter' with properties: {app.*.logging.file=${PID}-test.log, app.*.endpoints.logfile.sensitive=false, app.*.management.endpoints.web.exposure.include=*}
15-Jan-2019 05:00:55 2019-01-15 05:00:55.451  INFO 7596 --- [           main] o.s.c.d.acceptance.test.AnalyticsTests   : Checking: Stream=httpCounter, status = deploying, status description = The stream is being deployed.
15-Jan-2019 05:00:55 2019-01-15 05:00:55.451  INFO 7596 --- [           main] o.s.c.d.acceptance.test.AnalyticsTests   : Sleeping to check status of Stream=httpCounter
15-Jan-2019 05:01:05 2019-01-15 05:01:05.500  INFO 7596 --- [           main] o.s.c.d.acceptance.test.AnalyticsTests   : Checking: Stream=httpCounter, status = deploying, status description = The stream is being deployed.
15-Jan-2019 05:01:05 2019-01-15 05:01:05.500  INFO 7596 --- [           main] o.s.c.d.acceptance.test.AnalyticsTests   : Sleeping to check status of Stream=httpCounter
15-Jan-2019 05:01:15 2019-01-15 05:01:15.513  INFO 7596 --- [           main] o.s.c.d.acceptance.test.AnalyticsTests   : Checking: Stream=httpCounter, status = deployed, status description = The stream has been successfully deployed
15-Jan-2019 05:01:15 2019-01-15 05:01:15.548  INFO 7596 --- [           main] o.s.c.d.acceptance.test.AnalyticsTests   : Sleeping to check status of Stream=httpCounter
15-Jan-2019 05:01:25 2019-01-15 05:01:25.548  INFO 7596 --- [           main] o.s.c.d.acceptance.test.AnalyticsTests   : Stream 'httpCounter' started with status: deployed
15-Jan-2019 05:01:25 2019-01-15 05:01:25.548  INFO 7596 --- [           main] o.s.c.d.acceptance.test.AnalyticsTests   : App 'http' has instances: {httpCounter.http-0=http://10.194.6.21:34642}
15-Jan-2019 05:01:25 2019-01-15 05:01:25.548  INFO 7596 --- [           main] o.s.c.d.acceptance.test.AnalyticsTests   : App 'counter' has instances: {httpCounter.counter-0=http://10.194.6.21:38173}
15-Jan-2019 05:01:25 2019-01-15 05:01:25.548  INFO 7596 --- [           main] o.s.c.d.acceptance.test.AnalyticsTests   : Looking for 'Started HttpSource' in logfile for http
15-Jan-2019 05:01:35 2019-01-15 05:01:35.549  INFO 7596 --- [           main] o.s.c.d.acceptance.test.AnalyticsTests   : Requesting log for app httpCounter.http-0
15-Jan-2019 05:01:35 2019-01-15 05:01:35.763  INFO 7596 --- [           main] o.s.c.d.acceptance.test.AnalyticsTests   : Retrieved logfile from 'http://10.194.6.21:34642/logfile
15-Jan-2019 05:01:35 2019-01-15 05:01:35.767  INFO 7596 --- [           main] o.s.c.d.acceptance.test.AnalyticsTests   : Matched all 'Started HttpSource' in logfile for instance httpCounter.http-0 of app http
15-Jan-2019 05:01:35 2019-01-15 05:01:35.768  INFO 7596 --- [           main] o.s.c.d.acceptance.test.AnalyticsTests   : Looking for 'Started CounterSink' in logfile for counter
15-Jan-2019 05:01:45 2019-01-15 05:01:45.768  INFO 7596 --- [           main] o.s.c.d.acceptance.test.AnalyticsTests   : Requesting log for app httpCounter.counter-0
15-Jan-2019 05:01:45 2019-01-15 05:01:45.923  INFO 7596 --- [           main] o.s.c.d.acceptance.test.AnalyticsTests   : Retrieved logfile from 'http://10.194.6.21:38173/logfile
15-Jan-2019 05:01:45 2019-01-15 05:01:45.924  INFO 7596 --- [           main] o.s.c.d.acceptance.test.AnalyticsTests   : Matched all 'Started CounterSink' in logfile for instance httpCounter.counter-0 of app counter
15-Jan-2019 05:01:56 2019-01-15 05:01:56.155  INFO 7596 --- [           main] junit.logTestName                        : Test analyticsTest(org.springframework.cloud.dataflow.acceptance.test.AnalyticsTests) Succeeded
15-Jan-2019 05:01:56 2019-01-15 05:01:56.155  INFO 7596 --- [           main] junit.logTestName                        : Finished Test analyticsTest(org.springframework.cloud.dataflow.acceptance.test.AnalyticsTests)
15-Jan-2019 05:01:56 2019-01-15 05:01:56.155  INFO 7596 --- [           main] o.s.c.d.acceptance.test.AnalyticsTests   : Destroy all streams
15-Jan-2019 05:01:56 Tests run: 1, Failures: 0, Errors: 0, Skipped: 0, Time elapsed: 63.561 sec - in org.springframework.cloud.dataflow.acceptance.test.AnalyticsTests
15-Jan-2019 05:01:56 Running org.springframework.cloud.dataflow.acceptance.test.WoodChuckTests
15-Jan-2019 05:01:56 2019-01-15 05:01:56.219  INFO 7596 --- [           main] .b.t.c.SpringBootTestContextBootstrapper : Neither @ContextConfiguration nor @ContextHierarchy found for test class [org.springframework.cloud.dataflow.acceptance.test.WoodChuckTests], using SpringBootContextLoader
15-Jan-2019 05:01:56 2019-01-15 05:01:56.238  INFO 7596 --- [           main] .b.t.c.SpringBootTestContextBootstrapper : Loaded default TestExecutionListener class names from location [META-INF/spring.factories]: [org.springframework.boot.test.mock.mockito.MockitoTestExecutionListener, org.springframework.boot.test.mock.mockito.ResetMocksTestExecutionListener, org.springframework.boot.test.autoconfigure.restdocs.RestDocsTestExecutionListener, org.springframework.boot.test.autoconfigure.web.client.MockRestServiceServerResetTestExecutionListener, org.springframework.boot.test.autoconfigure.web.servlet.MockMvcPrintOnlyOnFailureTestExecutionListener, org.springframework.boot.test.autoconfigure.web.servlet.WebDriverTestExecutionListener, org.springframework.test.context.web.ServletTestExecutionListener, org.springframework.test.context.support.DirtiesContextBeforeModesTestExecutionListener, org.springframework.test.context.support.DependencyInjectionTestExecutionListener, org.springframework.test.context.support.DirtiesContextTestExecutionListener, org.springframework.test.context.transaction.TransactionalTestExecutionListener, org.springframework.test.context.jdbc.SqlScriptsTestExecutionListener]
15-Jan-2019 05:01:56 2019-01-15 05:01:56.242  INFO 7596 --- [           main] .b.t.c.SpringBootTestContextBootstrapper : Using TestExecutionListeners: [org.springframework.test.context.web.ServletTestExecutionListener@ff23ae7, org.springframework.test.context.support.DirtiesContextBeforeModesTestExecutionListener@423b2b62, org.springframework.boot.test.autoconfigure.SpringBootDependencyInjectionTestExecutionListener@2b7962a2, org.springframework.test.context.support.DirtiesContextTestExecutionListener@6ad16c5d, org.springframework.test.context.transaction.TransactionalTestExecutionListener@74ea46e2, org.springframework.test.context.jdbc.SqlScriptsTestExecutionListener@6f911326, org.springframework.boot.test.autoconfigure.web.servlet.MockMvcPrintOnlyOnFailureTestExecutionListener@f1d0004, org.springframework.boot.test.autoconfigure.web.client.MockRestServiceServerResetTestExecutionListener@6e4f263e, org.springframework.boot.test.mock.mockito.ResetMocksTestExecutionListener@48b4a043, org.springframework.boot.test.autoconfigure.web.servlet.WebDriverTestExecutionListener@2f5b8250, org.springframework.boot.test.autoconfigure.restdocs.RestDocsTestExecutionListener@4821aa9f, org.springframework.boot.test.mock.mockito.MockitoTestExecutionListener@5f481b73]
15-Jan-2019 05:01:56 2019-01-15 05:01:56.297  INFO 7596 --- [           main] junit.logTestName                        : Starting Test testPartitioning(org.springframework.cloud.dataflow.acceptance.test.WoodChuckTests)
15-Jan-2019 05:01:56 2019-01-15 05:01:56.301  INFO 7596 --- [           main] o.s.c.d.acceptance.test.WoodChuckTests   : Creating stream 'WOODCHUCK-TEST'
15-Jan-2019 05:01:56 2019-01-15 05:01:56.319  INFO 7596 --- [           main] o.s.c.d.acceptance.test.WoodChuckTests   : Deploying stream 'WOODCHUCK-TEST' with properties: {app.log.logging.pattern.level=WOODCHUCK-${INSTANCE_INDEX:${CF_INSTANCE_INDEX:${spring.cloud.stream.instanceIndex:0}}} %5p, app.*.logging.file=${PID}-test.log, app.splitter.producer.partitionKeyExpression=payload, app.*.endpoints.logfile.sensitive=false, app.log.spring.cloud.stream.kafka.bindings.input.consumer.autoRebalanceEnabled=false, app.*.management.endpoints.web.exposure.include=*, deployer.log.count=2}
15-Jan-2019 05:01:56 2019-01-15 05:01:56.934  INFO 7596 --- [           main] o.s.c.d.acceptance.test.WoodChuckTests   : Checking: Stream=WOODCHUCK-TEST, status = deploying, status description = The stream is being deployed.
15-Jan-2019 05:01:56 2019-01-15 05:01:56.935  INFO 7596 --- [           main] o.s.c.d.acceptance.test.WoodChuckTests   : Sleeping to check status of Stream=WOODCHUCK-TEST
15-Jan-2019 05:02:06 2019-01-15 05:02:06.951  INFO 7596 --- [           main] o.s.c.d.acceptance.test.WoodChuckTests   : Checking: Stream=WOODCHUCK-TEST, status = deploying, status description = The stream is being deployed.
15-Jan-2019 05:02:06 2019-01-15 05:02:06.951  INFO 7596 --- [           main] o.s.c.d.acceptance.test.WoodChuckTests   : Sleeping to check status of Stream=WOODCHUCK-TEST
15-Jan-2019 05:02:16 2019-01-15 05:02:16.980  INFO 7596 --- [           main] o.s.c.d.acceptance.test.WoodChuckTests   : Checking: Stream=WOODCHUCK-TEST, status = deploying, status description = The stream is being deployed.
15-Jan-2019 05:02:16 2019-01-15 05:02:16.980  INFO 7596 --- [           main] o.s.c.d.acceptance.test.WoodChuckTests   : Sleeping to check status of Stream=WOODCHUCK-TEST
15-Jan-2019 05:02:27 2019-01-15 05:02:27.027  INFO 7596 --- [           main] o.s.c.d.acceptance.test.WoodChuckTests   : Checking: Stream=WOODCHUCK-TEST, status = deployed, status description = The stream has been successfully deployed
15-Jan-2019 05:02:27 2019-01-15 05:02:27.087  INFO 7596 --- [           main] o.s.c.d.acceptance.test.WoodChuckTests   : Sleeping to check status of Stream=WOODCHUCK-TEST
15-Jan-2019 05:02:37 2019-01-15 05:02:37.088  INFO 7596 --- [           main] o.s.c.d.acceptance.test.WoodChuckTests   : Stream 'WOODCHUCK-TEST' started with status: deployed
15-Jan-2019 05:02:37 2019-01-15 05:02:37.088  INFO 7596 --- [           main] o.s.c.d.acceptance.test.WoodChuckTests   : App 'log' has instances: {WOODCHUCK-TEST.log-0=http://10.194.6.21:29485, WOODCHUCK-TEST.log-1=http://10.194.6.21:21294}
15-Jan-2019 05:02:37 2019-01-15 05:02:37.088  INFO 7596 --- [           main] o.s.c.d.acceptance.test.WoodChuckTests   : App 'http' has instances: {WOODCHUCK-TEST.http-0=http://10.194.6.21:23741}
15-Jan-2019 05:02:37 2019-01-15 05:02:37.088  INFO 7596 --- [           main] o.s.c.d.acceptance.test.WoodChuckTests   : App 'splitter' has instances: {WOODCHUCK-TEST.splitter-0=http://10.194.6.21:35009}
15-Jan-2019 05:02:37 2019-01-15 05:02:37.088  INFO 7596 --- [           main] o.s.c.d.acceptance.test.WoodChuckTests   : Looking for 'Started HttpSource' in logfile for http
15-Jan-2019 05:02:47 2019-01-15 05:02:47.089  INFO 7596 --- [           main] o.s.c.d.acceptance.test.WoodChuckTests   : Requesting log for app WOODCHUCK-TEST.http-0
15-Jan-2019 05:02:47 2019-01-15 05:02:47.257  INFO 7596 --- [           main] o.s.c.d.acceptance.test.WoodChuckTests   : Retrieved logfile from 'http://10.194.6.21:23741/logfile
15-Jan-2019 05:02:47 2019-01-15 05:02:47.258  INFO 7596 --- [           main] o.s.c.d.acceptance.test.WoodChuckTests   : Matched all 'Started HttpSource' in logfile for instance WOODCHUCK-TEST.http-0 of app http
15-Jan-2019 05:02:47 2019-01-15 05:02:47.258  INFO 7596 --- [           main] o.s.c.d.acceptance.test.WoodChuckTests   : Looking for 'Started SplitterProcessor' in logfile for splitter
15-Jan-2019 05:02:57 2019-01-15 05:02:57.258  INFO 7596 --- [           main] o.s.c.d.acceptance.test.WoodChuckTests   : Requesting log for app WOODCHUCK-TEST.splitter-0
15-Jan-2019 05:02:57 2019-01-15 05:02:57.441  INFO 7596 --- [           main] o.s.c.d.acceptance.test.WoodChuckTests   : Retrieved logfile from 'http://10.194.6.21:35009/logfile
15-Jan-2019 05:02:57 2019-01-15 05:02:57.442  INFO 7596 --- [           main] o.s.c.d.acceptance.test.WoodChuckTests   : Matched all 'Started SplitterProcessor' in logfile for instance WOODCHUCK-TEST.splitter-0 of app splitter
15-Jan-2019 05:02:57 2019-01-15 05:02:57.442  INFO 7596 --- [           main] o.s.c.d.acceptance.test.WoodChuckTests   : Looking for 'Started LogSink' in logfile for log
15-Jan-2019 05:03:07 2019-01-15 05:03:07.442  INFO 7596 --- [           main] o.s.c.d.acceptance.test.WoodChuckTests   : Requesting log for app WOODCHUCK-TEST.log-0
15-Jan-2019 05:03:07 2019-01-15 05:03:07.598  INFO 7596 --- [           main] o.s.c.d.acceptance.test.WoodChuckTests   : Retrieved logfile from 'http://10.194.6.21:29485/logfile
15-Jan-2019 05:03:07 2019-01-15 05:03:07.598  INFO 7596 --- [           main] o.s.c.d.acceptance.test.WoodChuckTests   : Matched all 'Started LogSink' in logfile for instance WOODCHUCK-TEST.log-0 of app log
15-Jan-2019 05:03:07 2019-01-15 05:03:07.790  INFO 7596 --- [           main] o.s.c.d.acceptance.test.WoodChuckTests   : Looking for 'WOODCHUCK-0,How,chuck' in logfile for log
15-Jan-2019 05:03:17 2019-01-15 05:03:17.790  INFO 7596 --- [           main] o.s.c.d.acceptance.test.WoodChuckTests   : Requesting log for app WOODCHUCK-TEST.log-0
15-Jan-2019 05:03:17 2019-01-15 05:03:17.808  INFO 7596 --- [           main] o.s.c.d.acceptance.test.WoodChuckTests   : Retrieved logfile from 'http://10.194.6.21:29485/logfile
15-Jan-2019 05:03:17 2019-01-15 05:03:17.808  INFO 7596 --- [           main] o.s.c.d.acceptance.test.WoodChuckTests   : Matched all 'WOODCHUCK-0,How,chuck' in logfile for instance WOODCHUCK-TEST.log-0 of app log
15-Jan-2019 05:03:17 2019-01-15 05:03:17.808  INFO 7596 --- [           main] o.s.c.d.acceptance.test.WoodChuckTests   : Looking for 'WOODCHUCK-1,much,wood,would,if,a,woodchuck,could' in logfile for log
15-Jan-2019 05:03:27 2019-01-15 05:03:27.809  INFO 7596 --- [           main] o.s.c.d.acceptance.test.WoodChuckTests   : Requesting log for app WOODCHUCK-TEST.log-0
15-Jan-2019 05:03:27 2019-01-15 05:03:27.820  INFO 7596 --- [           main] o.s.c.d.acceptance.test.WoodChuckTests   : Retrieved logfile from 'http://10.194.6.21:29485/logfile
15-Jan-2019 05:03:27 2019-01-15 05:03:27.820  INFO 7596 --- [           main] o.s.c.d.acceptance.test.WoodChuckTests   : Requesting log for app WOODCHUCK-TEST.log-1
15-Jan-2019 05:03:27 2019-01-15 05:03:27.967  INFO 7596 --- [           main] o.s.c.d.acceptance.test.WoodChuckTests   : Retrieved logfile from 'http://10.194.6.21:21294/logfile
15-Jan-2019 05:03:27 2019-01-15 05:03:27.967  INFO 7596 --- [           main] o.s.c.d.acceptance.test.WoodChuckTests   : Matched all 'WOODCHUCK-1,much,wood,would,if,a,woodchuck,could' in logfile for instance WOODCHUCK-TEST.log-1 of app log
15-Jan-2019 05:03:27 2019-01-15 05:03:27.968  INFO 7596 --- [           main] junit.logTestName                        : Test testPartitioning(org.springframework.cloud.dataflow.acceptance.test.WoodChuckTests) Succeeded
15-Jan-2019 05:03:27 2019-01-15 05:03:27.968  INFO 7596 --- [           main] junit.logTestName                        : Finished Test testPartitioning(org.springframework.cloud.dataflow.acceptance.test.WoodChuckTests)
15-Jan-2019 05:03:27 2019-01-15 05:03:27.969  INFO 7596 --- [           main] o.s.c.d.acceptance.test.WoodChuckTests   : Destroy all streams
15-Jan-2019 05:03:28 Tests run: 1, Failures: 0, Errors: 0, Skipped: 0, Time elapsed: 91.853 sec - in org.springframework.cloud.dataflow.acceptance.test.WoodChuckTests
15-Jan-2019 05:03:28 Running org.springframework.cloud.dataflow.acceptance.test.HttpSourceTests
15-Jan-2019 05:03:28 2019-01-15 05:03:28.086  INFO 7596 --- [           main] .b.t.c.SpringBootTestContextBootstrapper : Neither @ContextConfiguration nor @ContextHierarchy found for test class [org.springframework.cloud.dataflow.acceptance.test.HttpSourceTests], using SpringBootContextLoader
15-Jan-2019 05:03:28 2019-01-15 05:03:28.092  INFO 7596 --- [           main] .b.t.c.SpringBootTestContextBootstrapper : Loaded default TestExecutionListener class names from location [META-INF/spring.factories]: [org.springframework.boot.test.mock.mockito.MockitoTestExecutionListener, org.springframework.boot.test.mock.mockito.ResetMocksTestExecutionListener, org.springframework.boot.test.autoconfigure.restdocs.RestDocsTestExecutionListener, org.springframework.boot.test.autoconfigure.web.client.MockRestServiceServerResetTestExecutionListener, org.springframework.boot.test.autoconfigure.web.servlet.MockMvcPrintOnlyOnFailureTestExecutionListener, org.springframework.boot.test.autoconfigure.web.servlet.WebDriverTestExecutionListener, org.springframework.test.context.web.ServletTestExecutionListener, org.springframework.test.context.support.DirtiesContextBeforeModesTestExecutionListener, org.springframework.test.context.support.DependencyInjectionTestExecutionListener, org.springframework.test.context.support.DirtiesContextTestExecutionListener, org.springframework.test.context.transaction.TransactionalTestExecutionListener, org.springframework.test.context.jdbc.SqlScriptsTestExecutionListener]
15-Jan-2019 05:03:28 2019-01-15 05:03:28.093  INFO 7596 --- [           main] .b.t.c.SpringBootTestContextBootstrapper : Using TestExecutionListeners: [org.springframework.test.context.web.ServletTestExecutionListener@459f703f, org.springframework.test.context.support.DirtiesContextBeforeModesTestExecutionListener@188ac8a3, org.springframework.boot.test.autoconfigure.SpringBootDependencyInjectionTestExecutionListener@3650d4fc, org.springframework.test.context.support.DirtiesContextTestExecutionListener@aaa0f76, org.springframework.test.context.transaction.TransactionalTestExecutionListener@340a8894, org.springframework.test.context.jdbc.SqlScriptsTestExecutionListener@7a8b9166, org.springframework.boot.test.autoconfigure.web.servlet.MockMvcPrintOnlyOnFailureTestExecutionListener@4acc5dff, org.springframework.boot.test.autoconfigure.web.client.MockRestServiceServerResetTestExecutionListener@10c72a6f, org.springframework.boot.test.mock.mockito.ResetMocksTestExecutionListener@70e94ecb, org.springframework.boot.test.autoconfigure.web.servlet.WebDriverTestExecutionListener@56cfe111, org.springframework.boot.test.autoconfigure.restdocs.RestDocsTestExecutionListener@7e446d92, org.springframework.boot.test.mock.mockito.MockitoTestExecutionListener@57f9b467]
15-Jan-2019 05:03:28 2019-01-15 05:03:28.137  INFO 7596 --- [           main] junit.logTestName                        : Starting Test httpSourceTests(org.springframework.cloud.dataflow.acceptance.test.HttpSourceTests)
15-Jan-2019 05:03:28 2019-01-15 05:03:28.142  INFO 7596 --- [           main] o.s.c.d.acceptance.test.HttpSourceTests  : Creating stream 'HTTP-TEST'
15-Jan-2019 05:03:28 2019-01-15 05:03:28.167  INFO 7596 --- [           main] o.s.c.d.acceptance.test.HttpSourceTests  : Deploying stream 'HTTP-TEST' with properties: {app.*.logging.file=${PID}-test.log, app.*.endpoints.logfile.sensitive=false, app.*.management.endpoints.web.exposure.include=*}
15-Jan-2019 05:03:28 2019-01-15 05:03:28.513  INFO 7596 --- [           main] o.s.c.d.acceptance.test.HttpSourceTests  : Checking: Stream=HTTP-TEST, status = deploying, status description = The stream is being deployed.
15-Jan-2019 05:03:28 2019-01-15 05:03:28.514  INFO 7596 --- [           main] o.s.c.d.acceptance.test.HttpSourceTests  : Sleeping to check status of Stream=HTTP-TEST
15-Jan-2019 05:03:38 2019-01-15 05:03:38.530  INFO 7596 --- [           main] o.s.c.d.acceptance.test.HttpSourceTests  : Checking: Stream=HTTP-TEST, status = deploying, status description = The stream is being deployed.
15-Jan-2019 05:03:38 2019-01-15 05:03:38.531  INFO 7596 --- [           main] o.s.c.d.acceptance.test.HttpSourceTests  : Sleeping to check status of Stream=HTTP-TEST
15-Jan-2019 05:03:48 2019-01-15 05:03:48.550  INFO 7596 --- [           main] o.s.c.d.acceptance.test.HttpSourceTests  : Checking: Stream=HTTP-TEST, status = deployed, status description = The stream has been successfully deployed
15-Jan-2019 05:03:48 2019-01-15 05:03:48.594  INFO 7596 --- [           main] o.s.c.d.acceptance.test.HttpSourceTests  : Sleeping to check status of Stream=HTTP-TEST
15-Jan-2019 05:03:58 2019-01-15 05:03:58.595  INFO 7596 --- [           main] o.s.c.d.acceptance.test.HttpSourceTests  : Stream 'HTTP-TEST' started with status: deployed
15-Jan-2019 05:03:58 2019-01-15 05:03:58.595  INFO 7596 --- [           main] o.s.c.d.acceptance.test.HttpSourceTests  : App 'log' has instances: {HTTP-TEST.log-0=http://10.194.6.21:23071}
15-Jan-2019 05:03:58 2019-01-15 05:03:58.595  INFO 7596 --- [           main] o.s.c.d.acceptance.test.HttpSourceTests  : App 'http' has instances: {HTTP-TEST.http-0=http://10.194.6.21:56636}
15-Jan-2019 05:03:58 2019-01-15 05:03:58.601  INFO 7596 --- [           main] o.s.c.d.acceptance.test.HttpSourceTests  : Looking for 'Started HttpSource' in logfile for http
15-Jan-2019 05:04:08 2019-01-15 05:04:08.602  INFO 7596 --- [           main] o.s.c.d.acceptance.test.HttpSourceTests  : Requesting log for app HTTP-TEST.http-0
15-Jan-2019 05:04:08 2019-01-15 05:04:08.774  INFO 7596 --- [           main] o.s.c.d.acceptance.test.HttpSourceTests  : Retrieved logfile from 'http://10.194.6.21:56636/logfile
15-Jan-2019 05:04:08 2019-01-15 05:04:08.775  INFO 7596 --- [           main] o.s.c.d.acceptance.test.HttpSourceTests  : Matched all 'Started HttpSource' in logfile for instance HTTP-TEST.http-0 of app http
15-Jan-2019 05:04:08 2019-01-15 05:04:08.775  INFO 7596 --- [           main] o.s.c.d.acceptance.test.HttpSourceTests  : Looking for 'Started LogSink' in logfile for log
15-Jan-2019 05:04:18 2019-01-15 05:04:18.775  INFO 7596 --- [           main] o.s.c.d.acceptance.test.HttpSourceTests  : Requesting log for app HTTP-TEST.log-0
15-Jan-2019 05:04:18 2019-01-15 05:04:18.934  INFO 7596 --- [           main] o.s.c.d.acceptance.test.HttpSourceTests  : Retrieved logfile from 'http://10.194.6.21:23071/logfile
15-Jan-2019 05:04:18 2019-01-15 05:04:18.934  INFO 7596 --- [           main] o.s.c.d.acceptance.test.HttpSourceTests  : Matched all 'Started LogSink' in logfile for instance HTTP-TEST.log-0 of app log
15-Jan-2019 05:04:19 2019-01-15 05:04:19.072  INFO 7596 --- [           main] o.s.c.d.acceptance.test.HttpSourceTests  : Looking for '090fd734-09a8-46c7-928d-748dda58edb5' in logfile for log
15-Jan-2019 05:04:29 2019-01-15 05:04:29.072  INFO 7596 --- [           main] o.s.c.d.acceptance.test.HttpSourceTests  : Requesting log for app HTTP-TEST.log-0
15-Jan-2019 05:04:29 2019-01-15 05:04:29.086  INFO 7596 --- [           main] o.s.c.d.acceptance.test.HttpSourceTests  : Retrieved logfile from 'http://10.194.6.21:23071/logfile
15-Jan-2019 05:04:29 2019-01-15 05:04:29.086  INFO 7596 --- [           main] o.s.c.d.acceptance.test.HttpSourceTests  : Matched all '090fd734-09a8-46c7-928d-748dda58edb5' in logfile for instance HTTP-TEST.log-0 of app log
15-Jan-2019 05:04:29 2019-01-15 05:04:29.088  INFO 7596 --- [           main] junit.logTestName                        : Test httpSourceTests(org.springframework.cloud.dataflow.acceptance.test.HttpSourceTests) Succeeded
15-Jan-2019 05:04:29 2019-01-15 05:04:29.088  INFO 7596 --- [           main] junit.logTestName                        : Finished Test httpSourceTests(org.springframework.cloud.dataflow.acceptance.test.HttpSourceTests)
15-Jan-2019 05:04:29 2019-01-15 05:04:29.088  INFO 7596 --- [           main] o.s.c.d.acceptance.test.HttpSourceTests  : Destroy all streams
15-Jan-2019 05:04:29 Tests run: 1, Failures: 0, Errors: 0, Skipped: 0, Time elapsed: 61.055 sec - in org.springframework.cloud.dataflow.acceptance.test.HttpSourceTests
15-Jan-2019 05:04:29 Running org.springframework.cloud.dataflow.acceptance.test.TimestampTaskTests
15-Jan-2019 05:04:29 2019-01-15 05:04:29.150  INFO 7596 --- [           main] o.s.c.support.GenericApplicationContext  : Refreshing org.springframework.context.support.GenericApplicationContext@2c7106d9: startup date [Tue Jan 15 05:04:29 UTC 2019]; root of context hierarchy
15-Jan-2019 05:04:29 2019-01-15 05:04:29.285  INFO 7596 --- [           main] junit.logTestName                        : Starting Test timeStampTests(org.springframework.cloud.dataflow.acceptance.test.TimestampTaskTests)
15-Jan-2019 05:04:29 2019-01-15 05:04:29.287  INFO 7596 --- [           main] o.s.c.d.a.test.AbstractTaskTests         : Importing task apps from uri resource: http://repo.spring.io/libs-release/org/springframework/cloud/task/app/spring-cloud-task-app-descriptor/Clark.RELEASE/spring-cloud-task-app-descriptor-Clark.RELEASE.task-apps-maven
15-Jan-2019 05:04:29 2019-01-15 05:04:29.475  INFO 7596 --- [           main] o.s.c.d.a.test.AbstractTaskTests         : Done importing task apps.
15-Jan-2019 05:04:39 2019-01-15 05:04:39.758  INFO 7596 --- [           main] junit.logTestName                        : Test timeStampTests(org.springframework.cloud.dataflow.acceptance.test.TimestampTaskTests) Succeeded
15-Jan-2019 05:04:39 2019-01-15 05:04:39.759  INFO 7596 --- [           main] junit.logTestName                        : Finished Test timeStampTests(org.springframework.cloud.dataflow.acceptance.test.TimestampTaskTests)
15-Jan-2019 05:04:39 2019-01-15 05:04:39.796  INFO 7596 --- [           main] junit.logTestName                        : Starting Test timeStampTestsMultipleLaunch(org.springframework.cloud.dataflow.acceptance.test.TimestampTaskTests)
15-Jan-2019 05:05:00 2019-01-15 05:05:00.152  INFO 7596 --- [           main] junit.logTestName                        : Test timeStampTestsMultipleLaunch(org.springframework.cloud.dataflow.acceptance.test.TimestampTaskTests) Succeeded
15-Jan-2019 05:05:00 2019-01-15 05:05:00.152  INFO 7596 --- [           main] junit.logTestName                        : Finished Test timeStampTestsMultipleLaunch(org.springframework.cloud.dataflow.acceptance.test.TimestampTaskTests)
15-Jan-2019 05:05:00 Tests run: 2, Failures: 0, Errors: 0, Skipped: 0, Time elapsed: 31.012 sec - in org.springframework.cloud.dataflow.acceptance.test.TimestampTaskTests
15-Jan-2019 05:05:00 Running org.springframework.cloud.dataflow.acceptance.test.TickTockTests
15-Jan-2019 05:05:00 2019-01-15 05:05:00.153  INFO 7596 --- [           main] .b.t.c.SpringBootTestContextBootstrapper : Neither @ContextConfiguration nor @ContextHierarchy found for test class [org.springframework.cloud.dataflow.acceptance.test.TickTockTests], using SpringBootContextLoader
15-Jan-2019 05:05:00 2019-01-15 05:05:00.163  INFO 7596 --- [           main] .b.t.c.SpringBootTestContextBootstrapper : Loaded default TestExecutionListener class names from location [META-INF/spring.factories]: [org.springframework.boot.test.mock.mockito.MockitoTestExecutionListener, org.springframework.boot.test.mock.mockito.ResetMocksTestExecutionListener, org.springframework.boot.test.autoconfigure.restdocs.RestDocsTestExecutionListener, org.springframework.boot.test.autoconfigure.web.client.MockRestServiceServerResetTestExecutionListener, org.springframework.boot.test.autoconfigure.web.servlet.MockMvcPrintOnlyOnFailureTestExecutionListener, org.springframework.boot.test.autoconfigure.web.servlet.WebDriverTestExecutionListener, org.springframework.test.context.web.ServletTestExecutionListener, org.springframework.test.context.support.DirtiesContextBeforeModesTestExecutionListener, org.springframework.test.context.support.DependencyInjectionTestExecutionListener, org.springframework.test.context.support.DirtiesContextTestExecutionListener, org.springframework.test.context.transaction.TransactionalTestExecutionListener, org.springframework.test.context.jdbc.SqlScriptsTestExecutionListener]
15-Jan-2019 05:05:00 2019-01-15 05:05:00.167  INFO 7596 --- [           main] .b.t.c.SpringBootTestContextBootstrapper : Using TestExecutionListeners: [org.springframework.test.context.web.ServletTestExecutionListener@3a894088, org.springframework.test.context.support.DirtiesContextBeforeModesTestExecutionListener@370c1968, org.springframework.boot.test.autoconfigure.SpringBootDependencyInjectionTestExecutionListener@2f0bfe17, org.springframework.test.context.support.DirtiesContextTestExecutionListener@3206174f, org.springframework.test.context.transaction.TransactionalTestExecutionListener@42fb8c87, org.springframework.test.context.jdbc.SqlScriptsTestExecutionListener@15eb0ae9, org.springframework.boot.test.autoconfigure.web.servlet.MockMvcPrintOnlyOnFailureTestExecutionListener@65e0b505, org.springframework.boot.test.autoconfigure.web.client.MockRestServiceServerResetTestExecutionListener@67de7a99, org.springframework.boot.test.mock.mockito.ResetMocksTestExecutionListener@795f5d51, org.springframework.boot.test.autoconfigure.web.servlet.WebDriverTestExecutionListener@34aeacd1, org.springframework.boot.test.autoconfigure.restdocs.RestDocsTestExecutionListener@54067fdc, org.springframework.boot.test.mock.mockito.MockitoTestExecutionListener@4098dd77]
15-Jan-2019 05:05:00 2019-01-15 05:05:00.214  INFO 7596 --- [           main] junit.logTestName                        : Starting Test tickTockUpdateRollbackTests(org.springframework.cloud.dataflow.acceptance.test.TickTockTests)
15-Jan-2019 05:05:00 2019-01-15 05:05:00.225  INFO 7596 --- [           main] junit.logTestName                        : Finished Test tickTockUpdateRollbackTests(org.springframework.cloud.dataflow.acceptance.test.TickTockTests)
15-Jan-2019 05:05:00 2019-01-15 05:05:00.225  INFO 7596 --- [           main] o.s.c.d.acceptance.test.TickTockTests    : Destroy all streams
15-Jan-2019 05:05:00 2019-01-15 05:05:00.279  INFO 7596 --- [           main] junit.logTestName                        : Starting Test tickTockTests(org.springframework.cloud.dataflow.acceptance.test.TickTockTests)
15-Jan-2019 05:05:00 2019-01-15 05:05:00.280  INFO 7596 --- [           main] o.s.c.d.acceptance.test.TickTockTests    : Creating stream 'TICKTOCK'
15-Jan-2019 05:05:00 2019-01-15 05:05:00.297  INFO 7596 --- [           main] o.s.c.d.acceptance.test.TickTockTests    : Deploying stream 'TICKTOCK' with properties: {app.*.logging.file=${PID}-test.log, app.*.endpoints.logfile.sensitive=false, app.log.log.expression='TICKTOCK - TIMESTAMP: '.concat(payload), app.*.management.endpoints.web.exposure.include=*}
15-Jan-2019 05:05:00 2019-01-15 05:05:00.609  INFO 7596 --- [           main] o.s.c.d.acceptance.test.TickTockTests    : Checking: Stream=TICKTOCK, status = deploying, status description = The stream is being deployed.
15-Jan-2019 05:05:00 2019-01-15 05:05:00.609  INFO 7596 --- [           main] o.s.c.d.acceptance.test.TickTockTests    : Sleeping to check status of Stream=TICKTOCK
15-Jan-2019 05:05:10 2019-01-15 05:05:10.620  INFO 7596 --- [           main] o.s.c.d.acceptance.test.TickTockTests    : Checking: Stream=TICKTOCK, status = deploying, status description = The stream is being deployed.
15-Jan-2019 05:05:10 2019-01-15 05:05:10.620  INFO 7596 --- [           main] o.s.c.d.acceptance.test.TickTockTests    : Sleeping to check status of Stream=TICKTOCK
15-Jan-2019 05:05:20 2019-01-15 05:05:20.636  INFO 7596 --- [           main] o.s.c.d.acceptance.test.TickTockTests    : Checking: Stream=TICKTOCK, status = deployed, status description = The stream has been successfully deployed
15-Jan-2019 05:05:20 2019-01-15 05:05:20.671  INFO 7596 --- [           main] o.s.c.d.acceptance.test.TickTockTests    : Sleeping to check status of Stream=TICKTOCK
15-Jan-2019 05:05:30 2019-01-15 05:05:30.672  INFO 7596 --- [           main] o.s.c.d.acceptance.test.TickTockTests    : Stream 'TICKTOCK' started with status: deployed
15-Jan-2019 05:05:30 2019-01-15 05:05:30.672  INFO 7596 --- [           main] o.s.c.d.acceptance.test.TickTockTests    : App 'log' has instances: {TICKTOCK.log-0=http://10.194.6.21:23362}
15-Jan-2019 05:05:30 2019-01-15 05:05:30.672  INFO 7596 --- [           main] o.s.c.d.acceptance.test.TickTockTests    : App 'time' has instances: {TICKTOCK.time-0=http://10.194.6.21:46713}
15-Jan-2019 05:05:30 2019-01-15 05:05:30.672  INFO 7596 --- [           main] o.s.c.d.acceptance.test.TickTockTests    : Looking for 'Started TimeSource' in logfile for time
15-Jan-2019 05:05:40 2019-01-15 05:05:40.673  INFO 7596 --- [           main] o.s.c.d.acceptance.test.TickTockTests    : Requesting log for app TICKTOCK.time-0
15-Jan-2019 05:05:40 2019-01-15 05:05:40.852  INFO 7596 --- [           main] o.s.c.d.acceptance.test.TickTockTests    : Retrieved logfile from 'http://10.194.6.21:46713/logfile
15-Jan-2019 05:05:40 2019-01-15 05:05:40.852  INFO 7596 --- [           main] o.s.c.d.acceptance.test.TickTockTests    : Matched all 'Started TimeSource' in logfile for instance TICKTOCK.time-0 of app time
15-Jan-2019 05:05:40 2019-01-15 05:05:40.852  INFO 7596 --- [           main] o.s.c.d.acceptance.test.TickTockTests    : Looking for 'Started LogSink' in logfile for log
15-Jan-2019 05:05:50 2019-01-15 05:05:50.853  INFO 7596 --- [           main] o.s.c.d.acceptance.test.TickTockTests    : Requesting log for app TICKTOCK.log-0
15-Jan-2019 05:05:51 2019-01-15 05:05:51.017  INFO 7596 --- [           main] o.s.c.d.acceptance.test.TickTockTests    : Retrieved logfile from 'http://10.194.6.21:23362/logfile
15-Jan-2019 05:05:51 2019-01-15 05:05:51.018  INFO 7596 --- [           main] o.s.c.d.acceptance.test.TickTockTests    : Matched all 'Started LogSink' in logfile for instance TICKTOCK.log-0 of app log
15-Jan-2019 05:05:51 2019-01-15 05:05:51.018  INFO 7596 --- [           main] o.s.c.d.acceptance.test.TickTockTests    : Looking for 'TICKTOCK - TIMESTAMP:' in logfile for log
15-Jan-2019 05:06:01 2019-01-15 05:06:01.018  INFO 7596 --- [           main] o.s.c.d.acceptance.test.TickTockTests    : Requesting log for app TICKTOCK.log-0
15-Jan-2019 05:06:01 2019-01-15 05:06:01.034  INFO 7596 --- [           main] o.s.c.d.acceptance.test.TickTockTests    : Retrieved logfile from 'http://10.194.6.21:23362/logfile
15-Jan-2019 05:06:01 2019-01-15 05:06:01.034  INFO 7596 --- [           main] o.s.c.d.acceptance.test.TickTockTests    : Matched all 'TICKTOCK - TIMESTAMP:' in logfile for instance TICKTOCK.log-0 of app log
15-Jan-2019 05:06:01 2019-01-15 05:06:01.036  INFO 7596 --- [           main] junit.logTestName                        : Test tickTockTests(org.springframework.cloud.dataflow.acceptance.test.TickTockTests) Succeeded
15-Jan-2019 05:06:01 2019-01-15 05:06:01.036  INFO 7596 --- [           main] junit.logTestName                        : Finished Test tickTockTests(org.springframework.cloud.dataflow.acceptance.test.TickTockTests)
15-Jan-2019 05:06:01 2019-01-15 05:06:01.036  INFO 7596 --- [           main] o.s.c.d.acceptance.test.TickTockTests    : Destroy all streams
15-Jan-2019 05:06:01 2019-01-15 05:06:01.121  INFO 7596 --- [           main] junit.logTestName                        : Starting Test tickTockTestsFromConfigServer(org.springframework.cloud.dataflow.acceptance.test.TickTockTests)
15-Jan-2019 05:06:01 2019-01-15 05:06:01.133  INFO 7596 --- [           main] junit.logTestName                        : Finished Test tickTockTestsFromConfigServer(org.springframework.cloud.dataflow.acceptance.test.TickTockTests)
15-Jan-2019 05:06:01 2019-01-15 05:06:01.133  INFO 7596 --- [           main] o.s.c.d.acceptance.test.TickTockTests    : Destroy all streams
15-Jan-2019 05:06:01 Tests run: 3, Failures: 0, Errors: 0, Skipped: 2, Time elapsed: 60.99 sec - in org.springframework.cloud.dataflow.acceptance.test.TickTockTests
15-Jan-2019 05:06:01 Running org.springframework.cloud.dataflow.acceptance.test.TransformTests
15-Jan-2019 05:06:01 2019-01-15 05:06:01.154  INFO 7596 --- [           main] .b.t.c.SpringBootTestContextBootstrapper : Neither @ContextConfiguration nor @ContextHierarchy found for test class [org.springframework.cloud.dataflow.acceptance.test.TransformTests], using SpringBootContextLoader
15-Jan-2019 05:06:01 2019-01-15 05:06:01.167  INFO 7596 --- [           main] .b.t.c.SpringBootTestContextBootstrapper : Loaded default TestExecutionListener class names from location [META-INF/spring.factories]: [org.springframework.boot.test.mock.mockito.MockitoTestExecutionListener, org.springframework.boot.test.mock.mockito.ResetMocksTestExecutionListener, org.springframework.boot.test.autoconfigure.restdocs.RestDocsTestExecutionListener, org.springframework.boot.test.autoconfigure.web.client.MockRestServiceServerResetTestExecutionListener, org.springframework.boot.test.autoconfigure.web.servlet.MockMvcPrintOnlyOnFailureTestExecutionListener, org.springframework.boot.test.autoconfigure.web.servlet.WebDriverTestExecutionListener, org.springframework.test.context.web.ServletTestExecutionListener, org.springframework.test.context.support.DirtiesContextBeforeModesTestExecutionListener, org.springframework.test.context.support.DependencyInjectionTestExecutionListener, org.springframework.test.context.support.DirtiesContextTestExecutionListener, org.springframework.test.context.transaction.TransactionalTestExecutionListener, org.springframework.test.context.jdbc.SqlScriptsTestExecutionListener]
15-Jan-2019 05:06:01 2019-01-15 05:06:01.179  INFO 7596 --- [           main] .b.t.c.SpringBootTestContextBootstrapper : Using TestExecutionListeners: [org.springframework.test.context.web.ServletTestExecutionListener@7a45d714, org.springframework.test.context.support.DirtiesContextBeforeModesTestExecutionListener@4483d35, org.springframework.boot.test.autoconfigure.SpringBootDependencyInjectionTestExecutionListener@204abeff, org.springframework.test.context.support.DirtiesContextTestExecutionListener@4b4ee511, org.springframework.test.context.transaction.TransactionalTestExecutionListener@1f67761b, org.springframework.test.context.jdbc.SqlScriptsTestExecutionListener@5a034157, org.springframework.boot.test.autoconfigure.web.servlet.MockMvcPrintOnlyOnFailureTestExecutionListener@2f4ba1ae, org.springframework.boot.test.autoconfigure.web.client.MockRestServiceServerResetTestExecutionListener@1391af3b, org.springframework.boot.test.mock.mockito.ResetMocksTestExecutionListener@3762c4fc, org.springframework.boot.test.autoconfigure.web.servlet.WebDriverTestExecutionListener@77ab22be, org.springframework.boot.test.autoconfigure.restdocs.RestDocsTestExecutionListener@59fbb34, org.springframework.boot.test.mock.mockito.MockitoTestExecutionListener@1b6924cb]
15-Jan-2019 05:06:01 2019-01-15 05:06:01.240  INFO 7596 --- [           main] junit.logTestName                        : Starting Test transformTests(org.springframework.cloud.dataflow.acceptance.test.TransformTests)
15-Jan-2019 05:06:01 2019-01-15 05:06:01.244  INFO 7596 --- [           main] o.s.c.d.acceptance.test.TransformTests   : Creating stream 'TRANSFORM-TEST'
15-Jan-2019 05:06:01 2019-01-15 05:06:01.263  INFO 7596 --- [           main] o.s.c.d.acceptance.test.TransformTests   : Deploying stream 'TRANSFORM-TEST' with properties: {app.*.logging.file=${PID}-test.log, app.*.endpoints.logfile.sensitive=false, app.*.management.endpoints.web.exposure.include=*}
15-Jan-2019 05:06:01 2019-01-15 05:06:01.754  INFO 7596 --- [           main] o.s.c.d.acceptance.test.TransformTests   : Checking: Stream=TRANSFORM-TEST, status = deploying, status description = The stream is being deployed.
15-Jan-2019 05:06:01 2019-01-15 05:06:01.754  INFO 7596 --- [           main] o.s.c.d.acceptance.test.TransformTests   : Sleeping to check status of Stream=TRANSFORM-TEST
15-Jan-2019 05:06:11 2019-01-15 05:06:11.782  INFO 7596 --- [           main] o.s.c.d.acceptance.test.TransformTests   : Checking: Stream=TRANSFORM-TEST, status = deploying, status description = The stream is being deployed.
15-Jan-2019 05:06:11 2019-01-15 05:06:11.782  INFO 7596 --- [           main] o.s.c.d.acceptance.test.TransformTests   : Sleeping to check status of Stream=TRANSFORM-TEST
15-Jan-2019 05:06:21 2019-01-15 05:06:21.798  INFO 7596 --- [           main] o.s.c.d.acceptance.test.TransformTests   : Checking: Stream=TRANSFORM-TEST, status = deploying, status description = The stream is being deployed.
15-Jan-2019 05:06:21 2019-01-15 05:06:21.799  INFO 7596 --- [           main] o.s.c.d.acceptance.test.TransformTests   : Sleeping to check status of Stream=TRANSFORM-TEST
15-Jan-2019 05:06:31 2019-01-15 05:06:31.814  INFO 7596 --- [           main] o.s.c.d.acceptance.test.TransformTests   : Checking: Stream=TRANSFORM-TEST, status = deployed, status description = The stream has been successfully deployed
15-Jan-2019 05:06:31 2019-01-15 05:06:31.866  INFO 7596 --- [           main] o.s.c.d.acceptance.test.TransformTests   : Sleeping to check status of Stream=TRANSFORM-TEST
15-Jan-2019 05:06:41 2019-01-15 05:06:41.867  INFO 7596 --- [           main] o.s.c.d.acceptance.test.TransformTests   : Stream 'TRANSFORM-TEST' started with status: deployed
15-Jan-2019 05:06:41 2019-01-15 05:06:41.867  INFO 7596 --- [           main] o.s.c.d.acceptance.test.TransformTests   : App 'transform' has instances: {TRANSFORM-TEST.transform-0=http://10.194.6.21:47818}
15-Jan-2019 05:06:41 2019-01-15 05:06:41.867  INFO 7596 --- [           main] o.s.c.d.acceptance.test.TransformTests   : App 'log' has instances: {TRANSFORM-TEST.log-0=http://10.194.6.21:33384}
15-Jan-2019 05:06:41 2019-01-15 05:06:41.867  INFO 7596 --- [           main] o.s.c.d.acceptance.test.TransformTests   : App 'http' has instances: {TRANSFORM-TEST.http-0=http://10.194.6.21:56633}
15-Jan-2019 05:06:41 2019-01-15 05:06:41.867  INFO 7596 --- [           main] o.s.c.d.acceptance.test.TransformTests   : Looking for 'Started HttpSource' in logfile for http
15-Jan-2019 05:06:51 2019-01-15 05:06:51.868  INFO 7596 --- [           main] o.s.c.d.acceptance.test.TransformTests   : Requesting log for app TRANSFORM-TEST.http-0
15-Jan-2019 05:06:52 2019-01-15 05:06:52.007  INFO 7596 --- [           main] o.s.c.d.acceptance.test.TransformTests   : Retrieved logfile from 'http://10.194.6.21:56633/logfile
15-Jan-2019 05:06:52 2019-01-15 05:06:52.008  INFO 7596 --- [           main] o.s.c.d.acceptance.test.TransformTests   : Matched all 'Started HttpSource' in logfile for instance TRANSFORM-TEST.http-0 of app http
15-Jan-2019 05:06:52 2019-01-15 05:06:52.139  INFO 7596 --- [           main] o.s.c.d.acceptance.test.TransformTests   : Looking for 'Started LogSink' in logfile for log
15-Jan-2019 05:07:02 2019-01-15 05:07:02.139  INFO 7596 --- [           main] o.s.c.d.acceptance.test.TransformTests   : Requesting log for app TRANSFORM-TEST.log-0
15-Jan-2019 05:07:02 2019-01-15 05:07:02.284  INFO 7596 --- [           main] o.s.c.d.acceptance.test.TransformTests   : Retrieved logfile from 'http://10.194.6.21:33384/logfile
15-Jan-2019 05:07:02 2019-01-15 05:07:02.285  INFO 7596 --- [           main] o.s.c.d.acceptance.test.TransformTests   : Matched all 'Started LogSink' in logfile for instance TRANSFORM-TEST.log-0 of app log
15-Jan-2019 05:07:02 2019-01-15 05:07:02.285  INFO 7596 --- [           main] o.s.c.d.acceptance.test.TransformTests   : Looking for 'ABCDEFG' in logfile for log
15-Jan-2019 05:07:12 2019-01-15 05:07:12.285  INFO 7596 --- [           main] o.s.c.d.acceptance.test.TransformTests   : Requesting log for app TRANSFORM-TEST.log-0
15-Jan-2019 05:07:12 2019-01-15 05:07:12.298  INFO 7596 --- [           main] o.s.c.d.acceptance.test.TransformTests   : Retrieved logfile from 'http://10.194.6.21:33384/logfile
15-Jan-2019 05:07:12 2019-01-15 05:07:12.298  INFO 7596 --- [           main] o.s.c.d.acceptance.test.TransformTests   : Matched all 'ABCDEFG' in logfile for instance TRANSFORM-TEST.log-0 of app log
15-Jan-2019 05:07:12 2019-01-15 05:07:12.300  INFO 7596 --- [           main] junit.logTestName                        : Test transformTests(org.springframework.cloud.dataflow.acceptance.test.TransformTests) Succeeded
15-Jan-2019 05:07:12 2019-01-15 05:07:12.300  INFO 7596 --- [           main] junit.logTestName                        : Finished Test transformTests(org.springframework.cloud.dataflow.acceptance.test.TransformTests)
15-Jan-2019 05:07:12 2019-01-15 05:07:12.300  INFO 7596 --- [           main] o.s.c.d.acceptance.test.TransformTests   : Destroy all streams
15-Jan-2019 05:07:12 Tests run: 1, Failures: 0, Errors: 0, Skipped: 0, Time elapsed: 71.388 sec - in org.springframework.cloud.dataflow.acceptance.test.TransformTests
15-Jan-2019 05:07:12 Running org.springframework.cloud.dataflow.acceptance.test.SchedulerTests
15-Jan-2019 05:07:12 2019-01-15 05:07:12.738  INFO 7596 --- [           main] s.c.a.AnnotationConfigApplicationContext : Refreshing org.springframework.context.annotation.AnnotationConfigApplicationContext@57ad1178: startup date [Tue Jan 15 05:07:12 UTC 2019]; root of context hierarchy
15-Jan-2019 05:07:12 2019-01-15 05:07:12.786  INFO 7596 --- [           main] trationDelegate$BeanPostProcessorChecker : Bean 'configurationPropertiesRebinderAutoConfiguration' of type [class org.springframework.cloud.autoconfigure.ConfigurationPropertiesRebinderAutoConfiguration$$EnhancerBySpringCGLIB$$44458212] is not eligible for getting processed by all BeanPostProcessors (for example: not eligible for auto-proxying)
15-Jan-2019 05:07:12
15-Jan-2019 05:07:12   .   ____          _            __ _ _
15-Jan-2019 05:07:12 /\\ / ___'_ __ _ _(_)_ __  __ _ \ \ \ \
15-Jan-2019 05:07:12 ( ( )\___ | '_ | '_| | '_ \/ _` | \ \ \ \
15-Jan-2019 05:07:12 \\/  ___)| |_)| | | | | || (_| |  ) ) ) )
15-Jan-2019 05:07:12   '  |____| .__|_| |_|_| |_\__, | / / / /
15-Jan-2019 05:07:12 =========|_|==============|___/=/_/_/_/
15-Jan-2019 05:07:12 :: Spring Boot ::        (v1.4.1.RELEASE)
15-Jan-2019 05:07:12
15-Jan-2019 05:07:12 2019-01-15 05:07:12.975  INFO 7596 --- [           main] c.c.c.ConfigServicePropertySourceLocator : Fetching config from server at: http://localhost:8888
15-Jan-2019 05:07:12 2019-01-15 05:07:12.989  WARN 7596 --- [           main] c.c.c.ConfigServicePropertySourceLocator : Could not locate PropertySource: I/O error on GET request for "http://localhost:8888//blah": Connection refused (Connection refused); nested exception is java.net.ConnectException: Connection refused (Connection refused)
15-Jan-2019 05:07:12 2019-01-15 05:07:12.990  INFO 7596 --- [           main] o.a.maven.surefire.booter.ForkedBooter   : The following profiles are active: blah
15-Jan-2019 05:07:13 2019-01-15 05:07:13.002  INFO 7596 --- [           main] s.c.a.AnnotationConfigApplicationContext : Refreshing org.springframework.context.annotation.AnnotationConfigApplicationContext@32ec9c90: startup date [Tue Jan 15 05:07:13 UTC 2019]; parent: org.springframework.context.annotation.AnnotationConfigApplicationContext@57ad1178
15-Jan-2019 05:07:13 2019-01-15 05:07:13.084  INFO 7596 --- [           main] o.a.maven.surefire.booter.ForkedBooter   : Started ForkedBooter in 0.537 seconds (JVM running for 381.004)
15-Jan-2019 05:07:13 2019-01-15 05:07:13.084  INFO 7596 --- [           main] s.c.a.AnnotationConfigApplicationContext : Closing org.springframework.context.annotation.AnnotationConfigApplicationContext@32ec9c90: startup date [Tue Jan 15 05:07:13 UTC 2019]; parent: org.springframework.context.annotation.AnnotationConfigApplicationContext@57ad1178
15-Jan-2019 05:07:13 2019-01-15 05:07:13.087 ERROR 7596 --- [           main] o.s.c.d.a.test.util.SchedulerRule        : SCHEDULER IS NOT AVAILABLE, SKIPPING TESTS
15-Jan-2019 05:07:13
15-Jan-2019 05:07:13 java.lang.IllegalArgumentException: no SchedulerOperations bean is available.  Skipping test.
15-Jan-2019 05:07:13         at org.springframework.util.Assert.notNull(Assert.java:115)
15-Jan-2019 05:07:13         at org.springframework.cloud.dataflow.acceptance.test.util.SchedulerRule.obtainResource(SchedulerRule.java:57)
15-Jan-2019 05:07:13         at org.springframework.cloud.scheduler.spi.junit.AbstractExternalResourceTestSupport.apply(AbstractExternalResourceTestSupport.java:58)
15-Jan-2019 05:07:13         at org.junit.rules.RunRules.applyAll(RunRules.java:26)
15-Jan-2019 05:07:13         at org.junit.rules.RunRules.<init>(RunRules.java:15)
15-Jan-2019 05:07:13         at org.junit.runners.ParentRunner.withClassRules(ParentRunner.java:245)
15-Jan-2019 05:07:13         at org.junit.runners.ParentRunner.classBlock(ParentRunner.java:194)
15-Jan-2019 05:07:13         at org.junit.runners.ParentRunner.run(ParentRunner.java:362)
15-Jan-2019 05:07:13         at org.springframework.test.context.junit4.SpringJUnit4ClassRunner.run(SpringJUnit4ClassRunner.java:191)
15-Jan-2019 05:07:13         at org.apache.maven.surefire.junit4.JUnit4Provider.execute(JUnit4Provider.java:283)
15-Jan-2019 05:07:13         at org.apache.maven.surefire.junit4.JUnit4Provider.executeWithRerun(JUnit4Provider.java:173)
15-Jan-2019 05:07:13         at org.apache.maven.surefire.junit4.JUnit4Provider.executeTestSet(JUnit4Provider.java:153)
15-Jan-2019 05:07:13         at org.apache.maven.surefire.junit4.JUnit4Provider.invoke(JUnit4Provider.java:128)
15-Jan-2019 05:07:13         at org.apache.maven.surefire.booter.ForkedBooter.invokeProviderInSameClassLoader(ForkedBooter.java:203)
15-Jan-2019 05:07:13         at org.apache.maven.surefire.booter.ForkedBooter.runSuitesInProcess(ForkedBooter.java:155)
15-Jan-2019 05:07:13         at org.apache.maven.surefire.booter.ForkedBooter.main(ForkedBooter.java:103)
15-Jan-2019 05:07:13
15-Jan-2019 05:07:13 Tests run: 1, Failures: 0, Errors: 0, Skipped: 1, Time elapsed: 0.547 sec - in org.springframework.cloud.dataflow.acceptance.test.SchedulerTests
15-Jan-2019 05:07:13 Running org.springframework.cloud.dataflow.acceptance.test.NamedChannelTests
15-Jan-2019 05:07:13 2019-01-15 05:07:13.090  INFO 7596 --- [           main] .b.t.c.SpringBootTestContextBootstrapper : Neither @ContextConfiguration nor @ContextHierarchy found for test class [org.springframework.cloud.dataflow.acceptance.test.NamedChannelTests], using SpringBootContextLoader
15-Jan-2019 05:07:13 2019-01-15 05:07:13.096  INFO 7596 --- [           main] .b.t.c.SpringBootTestContextBootstrapper : Loaded default TestExecutionListener class names from location [META-INF/spring.factories]: [org.springframework.boot.test.mock.mockito.MockitoTestExecutionListener, org.springframework.boot.test.mock.mockito.ResetMocksTestExecutionListener, org.springframework.boot.test.autoconfigure.restdocs.RestDocsTestExecutionListener, org.springframework.boot.test.autoconfigure.web.client.MockRestServiceServerResetTestExecutionListener, org.springframework.boot.test.autoconfigure.web.servlet.MockMvcPrintOnlyOnFailureTestExecutionListener, org.springframework.boot.test.autoconfigure.web.servlet.WebDriverTestExecutionListener, org.springframework.test.context.web.ServletTestExecutionListener, org.springframework.test.context.support.DirtiesContextBeforeModesTestExecutionListener, org.springframework.test.context.support.DependencyInjectionTestExecutionListener, org.springframework.test.context.support.DirtiesContextTestExecutionListener, org.springframework.test.context.transaction.TransactionalTestExecutionListener, org.springframework.test.context.jdbc.SqlScriptsTestExecutionListener]
15-Jan-2019 05:07:13 2019-01-15 05:07:13.100  INFO 7596 --- [           main] .b.t.c.SpringBootTestContextBootstrapper : Using TestExecutionListeners: [org.springframework.test.context.web.ServletTestExecutionListener@4faf104, org.springframework.test.context.support.DirtiesContextBeforeModesTestExecutionListener@5995851e, org.springframework.boot.test.autoconfigure.SpringBootDependencyInjectionTestExecutionListener@48a2db72, org.springframework.test.context.support.DirtiesContextTestExecutionListener@51bddd98, org.springframework.test.context.transaction.TransactionalTestExecutionListener@21c747a, org.springframework.test.context.jdbc.SqlScriptsTestExecutionListener@77d4ac52, org.springframework.boot.test.autoconfigure.web.servlet.MockMvcPrintOnlyOnFailureTestExecutionListener@29f38091, org.springframework.boot.test.autoconfigure.web.client.MockRestServiceServerResetTestExecutionListener@161dd92a, org.springframework.boot.test.mock.mockito.ResetMocksTestExecutionListener@77c3c037, org.springframework.boot.test.autoconfigure.web.servlet.WebDriverTestExecutionListener@252744a1, org.springframework.boot.test.autoconfigure.restdocs.RestDocsTestExecutionListener@10e5bf9c, org.springframework.boot.test.mock.mockito.MockitoTestExecutionListener@68c9e023]
15-Jan-2019 05:07:13 2019-01-15 05:07:13.139  INFO 7596 --- [           main] junit.logTestName                        : Starting Test testDestination(org.springframework.cloud.dataflow.acceptance.test.NamedChannelTests)
15-Jan-2019 05:07:13 2019-01-15 05:07:13.141  INFO 7596 --- [           main] o.s.c.d.a.test.NamedChannelTests         : Creating stream 'LOG-DESTINATION-SINK'
15-Jan-2019 05:07:13 2019-01-15 05:07:13.153  INFO 7596 --- [           main] o.s.c.d.a.test.NamedChannelTests         : Deploying stream 'LOG-DESTINATION-SINK' with properties: {app.*.logging.file=${PID}-test.log, app.*.endpoints.logfile.sensitive=false, app.*.management.endpoints.web.exposure.include=*}
15-Jan-2019 05:07:13 2019-01-15 05:07:13.295  INFO 7596 --- [           main] o.s.c.d.a.test.NamedChannelTests         : Checking: Stream=LOG-DESTINATION-SINK, status = deploying, status description = The stream is being deployed.
15-Jan-2019 05:07:13 2019-01-15 05:07:13.295  INFO 7596 --- [           main] o.s.c.d.a.test.NamedChannelTests         : Sleeping to check status of Stream=LOG-DESTINATION-SINK
15-Jan-2019 05:07:23 2019-01-15 05:07:23.309  INFO 7596 --- [           main] o.s.c.d.a.test.NamedChannelTests         : Checking: Stream=LOG-DESTINATION-SINK, status = deployed, status description = The stream has been successfully deployed
15-Jan-2019 05:07:23 2019-01-15 05:07:23.316  INFO 7596 --- [           main] o.s.c.d.a.test.NamedChannelTests         : Sleeping to check status of Stream=LOG-DESTINATION-SINK
15-Jan-2019 05:07:33 2019-01-15 05:07:33.317  INFO 7596 --- [           main] o.s.c.d.a.test.NamedChannelTests         : Stream 'LOG-DESTINATION-SINK' started with status: deployed
15-Jan-2019 05:07:33 2019-01-15 05:07:33.317  INFO 7596 --- [           main] o.s.c.d.a.test.NamedChannelTests         : App 'log' has instances: {LOG-DESTINATION-SINK.log-0=http://10.194.6.21:45229}
15-Jan-2019 05:07:33 2019-01-15 05:07:33.317  INFO 7596 --- [           main] o.s.c.d.a.test.NamedChannelTests         : Looking for 'Started LogSink' in logfile for log
15-Jan-2019 05:07:43 2019-01-15 05:07:43.317  INFO 7596 --- [           main] o.s.c.d.a.test.NamedChannelTests         : Requesting log for app LOG-DESTINATION-SINK.log-0
15-Jan-2019 05:07:43 2019-01-15 05:07:43.473  INFO 7596 --- [           main] o.s.c.d.a.test.NamedChannelTests         : Retrieved logfile from 'http://10.194.6.21:45229/logfile
15-Jan-2019 05:07:43 2019-01-15 05:07:43.474  INFO 7596 --- [           main] o.s.c.d.a.test.NamedChannelTests         : Matched all 'Started LogSink' in logfile for instance LOG-DESTINATION-SINK.log-0 of app log
15-Jan-2019 05:07:43 2019-01-15 05:07:43.474  INFO 7596 --- [           main] o.s.c.d.a.test.NamedChannelTests         : Creating stream 'HTTP-DESTINATION-SOURCE'
15-Jan-2019 05:07:43 2019-01-15 05:07:43.497  INFO 7596 --- [           main] o.s.c.d.a.test.NamedChannelTests         : Deploying stream 'HTTP-DESTINATION-SOURCE' with properties: {app.*.logging.file=${PID}-test.log, app.*.endpoints.logfile.sensitive=false, app.*.management.endpoints.web.exposure.include=*}
15-Jan-2019 05:07:43 2019-01-15 05:07:43.638  INFO 7596 --- [           main] o.s.c.d.a.test.NamedChannelTests         : Checking: Stream=HTTP-DESTINATION-SOURCE, status = deploying, status description = The stream is being deployed.
15-Jan-2019 05:07:43 2019-01-15 05:07:43.638  INFO 7596 --- [           main] o.s.c.d.a.test.NamedChannelTests         : Sleeping to check status of Stream=HTTP-DESTINATION-SOURCE
15-Jan-2019 05:07:53 2019-01-15 05:07:53.648  INFO 7596 --- [           main] o.s.c.d.a.test.NamedChannelTests         : Checking: Stream=HTTP-DESTINATION-SOURCE, status = deployed, status description = The stream has been successfully deployed
15-Jan-2019 05:07:53 2019-01-15 05:07:53.658  INFO 7596 --- [           main] o.s.c.d.a.test.NamedChannelTests         : Sleeping to check status of Stream=HTTP-DESTINATION-SOURCE
15-Jan-2019 05:08:03 2019-01-15 05:08:03.658  INFO 7596 --- [           main] o.s.c.d.a.test.NamedChannelTests         : Stream 'HTTP-DESTINATION-SOURCE' started with status: deployed
15-Jan-2019 05:08:03 2019-01-15 05:08:03.658  INFO 7596 --- [           main] o.s.c.d.a.test.NamedChannelTests         : App 'http' has instances: {HTTP-DESTINATION-SOURCE.http-0=http://10.194.6.21:28192}
15-Jan-2019 05:08:03 2019-01-15 05:08:03.658  INFO 7596 --- [           main] o.s.c.d.a.test.NamedChannelTests         : Looking for 'Started HttpSource' in logfile for http
15-Jan-2019 05:08:13 2019-01-15 05:08:13.659  INFO 7596 --- [           main] o.s.c.d.a.test.NamedChannelTests         : Requesting log for app HTTP-DESTINATION-SOURCE.http-0
15-Jan-2019 05:08:13 2019-01-15 05:08:13.832  INFO 7596 --- [           main] o.s.c.d.a.test.NamedChannelTests         : Retrieved logfile from 'http://10.194.6.21:28192/logfile
15-Jan-2019 05:08:13 2019-01-15 05:08:13.832  INFO 7596 --- [           main] o.s.c.d.a.test.NamedChannelTests         : Matched all 'Started HttpSource' in logfile for instance HTTP-DESTINATION-SOURCE.http-0 of app http
15-Jan-2019 05:08:13 2019-01-15 05:08:13.972  INFO 7596 --- [           main] o.s.c.d.a.test.NamedChannelTests         : Looking for 'abcdefg' in logfile for log
15-Jan-2019 05:08:23 2019-01-15 05:08:23.972  INFO 7596 --- [           main] o.s.c.d.a.test.NamedChannelTests         : Requesting log for app LOG-DESTINATION-SINK.log-0
15-Jan-2019 05:08:23 2019-01-15 05:08:23.985  INFO 7596 --- [           main] o.s.c.d.a.test.NamedChannelTests         : Retrieved logfile from 'http://10.194.6.21:45229/logfile
15-Jan-2019 05:08:23 2019-01-15 05:08:23.985  INFO 7596 --- [           main] o.s.c.d.a.test.NamedChannelTests         : Matched all 'abcdefg' in logfile for instance LOG-DESTINATION-SINK.log-0 of app log
15-Jan-2019 05:08:23 2019-01-15 05:08:23.987  INFO 7596 --- [           main] junit.logTestName                        : Test testDestination(org.springframework.cloud.dataflow.acceptance.test.NamedChannelTests) Succeeded
15-Jan-2019 05:08:23 2019-01-15 05:08:23.987  INFO 7596 --- [           main] junit.logTestName                        : Finished Test testDestination(org.springframework.cloud.dataflow.acceptance.test.NamedChannelTests)
15-Jan-2019 05:08:23 2019-01-15 05:08:23.987  INFO 7596 --- [           main] o.s.c.d.a.test.NamedChannelTests         : Destroy all streams
15-Jan-2019 05:08:24 2019-01-15 05:08:24.097  INFO 7596 --- [           main] junit.logTestName                        : Starting Test testTap(org.springframework.cloud.dataflow.acceptance.test.NamedChannelTests)
15-Jan-2019 05:08:24 2019-01-15 05:08:24.106  INFO 7596 --- [           main] o.s.c.d.a.test.NamedChannelTests         : Creating stream 'TAPHTTP'
15-Jan-2019 05:08:24 2019-01-15 05:08:24.121  INFO 7596 --- [           main] o.s.c.d.a.test.NamedChannelTests         : Deploying stream 'TAPHTTP' with properties: {app.*.logging.file=${PID}-test.log, app.*.endpoints.logfile.sensitive=false, app.*.management.endpoints.web.exposure.include=*}
15-Jan-2019 05:08:24 2019-01-15 05:08:24.437  INFO 7596 --- [           main] o.s.c.d.a.test.NamedChannelTests         : Checking: Stream=TAPHTTP, status = deploying, status description = The stream is being deployed.
15-Jan-2019 05:08:24 2019-01-15 05:08:24.438  INFO 7596 --- [           main] o.s.c.d.a.test.NamedChannelTests         : Sleeping to check status of Stream=TAPHTTP
15-Jan-2019 05:08:34 2019-01-15 05:08:34.451  INFO 7596 --- [           main] o.s.c.d.a.test.NamedChannelTests         : Checking: Stream=TAPHTTP, status = deploying, status description = The stream is being deployed.
15-Jan-2019 05:08:34 2019-01-15 05:08:34.451  INFO 7596 --- [           main] o.s.c.d.a.test.NamedChannelTests         : Sleeping to check status of Stream=TAPHTTP
15-Jan-2019 05:08:44 2019-01-15 05:08:44.469  INFO 7596 --- [           main] o.s.c.d.a.test.NamedChannelTests         : Checking: Stream=TAPHTTP, status = deployed, status description = The stream has been successfully deployed
15-Jan-2019 05:08:44 2019-01-15 05:08:44.500  INFO 7596 --- [           main] o.s.c.d.a.test.NamedChannelTests         : Sleeping to check status of Stream=TAPHTTP
15-Jan-2019 05:08:54 2019-01-15 05:08:54.500  INFO 7596 --- [           main] o.s.c.d.a.test.NamedChannelTests         : Stream 'TAPHTTP' started with status: deployed
15-Jan-2019 05:08:54 2019-01-15 05:08:54.501  INFO 7596 --- [           main] o.s.c.d.a.test.NamedChannelTests         : App 'log' has instances: {TAPHTTP.log-0=http://10.194.6.21:49782}
15-Jan-2019 05:08:54 2019-01-15 05:08:54.501  INFO 7596 --- [           main] o.s.c.d.a.test.NamedChannelTests         : App 'http' has instances: {TAPHTTP.http-0=http://10.194.6.21:60382}
15-Jan-2019 05:08:54 2019-01-15 05:08:54.501  INFO 7596 --- [           main] o.s.c.d.a.test.NamedChannelTests         : Looking for 'Started HttpSource' in logfile for http
15-Jan-2019 05:09:04 2019-01-15 05:09:04.502  INFO 7596 --- [           main] o.s.c.d.a.test.NamedChannelTests         : Requesting log for app TAPHTTP.http-0
15-Jan-2019 05:09:04 2019-01-15 05:09:04.659  INFO 7596 --- [           main] o.s.c.d.a.test.NamedChannelTests         : Retrieved logfile from 'http://10.194.6.21:60382/logfile
15-Jan-2019 05:09:04 2019-01-15 05:09:04.659  INFO 7596 --- [           main] o.s.c.d.a.test.NamedChannelTests         : Matched all 'Started HttpSource' in logfile for instance TAPHTTP.http-0 of app http
15-Jan-2019 05:09:04 2019-01-15 05:09:04.659  INFO 7596 --- [           main] o.s.c.d.a.test.NamedChannelTests         : Looking for 'Started LogSink' in logfile for log
15-Jan-2019 05:09:14 2019-01-15 05:09:14.659  INFO 7596 --- [           main] o.s.c.d.a.test.NamedChannelTests         : Requesting log for app TAPHTTP.log-0
15-Jan-2019 05:09:14 2019-01-15 05:09:14.828  INFO 7596 --- [           main] o.s.c.d.a.test.NamedChannelTests         : Retrieved logfile from 'http://10.194.6.21:49782/logfile
15-Jan-2019 05:09:14 2019-01-15 05:09:14.828  INFO 7596 --- [           main] o.s.c.d.a.test.NamedChannelTests         : Matched all 'Started LogSink' in logfile for instance TAPHTTP.log-0 of app log
15-Jan-2019 05:09:14 2019-01-15 05:09:14.829  INFO 7596 --- [           main] o.s.c.d.a.test.NamedChannelTests         : Creating stream 'TAPSTREAM'
15-Jan-2019 05:09:14 2019-01-15 05:09:14.845  INFO 7596 --- [           main] o.s.c.d.a.test.NamedChannelTests         : Deploying stream 'TAPSTREAM' with properties: {app.*.logging.file=${PID}-test.log, app.*.endpoints.logfile.sensitive=false, app.*.management.endpoints.web.exposure.include=*}
15-Jan-2019 05:09:14 2019-01-15 05:09:14.986  INFO 7596 --- [           main] o.s.c.d.a.test.NamedChannelTests         : Checking: Stream=TAPSTREAM, status = deploying, status description = The stream is being deployed.
15-Jan-2019 05:09:14 2019-01-15 05:09:14.986  INFO 7596 --- [           main] o.s.c.d.a.test.NamedChannelTests         : Sleeping to check status of Stream=TAPSTREAM
15-Jan-2019 05:09:24 2019-01-15 05:09:24.998  INFO 7596 --- [           main] o.s.c.d.a.test.NamedChannelTests         : Checking: Stream=TAPSTREAM, status = deployed, status description = The stream has been successfully deployed
15-Jan-2019 05:09:25 2019-01-15 05:09:25.021  INFO 7596 --- [           main] o.s.c.d.a.test.NamedChannelTests         : Sleeping to check status of Stream=TAPSTREAM
15-Jan-2019 05:09:35 2019-01-15 05:09:35.022  INFO 7596 --- [           main] o.s.c.d.a.test.NamedChannelTests         : Stream 'TAPSTREAM' started with status: deployed
15-Jan-2019 05:09:35 2019-01-15 05:09:35.022  INFO 7596 --- [           main] o.s.c.d.a.test.NamedChannelTests         : App 'log' has instances: {TAPSTREAM.log-0=http://10.194.6.21:35059}
15-Jan-2019 05:09:35 2019-01-15 05:09:35.022  INFO 7596 --- [           main] o.s.c.d.a.test.NamedChannelTests         : Looking for 'Started LogSink' in logfile for log
15-Jan-2019 05:09:45 2019-01-15 05:09:45.022  INFO 7596 --- [           main] o.s.c.d.a.test.NamedChannelTests         : Requesting log for app TAPSTREAM.log-0
15-Jan-2019 05:09:45 2019-01-15 05:09:45.204  INFO 7596 --- [           main] o.s.c.d.a.test.NamedChannelTests         : Retrieved logfile from 'http://10.194.6.21:35059/logfile
15-Jan-2019 05:09:45 2019-01-15 05:09:45.204  INFO 7596 --- [           main] o.s.c.d.a.test.NamedChannelTests         : Matched all 'Started LogSink' in logfile for instance TAPSTREAM.log-0 of app log
15-Jan-2019 05:09:45 2019-01-15 05:09:45.339  INFO 7596 --- [           main] o.s.c.d.a.test.NamedChannelTests         : Looking for 'abcdefg' in logfile for log
15-Jan-2019 05:09:55 2019-01-15 05:09:55.340  INFO 7596 --- [           main] o.s.c.d.a.test.NamedChannelTests         : Requesting log for app TAPSTREAM.log-0
15-Jan-2019 05:09:55 2019-01-15 05:09:55.354  INFO 7596 --- [           main] o.s.c.d.a.test.NamedChannelTests         : Retrieved logfile from 'http://10.194.6.21:35059/logfile
15-Jan-2019 05:09:55 2019-01-15 05:09:55.354  INFO 7596 --- [           main] o.s.c.d.a.test.NamedChannelTests         : Matched all 'abcdefg' in logfile for instance TAPSTREAM.log-0 of app log
15-Jan-2019 05:09:55 2019-01-15 05:09:55.355  INFO 7596 --- [           main] junit.logTestName                        : Test testTap(org.springframework.cloud.dataflow.acceptance.test.NamedChannelTests) Succeeded
15-Jan-2019 05:09:55 2019-01-15 05:09:55.356  INFO 7596 --- [           main] junit.logTestName                        : Finished Test testTap(org.springframework.cloud.dataflow.acceptance.test.NamedChannelTests)
15-Jan-2019 05:09:55 2019-01-15 05:09:55.356  INFO 7596 --- [           main] o.s.c.d.a.test.NamedChannelTests         : Destroy all streams
15-Jan-2019 05:09:55 2019-01-15 05:09:55.463  INFO 7596 --- [           main] junit.logTestName                        : Starting Test manyToOneTest(org.springframework.cloud.dataflow.acceptance.test.NamedChannelTests)
15-Jan-2019 05:09:55 2019-01-15 05:09:55.464  INFO 7596 --- [           main] o.s.c.d.a.test.NamedChannelTests         : Creating stream 'MANY-TO-ONE'
15-Jan-2019 05:09:55 2019-01-15 05:09:55.502  INFO 7596 --- [           main] o.s.c.d.a.test.NamedChannelTests         : Deploying stream 'MANY-TO-ONE' with properties: {app.*.logging.file=${PID}-test.log, app.*.endpoints.logfile.sensitive=false, app.*.management.endpoints.web.exposure.include=*}
15-Jan-2019 05:09:55 2019-01-15 05:09:55.699  INFO 7596 --- [           main] o.s.c.d.a.test.NamedChannelTests         : Checking: Stream=MANY-TO-ONE, status = deploying, status description = The stream is being deployed.
15-Jan-2019 05:09:55 2019-01-15 05:09:55.699  INFO 7596 --- [           main] o.s.c.d.a.test.NamedChannelTests         : Sleeping to check status of Stream=MANY-TO-ONE
15-Jan-2019 05:10:05 2019-01-15 05:10:05.707  INFO 7596 --- [           main] o.s.c.d.a.test.NamedChannelTests         : Checking: Stream=MANY-TO-ONE, status = deployed, status description = The stream has been successfully deployed
15-Jan-2019 05:10:05 2019-01-15 05:10:05.716  INFO 7596 --- [           main] o.s.c.d.a.test.NamedChannelTests         : Sleeping to check status of Stream=MANY-TO-ONE
15-Jan-2019 05:10:15 2019-01-15 05:10:15.716  INFO 7596 --- [           main] o.s.c.d.a.test.NamedChannelTests         : Stream 'MANY-TO-ONE' started with status: deployed
15-Jan-2019 05:10:15 2019-01-15 05:10:15.716  INFO 7596 --- [           main] o.s.c.d.a.test.NamedChannelTests         : App 'log' has instances: {MANY-TO-ONE.log-0=http://10.194.6.21:24399}
15-Jan-2019 05:10:15 2019-01-15 05:10:15.716  INFO 7596 --- [           main] o.s.c.d.a.test.NamedChannelTests         : Looking for 'Started LogSink' in logfile for log
15-Jan-2019 05:10:25 2019-01-15 05:10:25.716  INFO 7596 --- [           main] o.s.c.d.a.test.NamedChannelTests         : Requesting log for app MANY-TO-ONE.log-0
15-Jan-2019 05:10:25 2019-01-15 05:10:25.901  INFO 7596 --- [           main] o.s.c.d.a.test.NamedChannelTests         : Retrieved logfile from 'http://10.194.6.21:24399/logfile
15-Jan-2019 05:10:25 2019-01-15 05:10:25.901  INFO 7596 --- [           main] o.s.c.d.a.test.NamedChannelTests         : Matched all 'Started LogSink' in logfile for instance MANY-TO-ONE.log-0 of app log
15-Jan-2019 05:10:25 2019-01-15 05:10:25.901  INFO 7596 --- [           main] o.s.c.d.a.test.NamedChannelTests         : Creating stream 'HTTP-SOURCE-1'
15-Jan-2019 05:10:25 2019-01-15 05:10:25.913  INFO 7596 --- [           main] o.s.c.d.a.test.NamedChannelTests         : Deploying stream 'HTTP-SOURCE-1' with properties: {app.*.logging.file=${PID}-test.log, app.*.endpoints.logfile.sensitive=false, app.*.management.endpoints.web.exposure.include=*}
15-Jan-2019 05:10:26 2019-01-15 05:10:26.099  INFO 7596 --- [           main] o.s.c.d.a.test.NamedChannelTests         : Checking: Stream=HTTP-SOURCE-1, status = deploying, status description = The stream is being deployed.
15-Jan-2019 05:10:26 2019-01-15 05:10:26.099  INFO 7596 --- [           main] o.s.c.d.a.test.NamedChannelTests         : Sleeping to check status of Stream=HTTP-SOURCE-1
15-Jan-2019 05:10:36 2019-01-15 05:10:36.107  INFO 7596 --- [           main] o.s.c.d.a.test.NamedChannelTests         : Checking: Stream=HTTP-SOURCE-1, status = deployed, status description = The stream has been successfully deployed
15-Jan-2019 05:10:36 2019-01-15 05:10:36.120  INFO 7596 --- [           main] o.s.c.d.a.test.NamedChannelTests         : Sleeping to check status of Stream=HTTP-SOURCE-1
15-Jan-2019 05:10:46 2019-01-15 05:10:46.120  INFO 7596 --- [           main] o.s.c.d.a.test.NamedChannelTests         : Stream 'HTTP-SOURCE-1' started with status: deployed
15-Jan-2019 05:10:46 2019-01-15 05:10:46.120  INFO 7596 --- [           main] o.s.c.d.a.test.NamedChannelTests         : App 'http' has instances: {HTTP-SOURCE-1.http-0=http://10.194.6.21:27363}
15-Jan-2019 05:10:46 2019-01-15 05:10:46.120  INFO 7596 --- [           main] o.s.c.d.a.test.NamedChannelTests         : Looking for 'Started HttpSource' in logfile for http
15-Jan-2019 05:10:56 2019-01-15 05:10:56.120  INFO 7596 --- [           main] o.s.c.d.a.test.NamedChannelTests         : Requesting log for app HTTP-SOURCE-1.http-0
15-Jan-2019 05:10:56 2019-01-15 05:10:56.296  INFO 7596 --- [           main] o.s.c.d.a.test.NamedChannelTests         : Retrieved logfile from 'http://10.194.6.21:27363/logfile
15-Jan-2019 05:10:56 2019-01-15 05:10:56.296  INFO 7596 --- [           main] o.s.c.d.a.test.NamedChannelTests         : Matched all 'Started HttpSource' in logfile for instance HTTP-SOURCE-1.http-0 of app http
15-Jan-2019 05:10:56 2019-01-15 05:10:56.296  INFO 7596 --- [           main] o.s.c.d.a.test.NamedChannelTests         : Creating stream 'HTTP-SOURCE-2'
15-Jan-2019 05:10:56 2019-01-15 05:10:56.307  INFO 7596 --- [           main] o.s.c.d.a.test.NamedChannelTests         : Deploying stream 'HTTP-SOURCE-2' with properties: {app.*.logging.file=${PID}-test.log, app.*.endpoints.logfile.sensitive=false, app.*.management.endpoints.web.exposure.include=*}
15-Jan-2019 05:10:56 2019-01-15 05:10:56.465  INFO 7596 --- [           main] o.s.c.d.a.test.NamedChannelTests         : Checking: Stream=HTTP-SOURCE-2, status = deploying, status description = The stream is being deployed.
15-Jan-2019 05:10:56 2019-01-15 05:10:56.465  INFO 7596 --- [           main] o.s.c.d.a.test.NamedChannelTests         : Sleeping to check status of Stream=HTTP-SOURCE-2
15-Jan-2019 05:11:06 2019-01-15 05:11:06.479  INFO 7596 --- [           main] o.s.c.d.a.test.NamedChannelTests         : Checking: Stream=HTTP-SOURCE-2, status = deployed, status description = The stream has been successfully deployed
15-Jan-2019 05:11:06 2019-01-15 05:11:06.512  INFO 7596 --- [           main] o.s.c.d.a.test.NamedChannelTests         : Sleeping to check status of Stream=HTTP-SOURCE-2
15-Jan-2019 05:11:16 2019-01-15 05:11:16.512  INFO 7596 --- [           main] o.s.c.d.a.test.NamedChannelTests         : Stream 'HTTP-SOURCE-2' started with status: deployed
15-Jan-2019 05:11:16 2019-01-15 05:11:16.512  INFO 7596 --- [           main] o.s.c.d.a.test.NamedChannelTests         : App 'http' has instances: {HTTP-SOURCE-2.http-0=http://10.194.6.21:50348}
15-Jan-2019 05:11:16 2019-01-15 05:11:16.512  INFO 7596 --- [           main] o.s.c.d.a.test.NamedChannelTests         : Looking for 'Started HttpSource' in logfile for http
15-Jan-2019 05:11:26 2019-01-15 05:11:26.512  INFO 7596 --- [           main] o.s.c.d.a.test.NamedChannelTests         : Requesting log for app HTTP-SOURCE-2.http-0
15-Jan-2019 05:11:26 2019-01-15 05:11:26.698  INFO 7596 --- [           main] o.s.c.d.a.test.NamedChannelTests         : Retrieved logfile from 'http://10.194.6.21:50348/logfile
15-Jan-2019 05:11:26 2019-01-15 05:11:26.698  INFO 7596 --- [           main] o.s.c.d.a.test.NamedChannelTests         : Matched all 'Started HttpSource' in logfile for instance HTTP-SOURCE-2.http-0 of app http
15-Jan-2019 05:11:26 2019-01-15 05:11:26.862  INFO 7596 --- [           main] o.s.c.d.a.test.NamedChannelTests         : Looking for 'abcdefg' in logfile for log
15-Jan-2019 05:11:36 2019-01-15 05:11:36.863  INFO 7596 --- [           main] o.s.c.d.a.test.NamedChannelTests         : Requesting log for app MANY-TO-ONE.log-0
15-Jan-2019 05:11:36 2019-01-15 05:11:36.876  INFO 7596 --- [           main] o.s.c.d.a.test.NamedChannelTests         : Retrieved logfile from 'http://10.194.6.21:24399/logfile
15-Jan-2019 05:11:36 2019-01-15 05:11:36.876  INFO 7596 --- [           main] o.s.c.d.a.test.NamedChannelTests         : Matched all 'abcdefg' in logfile for instance MANY-TO-ONE.log-0 of app log
15-Jan-2019 05:11:37 2019-01-15 05:11:37.013  INFO 7596 --- [           main] o.s.c.d.a.test.NamedChannelTests         : Looking for 'hijklmn' in logfile for log
15-Jan-2019 05:11:47 2019-01-15 05:11:47.013  INFO 7596 --- [           main] o.s.c.d.a.test.NamedChannelTests         : Requesting log for app MANY-TO-ONE.log-0
15-Jan-2019 05:11:47 2019-01-15 05:11:47.024  INFO 7596 --- [           main] o.s.c.d.a.test.NamedChannelTests         : Retrieved logfile from 'http://10.194.6.21:24399/logfile
15-Jan-2019 05:11:47 2019-01-15 05:11:47.024  INFO 7596 --- [           main] o.s.c.d.a.test.NamedChannelTests         : Matched all 'hijklmn' in logfile for instance MANY-TO-ONE.log-0 of app log
15-Jan-2019 05:11:47 2019-01-15 05:11:47.026  INFO 7596 --- [           main] junit.logTestName                        : Test manyToOneTest(org.springframework.cloud.dataflow.acceptance.test.NamedChannelTests) Succeeded
15-Jan-2019 05:11:47 2019-01-15 05:11:47.026  INFO 7596 --- [           main] junit.logTestName                        : Finished Test manyToOneTest(org.springframework.cloud.dataflow.acceptance.test.NamedChannelTests)
15-Jan-2019 05:11:47 2019-01-15 05:11:47.026  INFO 7596 --- [           main] o.s.c.d.a.test.NamedChannelTests         : Destroy all streams
15-Jan-2019 05:11:47 2019-01-15 05:11:47.160  INFO 7596 --- [           main] junit.logTestName                        : Starting Test directedGraphTest(org.springframework.cloud.dataflow.acceptance.test.NamedChannelTests)
15-Jan-2019 05:11:47 2019-01-15 05:11:47.161  INFO 7596 --- [           main] o.s.c.d.a.test.NamedChannelTests         : Creating stream 'DIRECTED-GRAPH-DESTINATION1'
15-Jan-2019 05:11:47 2019-01-15 05:11:47.214  INFO 7596 --- [           main] o.s.c.d.a.test.NamedChannelTests         : Deploying stream 'DIRECTED-GRAPH-DESTINATION1' with properties: {app.*.logging.file=${PID}-test.log, app.*.endpoints.logfile.sensitive=false, app.*.management.endpoints.web.exposure.include=*}
15-Jan-2019 05:11:47 2019-01-15 05:11:47.565  INFO 7596 --- [           main] o.s.c.d.a.test.NamedChannelTests         : Checking: Stream=DIRECTED-GRAPH-DESTINATION1, status = deploying, status description = The stream is being deployed.
15-Jan-2019 05:11:47 2019-01-15 05:11:47.565  INFO 7596 --- [           main] o.s.c.d.a.test.NamedChannelTests         : Sleeping to check status of Stream=DIRECTED-GRAPH-DESTINATION1
15-Jan-2019 05:11:57 2019-01-15 05:11:57.574  INFO 7596 --- [           main] o.s.c.d.a.test.NamedChannelTests         : Checking: Stream=DIRECTED-GRAPH-DESTINATION1, status = deploying, status description = The stream is being deployed.
15-Jan-2019 05:11:57 2019-01-15 05:11:57.574  INFO 7596 --- [           main] o.s.c.d.a.test.NamedChannelTests         : Sleeping to check status of Stream=DIRECTED-GRAPH-DESTINATION1
15-Jan-2019 05:12:07 2019-01-15 05:12:07.587  INFO 7596 --- [           main] o.s.c.d.a.test.NamedChannelTests         : Checking: Stream=DIRECTED-GRAPH-DESTINATION1, status = deployed, status description = The stream has been successfully deployed
15-Jan-2019 05:12:07 2019-01-15 05:12:07.602  INFO 7596 --- [           main] o.s.c.d.a.test.NamedChannelTests         : Sleeping to check status of Stream=DIRECTED-GRAPH-DESTINATION1
15-Jan-2019 05:12:17 2019-01-15 05:12:17.603  INFO 7596 --- [           main] o.s.c.d.a.test.NamedChannelTests         : Stream 'DIRECTED-GRAPH-DESTINATION1' started with status: deployed
15-Jan-2019 05:12:17 2019-01-15 05:12:17.603  INFO 7596 --- [           main] o.s.c.d.a.test.NamedChannelTests         : App 'transform' has instances: {DIRECTED-GRAPH-DESTINATION1.transform-0=http://10.194.6.21:23806}
15-Jan-2019 05:12:17 2019-01-15 05:12:17.603  INFO 7596 --- [           main] o.s.c.d.a.test.NamedChannelTests         : App 'log' has instances: {DIRECTED-GRAPH-DESTINATION1.log-0=http://10.194.6.21:36383}
15-Jan-2019 05:12:17 2019-01-15 05:12:17.603  INFO 7596 --- [           main] o.s.c.d.a.test.NamedChannelTests         : Looking for 'Started LogSink' in logfile for log
15-Jan-2019 05:12:27 2019-01-15 05:12:27.603  INFO 7596 --- [           main] o.s.c.d.a.test.NamedChannelTests         : Requesting log for app DIRECTED-GRAPH-DESTINATION1.log-0
15-Jan-2019 05:12:27 2019-01-15 05:12:27.738  INFO 7596 --- [           main] o.s.c.d.a.test.NamedChannelTests         : Retrieved logfile from 'http://10.194.6.21:36383/logfile
15-Jan-2019 05:12:27 2019-01-15 05:12:27.738  INFO 7596 --- [           main] o.s.c.d.a.test.NamedChannelTests         : Matched all 'Started LogSink' in logfile for instance DIRECTED-GRAPH-DESTINATION1.log-0 of app log
15-Jan-2019 05:12:27 2019-01-15 05:12:27.738  INFO 7596 --- [           main] o.s.c.d.a.test.NamedChannelTests         : Creating stream 'DIRECTED-GRAPH-DESTINATION2'
15-Jan-2019 05:12:27 2019-01-15 05:12:27.752  INFO 7596 --- [           main] o.s.c.d.a.test.NamedChannelTests         : Deploying stream 'DIRECTED-GRAPH-DESTINATION2' with properties: {app.*.logging.file=${PID}-test.log, app.*.endpoints.logfile.sensitive=false, app.*.management.endpoints.web.exposure.include=*}
15-Jan-2019 05:12:28 2019-01-15 05:12:28.035  INFO 7596 --- [           main] o.s.c.d.a.test.NamedChannelTests         : Checking: Stream=DIRECTED-GRAPH-DESTINATION2, status = deploying, status description = The stream is being deployed.
15-Jan-2019 05:12:28 2019-01-15 05:12:28.035  INFO 7596 --- [           main] o.s.c.d.a.test.NamedChannelTests         : Sleeping to check status of Stream=DIRECTED-GRAPH-DESTINATION2
15-Jan-2019 05:12:38 2019-01-15 05:12:38.049  INFO 7596 --- [           main] o.s.c.d.a.test.NamedChannelTests         : Checking: Stream=DIRECTED-GRAPH-DESTINATION2, status = deploying, status description = The stream is being deployed.
15-Jan-2019 05:12:38 2019-01-15 05:12:38.050  INFO 7596 --- [           main] o.s.c.d.a.test.NamedChannelTests         : Sleeping to check status of Stream=DIRECTED-GRAPH-DESTINATION2
15-Jan-2019 05:12:48 2019-01-15 05:12:48.066  INFO 7596 --- [           main] o.s.c.d.a.test.NamedChannelTests         : Checking: Stream=DIRECTED-GRAPH-DESTINATION2, status = deployed, status description = The stream has been successfully deployed
15-Jan-2019 05:12:48 2019-01-15 05:12:48.085  INFO 7596 --- [           main] o.s.c.d.a.test.NamedChannelTests         : Sleeping to check status of Stream=DIRECTED-GRAPH-DESTINATION2
15-Jan-2019 05:12:58 2019-01-15 05:12:58.085  INFO 7596 --- [           main] o.s.c.d.a.test.NamedChannelTests         : Stream 'DIRECTED-GRAPH-DESTINATION2' started with status: deployed
15-Jan-2019 05:12:58 2019-01-15 05:12:58.085  INFO 7596 --- [           main] o.s.c.d.a.test.NamedChannelTests         : App 'transform' has instances: {DIRECTED-GRAPH-DESTINATION2.transform-0=http://10.194.6.21:54045}
15-Jan-2019 05:12:58 2019-01-15 05:12:58.085  INFO 7596 --- [           main] o.s.c.d.a.test.NamedChannelTests         : App 'log' has instances: {DIRECTED-GRAPH-DESTINATION2.log-0=http://10.194.6.21:56092}
15-Jan-2019 05:12:58 2019-01-15 05:12:58.086  INFO 7596 --- [           main] o.s.c.d.a.test.NamedChannelTests         : Looking for 'Started LogSink' in logfile for log
15-Jan-2019 05:13:08 2019-01-15 05:13:08.086  INFO 7596 --- [           main] o.s.c.d.a.test.NamedChannelTests         : Requesting log for app DIRECTED-GRAPH-DESTINATION2.log-0
15-Jan-2019 05:13:08 2019-01-15 05:13:08.269  INFO 7596 --- [           main] o.s.c.d.a.test.NamedChannelTests         : Retrieved logfile from 'http://10.194.6.21:56092/logfile
15-Jan-2019 05:13:08 2019-01-15 05:13:08.269  INFO 7596 --- [           main] o.s.c.d.a.test.NamedChannelTests         : Matched all 'Started LogSink' in logfile for instance DIRECTED-GRAPH-DESTINATION2.log-0 of app log
15-Jan-2019 05:13:08 2019-01-15 05:13:08.269  INFO 7596 --- [           main] o.s.c.d.a.test.NamedChannelTests         : Creating stream 'DIRECTED-GRAPH-HTTP-SOURCE'
15-Jan-2019 05:13:08 2019-01-15 05:13:08.280  INFO 7596 --- [           main] o.s.c.d.a.test.NamedChannelTests         : Deploying stream 'DIRECTED-GRAPH-HTTP-SOURCE' with properties: {app.*.logging.file=${PID}-test.log, app.*.endpoints.logfile.sensitive=false, app.*.management.endpoints.web.exposure.include=*}
15-Jan-2019 05:13:08 2019-01-15 05:13:08.550  INFO 7596 --- [           main] o.s.c.d.a.test.NamedChannelTests         : Checking: Stream=DIRECTED-GRAPH-HTTP-SOURCE, status = deploying, status description = The stream is being deployed.
15-Jan-2019 05:13:08 2019-01-15 05:13:08.550  INFO 7596 --- [           main] o.s.c.d.a.test.NamedChannelTests         : Sleeping to check status of Stream=DIRECTED-GRAPH-HTTP-SOURCE
15-Jan-2019 05:13:18 2019-01-15 05:13:18.568  INFO 7596 --- [           main] o.s.c.d.a.test.NamedChannelTests         : Checking: Stream=DIRECTED-GRAPH-HTTP-SOURCE, status = deploying, status description = The stream is being deployed.
15-Jan-2019 05:13:18 2019-01-15 05:13:18.568  INFO 7596 --- [           main] o.s.c.d.a.test.NamedChannelTests         : Sleeping to check status of Stream=DIRECTED-GRAPH-HTTP-SOURCE
15-Jan-2019 05:13:28 2019-01-15 05:13:28.586  INFO 7596 --- [           main] o.s.c.d.a.test.NamedChannelTests         : Checking: Stream=DIRECTED-GRAPH-HTTP-SOURCE, status = deployed, status description = The stream has been successfully deployed
15-Jan-2019 05:13:28 2019-01-15 05:13:28.600  INFO 7596 --- [           main] o.s.c.d.a.test.NamedChannelTests         : Sleeping to check status of Stream=DIRECTED-GRAPH-HTTP-SOURCE
15-Jan-2019 05:13:38 2019-01-15 05:13:38.600  INFO 7596 --- [           main] o.s.c.d.a.test.NamedChannelTests         : Stream 'DIRECTED-GRAPH-HTTP-SOURCE' started with status: deployed
15-Jan-2019 05:13:38 2019-01-15 05:13:38.601  INFO 7596 --- [           main] o.s.c.d.a.test.NamedChannelTests         : App 'router' has instances: {DIRECTED-GRAPH-HTTP-SOURCE.router-0=http://10.194.6.21:27047}
15-Jan-2019 05:13:38 2019-01-15 05:13:38.601  INFO 7596 --- [           main] o.s.c.d.a.test.NamedChannelTests         : App 'http' has instances: {DIRECTED-GRAPH-HTTP-SOURCE.http-0=http://10.194.6.21:39856}
15-Jan-2019 05:13:38 2019-01-15 05:13:38.601  INFO 7596 --- [           main] o.s.c.d.a.test.NamedChannelTests         : Looking for 'Started HttpSource' in logfile for http
15-Jan-2019 05:13:48 2019-01-15 05:13:48.601  INFO 7596 --- [           main] o.s.c.d.a.test.NamedChannelTests         : Requesting log for app DIRECTED-GRAPH-HTTP-SOURCE.http-0
15-Jan-2019 05:13:48 2019-01-15 05:13:48.797  INFO 7596 --- [           main] o.s.c.d.a.test.NamedChannelTests         : Retrieved logfile from 'http://10.194.6.21:39856/logfile
15-Jan-2019 05:13:48 2019-01-15 05:13:48.797  INFO 7596 --- [           main] o.s.c.d.a.test.NamedChannelTests         : Matched all 'Started HttpSource' in logfile for instance DIRECTED-GRAPH-HTTP-SOURCE.http-0 of app http
15-Jan-2019 05:13:48 2019-01-15 05:13:48.942  INFO 7596 --- [           main] o.s.c.d.a.test.NamedChannelTests         : Looking for 'abcd-foo' in logfile for log
15-Jan-2019 05:13:58 2019-01-15 05:13:58.942  INFO 7596 --- [           main] o.s.c.d.a.test.NamedChannelTests         : Requesting log for app DIRECTED-GRAPH-DESTINATION1.log-0
15-Jan-2019 05:13:58 2019-01-15 05:13:58.956  INFO 7596 --- [           main] o.s.c.d.a.test.NamedChannelTests         : Retrieved logfile from 'http://10.194.6.21:36383/logfile
15-Jan-2019 05:13:58 2019-01-15 05:13:58.956  INFO 7596 --- [           main] o.s.c.d.a.test.NamedChannelTests         : Matched all 'abcd-foo' in logfile for instance DIRECTED-GRAPH-DESTINATION1.log-0 of app log
15-Jan-2019 05:13:58 2019-01-15 05:13:58.956  INFO 7596 --- [           main] o.s.c.d.a.test.NamedChannelTests         : Looking for 'defg-bar' in logfile for log
15-Jan-2019 05:14:08 2019-01-15 05:14:08.956  INFO 7596 --- [           main] o.s.c.d.a.test.NamedChannelTests         : Requesting log for app DIRECTED-GRAPH-DESTINATION2.log-0
15-Jan-2019 05:14:08 2019-01-15 05:14:08.970  INFO 7596 --- [           main] o.s.c.d.a.test.NamedChannelTests         : Retrieved logfile from 'http://10.194.6.21:56092/logfile
15-Jan-2019 05:14:08 2019-01-15 05:14:08.970  INFO 7596 --- [           main] o.s.c.d.a.test.NamedChannelTests         : Matched all 'defg-bar' in logfile for instance DIRECTED-GRAPH-DESTINATION2.log-0 of app log
15-Jan-2019 05:14:08 2019-01-15 05:14:08.971  INFO 7596 --- [           main] junit.logTestName                        : Test directedGraphTest(org.springframework.cloud.dataflow.acceptance.test.NamedChannelTests) Succeeded
15-Jan-2019 05:14:08 2019-01-15 05:14:08.971  INFO 7596 --- [           main] junit.logTestName                        : Finished Test directedGraphTest(org.springframework.cloud.dataflow.acceptance.test.NamedChannelTests)
15-Jan-2019 05:14:08 2019-01-15 05:14:08.971  INFO 7596 --- [           main] o.s.c.d.a.test.NamedChannelTests         : Destroy all streams
15-Jan-2019 05:14:09 Tests run: 4, Failures: 0, Errors: 0, Skipped: 0, Time elapsed: 416.524 sec - in org.springframework.cloud.dataflow.acceptance.test.NamedChannelTests
15-Jan-2019 05:14:09 Running org.springframework.cloud.dataflow.acceptance.test.util.PlatformHelperTests
15-Jan-2019 05:14:09 Tests run: 3, Failures: 0, Errors: 0, Skipped: 0, Time elapsed: 0.098 sec - in org.springframework.cloud.dataflow.acceptance.test.util.PlatformHelperTests
15-Jan-2019 05:14:09 Running org.springframework.cloud.dataflow.acceptance.test.util.ApplicationTests
15-Jan-2019 05:14:09 Tests run: 2, Failures: 0, Errors: 0, Skipped: 0, Time elapsed: 0 sec - in org.springframework.cloud.dataflow.acceptance.test.util.ApplicationTests
15-Jan-2019 05:14:09 2019-01-15 05:14:09.731  INFO 7596 --- [       Thread-6] o.s.c.support.GenericApplicationContext  : Closing org.springframework.context.support.GenericApplicationContext@2c7106d9: startup date [Tue Jan 15 05:04:29 UTC 2019]; root of context hierarchy
15-Jan-2019 05:14:09
15-Jan-2019 05:14:09 Results :
15-Jan-2019 05:14:09
15-Jan-2019 05:14:09 Tests run: 19, Failures: 0, Errors: 0, Skipped: 3
15-Jan-2019 05:14:09
15-Jan-2019 05:14:09 [INFO]
15-Jan-2019 05:14:09 [INFO] >>> maven-surefire-report-plugin:3.0.0-M3:report (default-cli) > [surefire]test @ spring-cloud-dataflow-acceptance-tests >>>
15-Jan-2019 05:14:09 [INFO]
15-Jan-2019 05:14:09 [INFO] --- maven-checkstyle-plugin:2.17:check (checkstyle-validation) @ spring-cloud-dataflow-acceptance-tests ---
15-Jan-2019 05:14:09 [INFO]
15-Jan-2019 05:14:09 [INFO] --- maven-resources-plugin:2.6:resources (default-resources) @ spring-cloud-dataflow-acceptance-tests ---
15-Jan-2019 05:14:09 [INFO] Using 'UTF-8' encoding to copy filtered resources.
15-Jan-2019 05:14:09 [INFO] skip non existing resourceDirectory /opt/bamboo-home/xml-data/build-dir/SCDT-LOCALCLASSIC-KAFKA/src/main/resources
15-Jan-2019 05:14:09 [INFO] skip non existing resourceDirectory /opt/bamboo-home/xml-data/build-dir/SCDT-LOCALCLASSIC-KAFKA/src/main/resources
15-Jan-2019 05:14:09 [INFO]
15-Jan-2019 05:14:09 [INFO] --- maven-compiler-plugin:3.1:compile (default-compile) @ spring-cloud-dataflow-acceptance-tests ---
15-Jan-2019 05:14:09 [INFO] Nothing to compile - all classes are up to date
15-Jan-2019 05:14:09 [INFO]
15-Jan-2019 05:14:09 [INFO] --- maven-resources-plugin:2.6:testResources (default-testResources) @ spring-cloud-dataflow-acceptance-tests ---
15-Jan-2019 05:14:09 [INFO] Using 'UTF-8' encoding to copy filtered resources.
15-Jan-2019 05:14:09 [INFO] Copying 1 resource
15-Jan-2019 05:14:09 [INFO]
15-Jan-2019 05:14:09 [INFO] --- maven-compiler-plugin:3.1:testCompile (default-testCompile) @ spring-cloud-dataflow-acceptance-tests ---
15-Jan-2019 05:14:09 [INFO] Nothing to compile - all classes are up to date
15-Jan-2019 05:14:09 [INFO]
15-Jan-2019 05:14:09 [INFO] --- maven-surefire-plugin:2.18.1:test (default-test) @ spring-cloud-dataflow-acceptance-tests ---
15-Jan-2019 05:14:09 [INFO] Skipping execution of surefire because it has already been run for this configuration
15-Jan-2019 05:14:09 [INFO]
15-Jan-2019 05:14:09 [INFO] <<< maven-surefire-report-plugin:3.0.0-M3:report (default-cli) < [surefire]test @ spring-cloud-dataflow-acceptance-tests <<<
15-Jan-2019 05:14:09 [INFO]
15-Jan-2019 05:14:09 [INFO] --- maven-surefire-report-plugin:3.0.0-M3:report (default-cli) @ spring-cloud-dataflow-acceptance-tests ---
15-Jan-2019 05:14:10 [WARNING] Unable to locate Test Source XRef to link to - DISABLED
15-Jan-2019 05:14:10 [INFO] ------------------------------------------------------------------------
15-Jan-2019 05:14:10 [INFO] BUILD SUCCESS
15-Jan-2019 05:14:10 [INFO] ------------------------------------------------------------------------
15-Jan-2019 05:14:10 [INFO] Total time: 13:21 min
15-Jan-2019 05:14:10 [INFO] Finished at: 2019-01-15T05:14:10+00:00
15-Jan-2019 05:14:10 [INFO] Final Memory: 60M/460M
15-Jan-2019 05:14:10 [INFO] ------------------------------------------------------------------------
15-Jan-2019 05:14:10 Clean up, clean up, everybody everywhere; clean up clean up, everybody do your share!
15-Jan-2019 05:14:10 Killing process PID [7482]
15-Jan-2019 05:14:11 No stopped containers
15-Jan-2019 05:14:11 Stopping mysql_mysql_1 ...
15-Jan-2019 05:14:12
15-Jan-2019 05:14:12 Stopping mysql_mysql_1 ... done
15-Jan-2019 05:14:13 Removing mysql_mysql_1 ...
15-Jan-2019 05:14:13
15-Jan-2019 05:14:13 Removing mysql_mysql_1 ... done
15-Jan-2019 05:14:13 Going to remove mysql_mysql_1
15-Jan-2019 05:14:13 Stopping kafka_kafka_1 ...
15-Jan-2019 05:14:13 Stopping kafka_zookeeper_1 ...
15-Jan-2019 05:14:15
15-Jan-2019 05:14:15 Stopping kafka_kafka_1 ... done
15-Jan-2019 05:14:23
15-Jan-2019 05:14:23 Stopping kafka_zookeeper_1 ... done
15-Jan-2019 05:14:23 Removing kafka_kafka_1 ...
15-Jan-2019 05:14:23 Removing kafka_zookeeper_1 ...
15-Jan-2019 05:14:23
15-Jan-2019 05:14:23 Removing kafka_zookeeper_1 ... done
15-Jan-2019 05:14:23
15-Jan-2019 05:14:23 Removing kafka_kafka_1 ... done
15-Jan-2019 05:14:23 Going to remove kafka_kafka_1, kafka_zookeeper_1
15-Jan-2019 05:14:23
15-Jan-2019 05:14:23 Finished task 'Execute Acceptance Tests' with result: Success
15-Jan-2019 05:14:23 Starting task 'JUnit Parser' of type 'com.atlassian.bamboo.plugins.testresultparser:task.testresultparser.junit'
15-Jan-2019 05:14:23 Parsing test results under /opt/bamboo-home/xml-data/build-dir/SCDT-LOCALCLASSIC-KAFKA...
15-Jan-2019 05:14:23 Finished task 'JUnit Parser' with result: Success
15-Jan-2019 05:14:23 Starting task 'clean up' of type 'com.atlassian.bamboo.plugins.scripttask:task.builder.script'
15-Jan-2019 05:14:23
Beginning to execute external process for build 'Spring Cloud Data Flow Acceptance Tests - Local + SCDF-1.7.4.BS + Classic (5am) - Run Data Flow Acceptance Tests for Kafka #640 (SCDT-LOCALCLASSIC-KAFKA-640)'
... running command line:
/opt/bamboo-home/temp/SCDT-LOCALCLASSIC-KAFKA-640-ScriptBuildTask-2140883010820918481.sh
... in: /opt/bamboo-home/xml-data/build-dir/SCDT-LOCALCLASSIC-KAFKA
... using extra environment variables:
bamboo_planRepository_1_branch=master
bamboo_********_username_password=********
bamboo_signing_store_password=********
bamboo_capability_system_builder_ant_Ant_1_9=/opt/ant-1.9
bamboo_capability_system_builder_ant_Ant_1_8=/opt/ant-1.8
bamboo_planRepository_1_branchDisplayName=master
bamboo_capability_system_jdk_OpenJDK_7u181=/opt/openjdk-7
bamboo_repository_revision_number=81cf8e7d743b9305b6fcf979b96acb05142e6edc
bamboo_repository_247857231_previous_revision_number=4ffaad07559ccd9b8e54cbb085682eae686a1384
bamboo_capability_system_builder_node_Node_js_6=/usr/bin/node
bamboo_RIAK_BIN=/usr/sbin/riak
bamboo_buildKey=SCDT-LOCALCLASSIC-KAFKA
bamboo_sonar_token_password=********
bamboo_shortJobName=Run Data Flow Acceptance Tests for Kafka
bamboo_capability_system_builder_gradle___gradlew=./gradlew
bamboo_buildResultsUrl=https://build.spring.io/browse/SCDT-LOCALCLASSIC-KAFKA-640
bamboo_capability_system_builder_mvn3_Maven_3_3=/opt/maven-3.3
bamboo_capability_system_builder_mvn3_Maven_3_2=/opt/maven-3.2
bamboo_capability_system_builder_mvn3_Maven_3_1=/opt/maven-3.1
bamboo_planRepository_repositoryUrl=https://github.com/spring-cloud/spring-cloud-dataflow-acceptance-tests.git
bamboo_agentId=208568331
bamboo_capability_system_builder_mvn3_Maven_3_5=/opt/maven-3.5
bamboo_capability_system_builder_mvn3_Maven_3_0=/opt/maven-3.0
bamboo_planRepository_revision=81cf8e7d743b9305b6fcf979b96acb05142e6edc
bamboo_planRepository_previousRevision=4ffaad07559ccd9b8e54cbb085682eae686a1384
bamboo_capability_remote_build=true
bamboo_repository_branch_name=master
bamboo_repository_247857231_branch_name=master
bamboo_scdf_acceptance_tests_password=********
bamboo_capability_Agent=bamboo-11.af.pivotal.io
bamboo_planRepository_branch=master
bamboo_planRepository_1_type=gitv2
bamboo_planRepository_branchName=master
bamboo_repository_247857231_name=Git
bamboo_sonar_password=********
bamboo_hg_cache_directory=/opt/bamboo-home/xml-data/build-dir/_hg-repositories-cache
bamboo_planRepository_1_username=spring-buildmaster
bamboo_planRepository_type=gitv2
bamboo_git_cache_directory=/opt/bamboo-home/xml-data/build-dir/_git-repositories-cache
bamboo_repository_247857231_revision_number=81cf8e7d743b9305b6fcf979b96acb05142e6edc
bamboo_repository_247857231_git_branch=master
bamboo_artifactory_username=buildmaster
bamboo_tmp_directory=/opt/bamboo-home/temp
bamboo_planKey=SCDT-LOCALCLASSIC
bamboo_planRepository_username=spring-buildmaster
bamboo_repository_247857231_git_repositoryUrl=https://github.com/spring-cloud/spring-cloud-dataflow-acceptance-tests.git
bamboo_JDK8_HOME=/opt/jdk-8
bamboo_planRepository_1_branchName=master
bamboo_sonar_version=5.6.3
bamboo_capability_system_jdk_JDK_1_11=/opt/jdk-11
bamboo_resultsUrl=https://build.spring.io/browse/SCDT-LOCALCLASSIC-KAFKA-640
bamboo_capability_system_jdk_JDK_1_10=/opt/jdk-10
bamboo_build_working_directory=/opt/bamboo-home/xml-data/build-dir/SCDT-LOCALCLASSIC-KAFKA
bamboo_planRepository_1_name=Git
bamboo_capability_system_os=ubuntu1604
bamboo_nexusPush_stagingProfile=buildmaster
bamboo_shortPlanName=Local + SCDF-1.7.4.BS + Classic (5am)
bamboo_planRepository_name=Git
bamboo_buildNumber=640
bamboo_planName=Spring Cloud Data Flow Acceptance Tests - Local + SCDF-1.7.4.BS + Classic (5am)
bamboo_JDK7_HOME=/opt/jdk-7
bamboo_build_commandline_com_atlassian_bamboo_plugins_scripttask_task_builder_script_7=/opt/bamboo-home/temp/SCDT-LOCALCLASSIC-KAFKA-640-ScriptBuildTask-7433468594624560747.sh
bamboo_shortPlanKey=LOCALCLASSIC
bamboo_shortJobKey=KAFKA
bamboo_artifactory_password=********
bamboo_buildTimeStamp=2019-01-15T05:00:00.854Z
bamboo_repository_previous_revision_number=4ffaad07559ccd9b8e54cbb085682eae686a1384
bamboo_sonar_username=buildmaster
bamboo_********_password=********
bamboo_repository_git_branch=master
bamboo_buildResultKey=SCDT-LOCALCLASSIC-KAFKA-640
bamboo_nexusPush_close=true
bamboo_buildPlanName=Spring Cloud Data Flow Acceptance Tests - Local + SCDF-1.7.4.BS + Classic (5am) - Run Data Flow Acceptance Tests for Kafka
bamboo_planRepository_1_revision=81cf8e7d743b9305b6fcf979b96acb05142e6edc
bamboo_repository_name=Git
bamboo_signing_key_password=********
bamboo_repository_247857231_git_username=spring-buildmaster
bamboo_buildFailed=false
bamboo_capability_system_docker_executable=/usr/bin/docker
bamboo_capability_system_builder_groovy_Groovy_2_4=/opt/groovy-2.4
bamboo_capability_system_builder_command_Bash=/bin/bash
bamboo_jobFailed=false
bamboo_agentWorkingDirectory=/opt/bamboo-home/xml-data/build-dir
bamboo_capability_system_git_executable=/usr/bin/git
bamboo_repository_git_username=spring-buildmaster
bamboo_planRepository_1_previousRevision=4ffaad07559ccd9b8e54cbb085682eae686a1384
bamboo_capability_os_family=unix
bamboo_planRepository_branchDisplayName=master
bamboo_capability_system_builder_maven_Artifactory_Maven_3_5=/opt/maven-3.5
bamboo_capability_system_builder_maven_Artifactory_Maven_3_3=/opt/maven-3.3
bamboo_capability_system_builder_maven_Artifactory_Maven_3_2=/opt/maven-3.2
bamboo_s3_properties=/home/bamboo/tools/s3.properties
bamboo_capability_system_builder_maven_Artifactory_Maven_3_1=/opt/maven-3.1
bamboo_capability_system_builder_maven_Artifactory_Maven_3_0=/opt/maven-3.0
bamboo_plan_storageTag=plan-247660696
bamboo_repository_git_repositoryUrl=https://github.com/spring-cloud/spring-cloud-dataflow-acceptance-tests.git
bamboo_working_directory=/opt/bamboo-home/xml-data/build-dir/SCDT-LOCALCLASSIC-KAFKA
bamboo_planRepository_1_repositoryUrl=https://github.com/spring-cloud/spring-cloud-dataflow-acceptance-tests.git
bamboo_capability_system_jdk_JDK_1_8=/opt/jdk-8
bamboo_capability_system_jdk_JDK_1_9=/opt/jdk-9
bamboo_capability_system_jdk_JDK_1_6=/opt/jdk-6
bamboo_capability_system_jdk_JDK_1_7=/opt/jdk-7
bamboo_sonar_ip=10.194.6.9
15-Jan-2019 05:14:23 CLEANING UP RESOURCES AFTER RUNNING TESTS
15-Jan-2019 05:14:23 Environment variable JAVA_HOME must be set
15-Jan-2019 05:14:23 FINISHED CLEANING UP RESOURCES
15-Jan-2019 05:14:23 Finished task 'clean up' with result: Success
15-Jan-2019 05:14:23 Running post build plugin 'Docker Container Cleanup'
15-Jan-2019 05:14:23 Running post build plugin 'NCover Results Collector'
15-Jan-2019 05:14:23 Running post build plugin 'Artifactory Release Management Staging'
15-Jan-2019 05:14:23 Running post build plugin 'Artifactory Build Info Copier'
15-Jan-2019 05:14:23 Running post build plugin 'Artifactory Gradle Properties Info Copier'
15-Jan-2019 05:14:23 Running post build plugin 'Clover Results Collector'
15-Jan-2019 05:14:23 Running post build plugin 'npm Cache Cleanup'
15-Jan-2019 05:14:23 Running post build plugin 'Artifact Copier'
15-Jan-2019 05:14:23 Publishing an artifact: Test Results
15-Jan-2019 05:14:24 Finished publishing of artifact Job artifact: [Test Results], pattern: [**/target/surefire-reports/**/*.*] in 39.27 ms
15-Jan-2019 05:14:24 Publishing an artifact: App and Server Logs
15-Jan-2019 05:14:24 Finished publishing of artifact Job artifact: [App and Server Logs], pattern: [**/*.log] anchored at: [local] in 47.63 ms
15-Jan-2019 05:14:24 Successfully removed working directory at '/opt/bamboo-home/xml-data/build-dir/SCDT-LOCALCLASSIC-KAFKA'
15-Jan-2019 05:14:24 Finalising the build...
15-Jan-2019 05:14:24 Stopping timer.
15-Jan-2019 05:14:24 Build SCDT-LOCALCLASSIC-KAFKA-640 completed.
15-Jan-2019 05:14:24 Running on server: post build plugin 'NCover Results Collector'
15-Jan-2019 05:14:24 Running on server: post build plugin 'Build Hanging Detection Configuration'
15-Jan-2019 05:14:24 Running on server: post build plugin 'Clover Delta Calculator'
15-Jan-2019 05:14:24 Running on server: post build plugin 'Maven Dependencies Postprocessor'
15-Jan-2019 05:14:24 All post build plugins have finished
15-Jan-2019 05:14:24 Generating build results summary...
15-Jan-2019 05:14:24 Saving build results to disk...
15-Jan-2019 05:14:24 Logging substituted variables...
15-Jan-2019 05:14:24 Indexing build results...
15-Jan-2019 05:14:24 Finished building SCDT-LOCALCLASSIC-KAFKA-640.