Build: #640 was successful

Job: Run Data Flow Acceptance Tests for Rabbit was successful

Stages & jobs

  1. Test Stage - Kafka

  2. Test Stage - Rabbit

Build log

The build generated 754 lines of output. Download or view full build log

15-Jan-2019 05:14:24 Build Spring Cloud Data Flow Acceptance Tests - Local + SCDF-1.7.4.BS + Classic (5am) - Run Data Flow Acceptance Tests for Rabbit #640 (SCDT-LOCALCLASSIC-RABBIT-640) started building on agent bamboo-02.af.pivotal.io
15-Jan-2019 05:14:24 Remote agent on host bamboo-02.af.pivotal.io
15-Jan-2019 05:14:24 Build working directory is /opt/bamboo-home/xml-data/build-dir/SCDT-LOCALCLASSIC-RABBIT
15-Jan-2019 05:14:24 Executing build Spring Cloud Data Flow Acceptance Tests - Local + SCDF-1.7.4.BS + Classic (5am) - Run Data Flow Acceptance Tests for Rabbit #640 (SCDT-LOCALCLASSIC-RABBIT-640)
15-Jan-2019 05:14:24 Starting task 'Checkout Default Repository' of type 'com.atlassian.bamboo.plugins.vcs:task.vcs.checkout'
15-Jan-2019 05:14:24 Checking out into /opt/bamboo-home/xml-data/build-dir/SCDT-LOCALCLASSIC-RABBIT
15-Jan-2019 05:14:24 Updating source code to revision: 81cf8e7d743b9305b6fcf979b96acb05142e6edc
15-Jan-2019 05:14:24 Creating local git repository in '/opt/bamboo-home/xml-data/build-dir/SCDT-LOCALCLASSIC-RABBIT/.git'.
15-Jan-2019 05:14:24 Initialized empty Git repository in /opt/bamboo-home/xml-data/build-dir/SCDT-LOCALCLASSIC-RABBIT/.git/
15-Jan-2019 05:14:24 Fetching 'refs/heads/master' from 'https://github.com/spring-cloud/spring-cloud-dataflow-acceptance-tests.git'.
15-Jan-2019 05:14:25 From https://github.com/spring-cloud/spring-cloud-dataflow-acceptance-tests
15-Jan-2019 05:14:25 * [new branch]      master     -> master
15-Jan-2019 05:14:25 Checking out revision 81cf8e7d743b9305b6fcf979b96acb05142e6edc.
15-Jan-2019 05:14:25 Already on 'master'
15-Jan-2019 05:14:25 Updated source code to revision: 81cf8e7d743b9305b6fcf979b96acb05142e6edc
15-Jan-2019 05:14:25 Finished task 'Checkout Default Repository' with result: Success
15-Jan-2019 05:14:25 Running pre-build action: Artifactory Release Staging
15-Jan-2019 05:14:25 Running pre-build action: VCS Version Collector
15-Jan-2019 05:14:25 Starting task 'Execute Acceptance Tests' of type 'com.atlassian.bamboo.plugins.scripttask:task.builder.script'
15-Jan-2019 05:14:25
Beginning to execute external process for build 'Spring Cloud Data Flow Acceptance Tests - Local + SCDF-1.7.4.BS + Classic (5am) - Run Data Flow Acceptance Tests for Rabbit #640 (SCDT-LOCALCLASSIC-RABBIT-640)'
... running command line:
/opt/bamboo-home/temp/SCDT-LOCALCLASSIC-RABBIT-640-ScriptBuildTask-1813954143714494907.sh
... in: /opt/bamboo-home/xml-data/build-dir/SCDT-LOCALCLASSIC-RABBIT
... using extra environment variables:
bamboo_planRepository_1_branch=master
bamboo_********_username_password=********
bamboo_signing_store_password=********
bamboo_capability_system_builder_ant_Ant_1_9=/opt/ant-1.9
bamboo_capability_system_builder_ant_Ant_1_8=/opt/ant-1.8
bamboo_planRepository_1_branchDisplayName=master
bamboo_capability_system_jdk_OpenJDK_7u181=/opt/openjdk-7
bamboo_repository_revision_number=81cf8e7d743b9305b6fcf979b96acb05142e6edc
bamboo_repository_247857231_previous_revision_number=4ffaad07559ccd9b8e54cbb085682eae686a1384
bamboo_capability_system_builder_node_Node_js_6=/usr/bin/node
bamboo_RIAK_BIN=/usr/sbin/riak
bamboo_buildKey=SCDT-LOCALCLASSIC-RABBIT
bamboo_sonar_token_password=********
bamboo_shortJobName=Run Data Flow Acceptance Tests for Rabbit
bamboo_capability_system_builder_gradle___gradlew=./gradlew
bamboo_buildResultsUrl=https://build.spring.io/browse/SCDT-LOCALCLASSIC-RABBIT-640
bamboo_capability_system_builder_mvn3_Maven_3_3=/opt/maven-3.3
bamboo_capability_system_builder_mvn3_Maven_3_2=/opt/maven-3.2
bamboo_capability_system_builder_mvn3_Maven_3_1=/opt/maven-3.1
bamboo_planRepository_repositoryUrl=https://github.com/spring-cloud/spring-cloud-dataflow-acceptance-tests.git
bamboo_agentId=208568325
bamboo_capability_system_builder_mvn3_Maven_3_5=/opt/maven-3.5
bamboo_capability_system_builder_mvn3_Maven_3_0=/opt/maven-3.0
bamboo_planRepository_revision=81cf8e7d743b9305b6fcf979b96acb05142e6edc
bamboo_planRepository_previousRevision=4ffaad07559ccd9b8e54cbb085682eae686a1384
bamboo_capability_remote_build=true
bamboo_repository_branch_name=master
bamboo_repository_247857231_branch_name=master
bamboo_scdf_acceptance_tests_password=********
JAVA_HOME=/opt/jdk-8
bamboo_capability_Agent=bamboo-02.af.pivotal.io
bamboo_planRepository_branch=master
bamboo_planRepository_1_type=gitv2
bamboo_planRepository_branchName=master
bamboo_repository_247857231_name=Git
bamboo_sonar_password=********
bamboo_hg_cache_directory=/opt/bamboo-home/xml-data/build-dir/_hg-repositories-cache
bamboo_planRepository_1_username=spring-buildmaster
bamboo_planRepository_type=gitv2
bamboo_git_cache_directory=/opt/bamboo-home/xml-data/build-dir/_git-repositories-cache
bamboo_repository_247857231_revision_number=81cf8e7d743b9305b6fcf979b96acb05142e6edc
bamboo_repository_247857231_git_branch=master
bamboo_artifactory_username=buildmaster
bamboo_tmp_directory=/opt/bamboo-home/temp
bamboo_planKey=SCDT-LOCALCLASSIC
bamboo_planRepository_username=spring-buildmaster
bamboo_repository_247857231_git_repositoryUrl=https://github.com/spring-cloud/spring-cloud-dataflow-acceptance-tests.git
bamboo_JDK8_HOME=/opt/jdk-8
bamboo_planRepository_1_branchName=master
bamboo_sonar_version=5.6.3
bamboo_capability_system_jdk_JDK_1_11=/opt/jdk-11
bamboo_resultsUrl=https://build.spring.io/browse/SCDT-LOCALCLASSIC-RABBIT-640
bamboo_capability_system_jdk_JDK_1_10=/opt/jdk-10
bamboo_build_working_directory=/opt/bamboo-home/xml-data/build-dir/SCDT-LOCALCLASSIC-RABBIT
bamboo_planRepository_1_name=Git
bamboo_capability_system_os=ubuntu1604
bamboo_nexusPush_stagingProfile=buildmaster
bamboo_shortPlanName=Local + SCDF-1.7.4.BS + Classic (5am)
bamboo_planRepository_name=Git
bamboo_buildNumber=640
bamboo_planName=Spring Cloud Data Flow Acceptance Tests - Local + SCDF-1.7.4.BS + Classic (5am)
bamboo_JDK7_HOME=/opt/jdk-7
bamboo_shortPlanKey=LOCALCLASSIC
bamboo_shortJobKey=RABBIT
bamboo_artifactory_password=********
bamboo_buildTimeStamp=2019-01-15T05:14:24.346Z
bamboo_repository_previous_revision_number=4ffaad07559ccd9b8e54cbb085682eae686a1384
bamboo_sonar_username=buildmaster
bamboo_********_password=********
bamboo_repository_git_branch=master
bamboo_buildResultKey=SCDT-LOCALCLASSIC-RABBIT-640
bamboo_nexusPush_close=true
bamboo_buildPlanName=Spring Cloud Data Flow Acceptance Tests - Local + SCDF-1.7.4.BS + Classic (5am) - Run Data Flow Acceptance Tests for Rabbit
bamboo_planRepository_1_revision=81cf8e7d743b9305b6fcf979b96acb05142e6edc
bamboo_repository_name=Git
bamboo_signing_key_password=********
bamboo_repository_247857231_git_username=spring-buildmaster
bamboo_buildFailed=false
bamboo_capability_system_docker_executable=/usr/bin/docker
bamboo_capability_system_builder_groovy_Groovy_2_4=/opt/groovy-2.4
bamboo_capability_system_builder_command_Bash=/bin/bash
bamboo_agentWorkingDirectory=/opt/bamboo-home/xml-data/build-dir
bamboo_capability_system_git_executable=/usr/bin/git
bamboo_repository_git_username=spring-buildmaster
bamboo_planRepository_1_previousRevision=4ffaad07559ccd9b8e54cbb085682eae686a1384
bamboo_capability_os_family=unix
bamboo_planRepository_branchDisplayName=master
bamboo_capability_system_builder_maven_Artifactory_Maven_3_5=/opt/maven-3.5
bamboo_capability_system_builder_maven_Artifactory_Maven_3_3=/opt/maven-3.3
bamboo_capability_system_builder_maven_Artifactory_Maven_3_2=/opt/maven-3.2
bamboo_s3_properties=/home/bamboo/tools/s3.properties
bamboo_capability_system_builder_maven_Artifactory_Maven_3_1=/opt/maven-3.1
bamboo_capability_system_builder_maven_Artifactory_Maven_3_0=/opt/maven-3.0
bamboo_plan_storageTag=plan-247660696
bamboo_repository_git_repositoryUrl=https://github.com/spring-cloud/spring-cloud-dataflow-acceptance-tests.git
bamboo_working_directory=/opt/bamboo-home/xml-data/build-dir/SCDT-LOCALCLASSIC-RABBIT
bamboo_planRepository_1_repositoryUrl=https://github.com/spring-cloud/spring-cloud-dataflow-acceptance-tests.git
bamboo_capability_system_jdk_JDK_1_8=/opt/jdk-8
bamboo_capability_system_jdk_JDK_1_9=/opt/jdk-9
bamboo_capability_system_jdk_JDK_1_6=/opt/jdk-6
bamboo_capability_system_jdk_JDK_1_7=/opt/jdk-7
bamboo_sonar_ip=10.194.6.9
15-Jan-2019 05:14:25 CLEANING UP RESOURCES BEFORE RUNNING TESTS
15-Jan-2019 05:14:25 Setting the environment variables
15-Jan-2019 05:14:25 Export the unset env. variables from /opt/bamboo-home/xml-data/build-dir/SCDT-LOCALCLASSIC-RABBIT/local/init/env.properties :
15-Jan-2019 05:14:25    SPRING_CLOUD_DATAFLOW_SERVER_DOWNLOAD_URL = http://repo.spring.io/libs-snapshot/org/springframework/cloud/spring-cloud-dataflow-server-local//spring-cloud-dataflow-server-local-.jar
15-Jan-2019 05:14:25    SPRING_CLOUD_SKIPPER_SERVER_DOWNLOAD_URL = http://repo.spring.io/libs-snapshot/org/springframework/cloud/spring-cloud-skipper-server//spring-cloud-skipper-server-.jar
15-Jan-2019 05:14:25    SPRING_DATASOURCE_USERNAME = spring
15-Jan-2019 05:14:25    SPRING_DATASOURCE_PASSWORD = cloud
15-Jan-2019 05:14:25    SPRING_SCHEMA_NAME = dataflow
15-Jan-2019 05:14:25    DOCKER_SERVER = localhost
15-Jan-2019 05:14:25 Setting retries to 60 and WAIT_TIME to 5
15-Jan-2019 05:14:25 Export the unset env. variables from /opt/bamboo-home/xml-data/build-dir/SCDT-LOCALCLASSIC-RABBIT/local/binder/rabbit/env.properties :
15-Jan-2019 05:14:25    STREAM_REGISTRATION_RESOURCE = http://repo.spring.io/libs-release/org/springframework/cloud/stream/app/spring-cloud-stream-app-descriptor/Celsius.SR3/spring-cloud-stream-app-descriptor-Celsius.SR3.stream-apps-rabbit-maven
15-Jan-2019 05:14:26    TASK_REGISTRATION_RESOURCE = http://repo.spring.io/libs-release/org/springframework/cloud/task/app/spring-cloud-task-app-descriptor/Clark.RELEASE/spring-cloud-task-app-descriptor-Clark.RELEASE.task-apps-maven
15-Jan-2019 05:14:26 SCDF SERVER URI: http://localhost:9393
15-Jan-2019 05:14:26 Clean up, clean up, everybody everywhere; clean up clean up, everybody do your share!
15-Jan-2019 05:14:26 No stopped containers
15-Jan-2019 05:14:26 No stopped containers
15-Jan-2019 05:14:27 No stopped containers
15-Jan-2019 05:14:27 FINISHED CLEANING UP RESOURCES
15-Jan-2019 05:14:27 Setting the environment variables
15-Jan-2019 05:14:27 Export the unset env. variables from /opt/bamboo-home/xml-data/build-dir/SCDT-LOCALCLASSIC-RABBIT/local/init/env.properties :
15-Jan-2019 05:14:27    SPRING_CLOUD_DATAFLOW_SERVER_DOWNLOAD_URL = http://repo.spring.io/libs-snapshot/org/springframework/cloud/spring-cloud-dataflow-server-local/1.7.4.BUILD-SNAPSHOT/spring-cloud-dataflow-server-local-1.7.4.BUILD-SNAPSHOT.jar
15-Jan-2019 05:14:27    SPRING_CLOUD_SKIPPER_SERVER_DOWNLOAD_URL = http://repo.spring.io/libs-snapshot/org/springframework/cloud/spring-cloud-skipper-server//spring-cloud-skipper-server-.jar
15-Jan-2019 05:14:27    SPRING_DATASOURCE_USERNAME = spring
15-Jan-2019 05:14:27    SPRING_DATASOURCE_PASSWORD = cloud
15-Jan-2019 05:14:27    SPRING_SCHEMA_NAME = dataflow
15-Jan-2019 05:14:27    DOCKER_SERVER = localhost
15-Jan-2019 05:14:27 Setting retries to 60 and WAIT_TIME to 5
15-Jan-2019 05:14:27 cleaning up any previous mysql docker containers...
15-Jan-2019 05:14:27 done cleaning up.
15-Jan-2019 05:14:27 Could not find a local mysql server, trying docker.
15-Jan-2019 05:14:27 Pulling mysql (mysql:5.7)...
15-Jan-2019 05:14:28 5.7: Pulling from library/mysql
15-Jan-2019 05:14:37 Digest: sha256:bf17a7109057494c45fba5aab7fc805ca00ac1eef638dfdd42b38d5a7190c9bb
15-Jan-2019 05:14:37 Status: Downloaded newer image for mysql:5.7
15-Jan-2019 05:14:37 Creating mysql_mysql_1
15-Jan-2019 05:14:37 mysql running on localhost:3306
15-Jan-2019 05:14:37 Service host is localhost
15-Jan-2019 05:14:37 cleaning up any previous rabbit docker containers...
15-Jan-2019 05:14:37 done cleaning up.
15-Jan-2019 05:14:38 rabbitmq found on localhost
15-Jan-2019 05:14:38 Export the unset env. variables from /opt/bamboo-home/xml-data/build-dir/SCDT-LOCALCLASSIC-RABBIT/local/binder/rabbit/env.properties :
15-Jan-2019 05:14:38    STREAM_REGISTRATION_RESOURCE = http://repo.spring.io/libs-release/org/springframework/cloud/stream/app/spring-cloud-stream-app-descriptor/Celsius.SR3/spring-cloud-stream-app-descriptor-Celsius.SR3.stream-apps-rabbit-maven
15-Jan-2019 05:14:38    TASK_REGISTRATION_RESOURCE = http://repo.spring.io/libs-release/org/springframework/cloud/task/app/spring-cloud-task-app-descriptor/Clark.RELEASE/spring-cloud-task-app-descriptor-Clark.RELEASE.task-apps-maven
15-Jan-2019 05:14:38 cleaning up any previous redis docker containers...
15-Jan-2019 05:14:38 done cleaning up.
15-Jan-2019 05:14:39 redis found on localhost
15-Jan-2019 05:14:39 SCDF SERVER URI: http://localhost:9393
15-Jan-2019 05:14:39 Downloading server from http://repo.spring.io/libs-snapshot/org/springframework/cloud/spring-cloud-dataflow-server-local/1.7.4.BUILD-SNAPSHOT/spring-cloud-dataflow-server-local-1.7.4.BUILD-SNAPSHOT.jar
15-Jan-2019 05:15:57 2019-01-15 05:15:57 URL:http://repo.spring.io/libs-snapshot/org/springframework/cloud/spring-cloud-dataflow-server-local/1.7.4.BUILD-SNAPSHOT/spring-cloud-dataflow-server-local-1.7.4.BUILD-SNAPSHOT.jar [66128674/66128674] -> "/opt/bamboo-home/xml-data/build-dir/SCDT-LOCALCLASSIC-RABBIT/local/server/scdf-server.jar" [1]
15-Jan-2019 05:15:57 SPRING_PROFILES_ACTIVE []
15-Jan-2019 05:15:57 executing [nohup /opt/jdk-8/bin/java  -Xmx1024m -Xss1024k -jar /opt/bamboo-home/xml-data/build-dir/SCDT-LOCALCLASSIC-RABBIT/local/server/scdf-server.jar  --spring.datasource.driver-class-name=org.mariadb.jdbc.Driver --spring.datasource.url=jdbc:mysql://localhost/dataflow --spring.datasource.username=spring --spring.datasource.password=cloud  --spring.cloud.dataflow.applicationProperties.stream.spring.rabbitmq.host=127.0.0.1  --spring.redis.host=127.0.0.1 --spring.cloud.deployer.local.workingDirectoriesRoot=/opt/bamboo-home/xml-data/build-dir/SCDT-LOCALCLASSIC-RABBIT/local/server/app-logs > /opt/bamboo-home/xml-data/build-dir/SCDT-LOCALCLASSIC-RABBIT/local/server/scdf-server.log &]
15-Jan-2019 05:15:57 [/opt/bamboo-home/xml-data/build-dir/SCDT-LOCALCLASSIC-RABBIT/local/server] process pid is [3126]
15-Jan-2019 05:15:57 System props are []
15-Jan-2019 05:15:57 Logs are under [/opt/bamboo-home/xml-data/build-dir/SCDT-LOCALCLASSIC-RABBIT/local/server/scdf-server.log] or from nohup [/opt/bamboo-home/xml-data/build-dir/SCDT-LOCALCLASSIC-RABBIT/local/server/nohup.log]
15-Jan-2019 05:15:57 Failed to connect to localhost:9393. Attempt  #1/60... will try again in [5] seconds
15-Jan-2019 05:16:02 Failed to connect to localhost:9393. Attempt  #2/60... will try again in [5] seconds
15-Jan-2019 05:16:07 Failed to connect to localhost:9393. Attempt  #3/60... will try again in [5] seconds
15-Jan-2019 05:16:12 SCDF SERVER ABOUT:
15-Jan-2019 05:16:12 {
15-Jan-2019 05:16:12     "_links": {
15-Jan-2019 05:16:12         "self": {
15-Jan-2019 05:16:12             "href": "http://localhost:9393/about"
15-Jan-2019 05:16:12         }
15-Jan-2019 05:16:12     },
15-Jan-2019 05:16:12     "featureInfo": {
15-Jan-2019 05:16:12         "analyticsEnabled": true,
15-Jan-2019 05:16:12         "schedulerEnabled": false,
15-Jan-2019 05:16:12         "skipperEnabled": false,
15-Jan-2019 05:16:12         "streamsEnabled": true,
15-Jan-2019 05:16:12         "tasksEnabled": true
15-Jan-2019 05:16:12     },
15-Jan-2019 05:16:12     "runtimeEnvironment": {
15-Jan-2019 05:16:12         "appDeployer": {
15-Jan-2019 05:16:12             "deployerImplementationVersion": "1.3.10.RELEASE",
15-Jan-2019 05:16:12             "deployerName": "LocalAppDeployer",
15-Jan-2019 05:16:12             "deployerSpiVersion": "1.3.4.RELEASE",
15-Jan-2019 05:16:12             "javaVersion": "1.8.0_144",
15-Jan-2019 05:16:12             "platformApiVersion": "Linux 4.4.0-141-generic",
15-Jan-2019 05:16:12             "platformClientVersion": "4.4.0-141-generic",
15-Jan-2019 05:16:12             "platformHostVersion": "4.4.0-141-generic",
15-Jan-2019 05:16:12             "platformSpecificInfo": {},
15-Jan-2019 05:16:12             "platformType": "Local",
15-Jan-2019 05:16:12             "springBootVersion": "1.5.16.RELEASE",
15-Jan-2019 05:16:12             "springVersion": "4.3.19.RELEASE"
15-Jan-2019 05:16:12         },
15-Jan-2019 05:16:12         "taskLauncher": {
15-Jan-2019 05:16:12             "deployerImplementationVersion": "1.3.10.RELEASE",
15-Jan-2019 05:16:12             "deployerName": "LocalTaskLauncher",
15-Jan-2019 05:16:12             "deployerSpiVersion": "1.3.4.RELEASE",
15-Jan-2019 05:16:12             "javaVersion": "1.8.0_144",
15-Jan-2019 05:16:12             "platformApiVersion": "Linux 4.4.0-141-generic",
15-Jan-2019 05:16:12             "platformClientVersion": "4.4.0-141-generic",
15-Jan-2019 05:16:12             "platformHostVersion": "4.4.0-141-generic",
15-Jan-2019 05:16:12             "platformSpecificInfo": {},
15-Jan-2019 05:16:12             "platformType": "Local",
15-Jan-2019 05:16:12             "springBootVersion": "1.5.16.RELEASE",
15-Jan-2019 05:16:12             "springVersion": "4.3.19.RELEASE"
15-Jan-2019 05:16:12         }
15-Jan-2019 05:16:12     },
15-Jan-2019 05:16:12     "securityInfo": {
15-Jan-2019 05:16:12         "authenticated": false,
15-Jan-2019 05:16:12         "authenticationEnabled": false,
15-Jan-2019 05:16:12         "authorizationEnabled": false,
15-Jan-2019 05:16:12         "formLogin": false,
15-Jan-2019 05:16:12         "roles": [],
15-Jan-2019 05:16:12         "username": null
15-Jan-2019 05:16:12     },
15-Jan-2019 05:16:12     "versionInfo": {
15-Jan-2019 05:16:12         "core": {
15-Jan-2019 05:16:12             "name": "Spring Cloud Data Flow Core",
15-Jan-2019 05:16:12             "version": "1.7.4.BUILD-SNAPSHOT"
15-Jan-2019 05:16:12         },
15-Jan-2019 05:16:12         "dashboard": {
15-Jan-2019 05:16:12             "name": "Spring Cloud Dataflow UI",
15-Jan-2019 05:16:12             "version": "1.7.2.RELEASE"
15-Jan-2019 05:16:12         },
15-Jan-2019 05:16:12         "implementation": {
15-Jan-2019 05:16:12             "name": "spring-cloud-dataflow-server-local",
15-Jan-2019 05:16:12             "version": "1.7.4.BUILD-SNAPSHOT"
15-Jan-2019 05:16:12         },
15-Jan-2019 05:16:12         "shell": {
15-Jan-2019 05:16:12             "name": "Spring Cloud Data Flow Shell",
15-Jan-2019 05:16:12             "url": "https://repo.spring.io/libs-snapshot/org/springframework/cloud/spring-cloud-dataflow-shell/1.7.4.BUILD-SNAPSHOT/spring-cloud-dataflow-shell-1.7.4.BUILD-SNAPSHOT.jar",
15-Jan-2019 05:16:12             "version": "1.7.4.BUILD-SNAPSHOT"
15-Jan-2019 05:16:12         }
15-Jan-2019 05:16:12     }
15-Jan-2019 05:16:12 }
15-Jan-2019 05:16:13 [INFO] Scanning for projects...
15-Jan-2019 05:16:13 [INFO]                                                                         
15-Jan-2019 05:16:13 [INFO] ------------------------------------------------------------------------
15-Jan-2019 05:16:13 [INFO] Building Data Flow Acceptance Tests 1.1.0.BUILD-SNAPSHOT
15-Jan-2019 05:16:13 [INFO] ------------------------------------------------------------------------
15-Jan-2019 05:16:14 [INFO]
15-Jan-2019 05:16:14 [INFO] --- maven-checkstyle-plugin:2.17:check (checkstyle-validation) @ spring-cloud-dataflow-acceptance-tests ---
15-Jan-2019 05:16:15 [INFO]
15-Jan-2019 05:16:15 [INFO] --- maven-resources-plugin:2.6:resources (default-resources) @ spring-cloud-dataflow-acceptance-tests ---
15-Jan-2019 05:16:15 [INFO] Using 'UTF-8' encoding to copy filtered resources.
15-Jan-2019 05:16:15 [INFO] skip non existing resourceDirectory /opt/bamboo-home/xml-data/build-dir/SCDT-LOCALCLASSIC-RABBIT/src/main/resources
15-Jan-2019 05:16:15 [INFO] skip non existing resourceDirectory /opt/bamboo-home/xml-data/build-dir/SCDT-LOCALCLASSIC-RABBIT/src/main/resources
15-Jan-2019 05:16:15 [INFO]
15-Jan-2019 05:16:15 [INFO] --- maven-compiler-plugin:3.1:compile (default-compile) @ spring-cloud-dataflow-acceptance-tests ---
15-Jan-2019 05:16:15 [INFO] Changes detected - recompiling the module!
15-Jan-2019 05:16:15 [INFO] Compiling 8 source files to /opt/bamboo-home/xml-data/build-dir/SCDT-LOCALCLASSIC-RABBIT/target/classes
15-Jan-2019 05:16:15 [INFO]
15-Jan-2019 05:16:15 [INFO] --- maven-resources-plugin:2.6:testResources (default-testResources) @ spring-cloud-dataflow-acceptance-tests ---
15-Jan-2019 05:16:15 [INFO] Using 'UTF-8' encoding to copy filtered resources.
15-Jan-2019 05:16:15 [INFO] Copying 1 resource
15-Jan-2019 05:16:15 [INFO]
15-Jan-2019 05:16:15 [INFO] --- maven-compiler-plugin:3.1:testCompile (default-testCompile) @ spring-cloud-dataflow-acceptance-tests ---
15-Jan-2019 05:16:15 [INFO] Changes detected - recompiling the module!
15-Jan-2019 05:16:15 [INFO] Compiling 15 source files to /opt/bamboo-home/xml-data/build-dir/SCDT-LOCALCLASSIC-RABBIT/target/test-classes
15-Jan-2019 05:16:16 [WARNING] /opt/bamboo-home/xml-data/build-dir/SCDT-LOCALCLASSIC-RABBIT/src/test/java/org/springframework/cloud/dataflow/acceptance/test/AbstractTaskTests.java: Some input files use unchecked or unsafe operations.
15-Jan-2019 05:16:16 [WARNING] /opt/bamboo-home/xml-data/build-dir/SCDT-LOCALCLASSIC-RABBIT/src/test/java/org/springframework/cloud/dataflow/acceptance/test/AbstractTaskTests.java: Recompile with -Xlint:unchecked for details.
15-Jan-2019 05:16:16 [INFO]
15-Jan-2019 05:16:16 [INFO] --- maven-surefire-plugin:2.18.1:test (default-test) @ spring-cloud-dataflow-acceptance-tests ---
15-Jan-2019 05:16:16 [INFO] Surefire report directory: /opt/bamboo-home/xml-data/build-dir/SCDT-LOCALCLASSIC-RABBIT/target/surefire-reports
15-Jan-2019 05:16:16
15-Jan-2019 05:16:16 -------------------------------------------------------
15-Jan-2019 05:16:16 T E S T S
15-Jan-2019 05:16:16 -------------------------------------------------------
15-Jan-2019 05:16:16 2019-01-15 05:16:16.861  INFO   --- [           main] .b.t.c.SpringBootTestContextBootstrapper : Neither @ContextConfiguration nor @ContextHierarchy found for test class [org.springframework.cloud.dataflow.acceptance.test.AnalyticsTests], using SpringBootContextLoader
15-Jan-2019 05:16:16 2019-01-15 05:16:16.904  INFO   --- [           main] .b.t.c.SpringBootTestContextBootstrapper : Loaded default TestExecutionListener class names from location [META-INF/spring.factories]: [org.springframework.boot.test.mock.mockito.MockitoTestExecutionListener, org.springframework.boot.test.mock.mockito.ResetMocksTestExecutionListener, org.springframework.boot.test.autoconfigure.restdocs.RestDocsTestExecutionListener, org.springframework.boot.test.autoconfigure.web.client.MockRestServiceServerResetTestExecutionListener, org.springframework.boot.test.autoconfigure.web.servlet.MockMvcPrintOnlyOnFailureTestExecutionListener, org.springframework.boot.test.autoconfigure.web.servlet.WebDriverTestExecutionListener, org.springframework.test.context.web.ServletTestExecutionListener, org.springframework.test.context.support.DirtiesContextBeforeModesTestExecutionListener, org.springframework.test.context.support.DependencyInjectionTestExecutionListener, org.springframework.test.context.support.DirtiesContextTestExecutionListener, org.springframework.test.context.transaction.TransactionalTestExecutionListener, org.springframework.test.context.jdbc.SqlScriptsTestExecutionListener]
15-Jan-2019 05:16:16 2019-01-15 05:16:16.920  INFO   --- [           main] .b.t.c.SpringBootTestContextBootstrapper : Using TestExecutionListeners: [org.springframework.test.context.web.ServletTestExecutionListener@636be97c, org.springframework.test.context.support.DirtiesContextBeforeModesTestExecutionListener@50a638b5, org.springframework.boot.test.autoconfigure.SpringBootDependencyInjectionTestExecutionListener@1817d444, org.springframework.test.context.support.DirtiesContextTestExecutionListener@6ca8564a, org.springframework.test.context.transaction.TransactionalTestExecutionListener@50b472aa, org.springframework.test.context.jdbc.SqlScriptsTestExecutionListener@31368b99, org.springframework.boot.test.autoconfigure.web.servlet.MockMvcPrintOnlyOnFailureTestExecutionListener@1725dc0f, org.springframework.boot.test.autoconfigure.web.client.MockRestServiceServerResetTestExecutionListener@3911c2a7, org.springframework.boot.test.mock.mockito.ResetMocksTestExecutionListener@4ac3c60d, org.springframework.boot.test.autoconfigure.web.servlet.WebDriverTestExecutionListener@4facf68f, org.springframework.boot.test.autoconfigure.restdocs.RestDocsTestExecutionListener@76508ed1, org.springframework.boot.test.mock.mockito.MockitoTestExecutionListener@41e36e46]
15-Jan-2019 05:16:16 2019-01-15 05:16:16.922  INFO   --- [           main] .b.t.c.SpringBootTestContextBootstrapper : Neither @ContextConfiguration nor @ContextHierarchy found for test class [org.springframework.cloud.dataflow.acceptance.test.WoodChuckTests], using SpringBootContextLoader
15-Jan-2019 05:16:16 2019-01-15 05:16:16.933  INFO   --- [           main] .b.t.c.SpringBootTestContextBootstrapper : Loaded default TestExecutionListener class names from location [META-INF/spring.factories]: [org.springframework.boot.test.mock.mockito.MockitoTestExecutionListener, org.springframework.boot.test.mock.mockito.ResetMocksTestExecutionListener, org.springframework.boot.test.autoconfigure.restdocs.RestDocsTestExecutionListener, org.springframework.boot.test.autoconfigure.web.client.MockRestServiceServerResetTestExecutionListener, org.springframework.boot.test.autoconfigure.web.servlet.MockMvcPrintOnlyOnFailureTestExecutionListener, org.springframework.boot.test.autoconfigure.web.servlet.WebDriverTestExecutionListener, org.springframework.test.context.web.ServletTestExecutionListener, org.springframework.test.context.support.DirtiesContextBeforeModesTestExecutionListener, org.springframework.test.context.support.DependencyInjectionTestExecutionListener, org.springframework.test.context.support.DirtiesContextTestExecutionListener, org.springframework.test.context.transaction.TransactionalTestExecutionListener, org.springframework.test.context.jdbc.SqlScriptsTestExecutionListener]
15-Jan-2019 05:16:16 2019-01-15 05:16:16.937  INFO   --- [           main] .b.t.c.SpringBootTestContextBootstrapper : Using TestExecutionListeners: [org.springframework.test.context.web.ServletTestExecutionListener@49139829, org.springframework.test.context.support.DirtiesContextBeforeModesTestExecutionListener@9597028, org.springframework.boot.test.autoconfigure.SpringBootDependencyInjectionTestExecutionListener@6069db50, org.springframework.test.context.support.DirtiesContextTestExecutionListener@4efbca5a, org.springframework.test.context.transaction.TransactionalTestExecutionListener@1b7cc17c, org.springframework.test.context.jdbc.SqlScriptsTestExecutionListener@59662a0b, org.springframework.boot.test.autoconfigure.web.servlet.MockMvcPrintOnlyOnFailureTestExecutionListener@77fbd92c, org.springframework.boot.test.autoconfigure.web.client.MockRestServiceServerResetTestExecutionListener@67c27493, org.springframework.boot.test.mock.mockito.ResetMocksTestExecutionListener@1a482e36, org.springframework.boot.test.autoconfigure.web.servlet.WebDriverTestExecutionListener@72967906, org.springframework.boot.test.autoconfigure.restdocs.RestDocsTestExecutionListener@5b8dfcc1, org.springframework.boot.test.mock.mockito.MockitoTestExecutionListener@2f9f7dcf]
15-Jan-2019 05:16:16 2019-01-15 05:16:16.938  INFO   --- [           main] .b.t.c.SpringBootTestContextBootstrapper : Neither @ContextConfiguration nor @ContextHierarchy found for test class [org.springframework.cloud.dataflow.acceptance.test.HttpSourceTests], using SpringBootContextLoader
15-Jan-2019 05:16:16 2019-01-15 05:16:16.947  INFO   --- [           main] .b.t.c.SpringBootTestContextBootstrapper : Loaded default TestExecutionListener class names from location [META-INF/spring.factories]: [org.springframework.boot.test.mock.mockito.MockitoTestExecutionListener, org.springframework.boot.test.mock.mockito.ResetMocksTestExecutionListener, org.springframework.boot.test.autoconfigure.restdocs.RestDocsTestExecutionListener, org.springframework.boot.test.autoconfigure.web.client.MockRestServiceServerResetTestExecutionListener, org.springframework.boot.test.autoconfigure.web.servlet.MockMvcPrintOnlyOnFailureTestExecutionListener, org.springframework.boot.test.autoconfigure.web.servlet.WebDriverTestExecutionListener, org.springframework.test.context.web.ServletTestExecutionListener, org.springframework.test.context.support.DirtiesContextBeforeModesTestExecutionListener, org.springframework.test.context.support.DependencyInjectionTestExecutionListener, org.springframework.test.context.support.DirtiesContextTestExecutionListener, org.springframework.test.context.transaction.TransactionalTestExecutionListener, org.springframework.test.context.jdbc.SqlScriptsTestExecutionListener]
15-Jan-2019 05:16:16 2019-01-15 05:16:16.950  INFO   --- [           main] .b.t.c.SpringBootTestContextBootstrapper : Using TestExecutionListeners: [org.springframework.test.context.web.ServletTestExecutionListener@1a677343, org.springframework.test.context.support.DirtiesContextBeforeModesTestExecutionListener@15de0b3c, org.springframework.boot.test.autoconfigure.SpringBootDependencyInjectionTestExecutionListener@489115ef, org.springframework.test.context.support.DirtiesContextTestExecutionListener@3857f613, org.springframework.test.context.transaction.TransactionalTestExecutionListener@198b6731, org.springframework.test.context.jdbc.SqlScriptsTestExecutionListener@7c6908d7, org.springframework.boot.test.autoconfigure.web.servlet.MockMvcPrintOnlyOnFailureTestExecutionListener@3c9754d8, org.springframework.boot.test.autoconfigure.web.client.MockRestServiceServerResetTestExecutionListener@3bf7ca37, org.springframework.boot.test.mock.mockito.ResetMocksTestExecutionListener@79079097, org.springframework.boot.test.autoconfigure.web.servlet.WebDriverTestExecutionListener@4d1c00d0, org.springframework.boot.test.autoconfigure.restdocs.RestDocsTestExecutionListener@4b2bac3f, org.springframework.boot.test.mock.mockito.MockitoTestExecutionListener@4e08711f]
15-Jan-2019 05:16:16 2019-01-15 05:16:16.966  INFO   --- [           main] .b.t.c.SpringBootTestContextBootstrapper : Neither @ContextConfiguration nor @ContextHierarchy found for test class [org.springframework.cloud.dataflow.acceptance.test.TickTockTests], using SpringBootContextLoader
15-Jan-2019 05:16:16 2019-01-15 05:16:16.975  INFO   --- [           main] .b.t.c.SpringBootTestContextBootstrapper : Loaded default TestExecutionListener class names from location [META-INF/spring.factories]: [org.springframework.boot.test.mock.mockito.MockitoTestExecutionListener, org.springframework.boot.test.mock.mockito.ResetMocksTestExecutionListener, org.springframework.boot.test.autoconfigure.restdocs.RestDocsTestExecutionListener, org.springframework.boot.test.autoconfigure.web.client.MockRestServiceServerResetTestExecutionListener, org.springframework.boot.test.autoconfigure.web.servlet.MockMvcPrintOnlyOnFailureTestExecutionListener, org.springframework.boot.test.autoconfigure.web.servlet.WebDriverTestExecutionListener, org.springframework.test.context.web.ServletTestExecutionListener, org.springframework.test.context.support.DirtiesContextBeforeModesTestExecutionListener, org.springframework.test.context.support.DependencyInjectionTestExecutionListener, org.springframework.test.context.support.DirtiesContextTestExecutionListener, org.springframework.test.context.transaction.TransactionalTestExecutionListener, org.springframework.test.context.jdbc.SqlScriptsTestExecutionListener]
15-Jan-2019 05:16:16 2019-01-15 05:16:16.978  INFO   --- [           main] .b.t.c.SpringBootTestContextBootstrapper : Using TestExecutionListeners: [org.springframework.test.context.web.ServletTestExecutionListener@67080771, org.springframework.test.context.support.DirtiesContextBeforeModesTestExecutionListener@72cde7cc, org.springframework.boot.test.autoconfigure.SpringBootDependencyInjectionTestExecutionListener@5fd4f8f5, org.springframework.test.context.support.DirtiesContextTestExecutionListener@696da30b, org.springframework.test.context.transaction.TransactionalTestExecutionListener@4e7912d8, org.springframework.test.context.jdbc.SqlScriptsTestExecutionListener@53976f5c, org.springframework.boot.test.autoconfigure.web.servlet.MockMvcPrintOnlyOnFailureTestExecutionListener@2bfc268b, org.springframework.boot.test.autoconfigure.web.client.MockRestServiceServerResetTestExecutionListener@2f8dad04, org.springframework.boot.test.mock.mockito.ResetMocksTestExecutionListener@29e495ff, org.springframework.boot.test.autoconfigure.web.servlet.WebDriverTestExecutionListener@41e1e210, org.springframework.boot.test.autoconfigure.restdocs.RestDocsTestExecutionListener@be35cd9, org.springframework.boot.test.mock.mockito.MockitoTestExecutionListener@4944252c]
15-Jan-2019 05:16:16 2019-01-15 05:16:16.979  INFO   --- [           main] .b.t.c.SpringBootTestContextBootstrapper : Neither @ContextConfiguration nor @ContextHierarchy found for test class [org.springframework.cloud.dataflow.acceptance.test.TransformTests], using SpringBootContextLoader
15-Jan-2019 05:16:16 2019-01-15 05:16:16.986  INFO   --- [           main] .b.t.c.SpringBootTestContextBootstrapper : Loaded default TestExecutionListener class names from location [META-INF/spring.factories]: [org.springframework.boot.test.mock.mockito.MockitoTestExecutionListener, org.springframework.boot.test.mock.mockito.ResetMocksTestExecutionListener, org.springframework.boot.test.autoconfigure.restdocs.RestDocsTestExecutionListener, org.springframework.boot.test.autoconfigure.web.client.MockRestServiceServerResetTestExecutionListener, org.springframework.boot.test.autoconfigure.web.servlet.MockMvcPrintOnlyOnFailureTestExecutionListener, org.springframework.boot.test.autoconfigure.web.servlet.WebDriverTestExecutionListener, org.springframework.test.context.web.ServletTestExecutionListener, org.springframework.test.context.support.DirtiesContextBeforeModesTestExecutionListener, org.springframework.test.context.support.DependencyInjectionTestExecutionListener, org.springframework.test.context.support.DirtiesContextTestExecutionListener, org.springframework.test.context.transaction.TransactionalTestExecutionListener, org.springframework.test.context.jdbc.SqlScriptsTestExecutionListener]
15-Jan-2019 05:16:16 2019-01-15 05:16:16.989  INFO   --- [           main] .b.t.c.SpringBootTestContextBootstrapper : Using TestExecutionListeners: [org.springframework.test.context.web.ServletTestExecutionListener@306e95ec, org.springframework.test.context.support.DirtiesContextBeforeModesTestExecutionListener@52af26ee, org.springframework.boot.test.autoconfigure.SpringBootDependencyInjectionTestExecutionListener@6fd83fc1, org.springframework.test.context.support.DirtiesContextTestExecutionListener@4f2b503c, org.springframework.test.context.transaction.TransactionalTestExecutionListener@bae7dc0, org.springframework.test.context.jdbc.SqlScriptsTestExecutionListener@209da20d, org.springframework.boot.test.autoconfigure.web.servlet.MockMvcPrintOnlyOnFailureTestExecutionListener@e15b7e8, org.springframework.boot.test.autoconfigure.web.client.MockRestServiceServerResetTestExecutionListener@1b2abca6, org.springframework.boot.test.mock.mockito.ResetMocksTestExecutionListener@6392827e, org.springframework.boot.test.autoconfigure.web.servlet.WebDriverTestExecutionListener@2ed2d9cb, org.springframework.boot.test.autoconfigure.restdocs.RestDocsTestExecutionListener@d5b810e, org.springframework.boot.test.mock.mockito.MockitoTestExecutionListener@43dac38f]
15-Jan-2019 05:16:16 2019-01-15 05:16:16.999  INFO   --- [           main] .b.t.c.SpringBootTestContextBootstrapper : Neither @ContextConfiguration nor @ContextHierarchy found for test class [org.springframework.cloud.dataflow.acceptance.test.NamedChannelTests], using SpringBootContextLoader
15-Jan-2019 05:16:17 2019-01-15 05:16:17.008  INFO   --- [           main] .b.t.c.SpringBootTestContextBootstrapper : Loaded default TestExecutionListener class names from location [META-INF/spring.factories]: [org.springframework.boot.test.mock.mockito.MockitoTestExecutionListener, org.springframework.boot.test.mock.mockito.ResetMocksTestExecutionListener, org.springframework.boot.test.autoconfigure.restdocs.RestDocsTestExecutionListener, org.springframework.boot.test.autoconfigure.web.client.MockRestServiceServerResetTestExecutionListener, org.springframework.boot.test.autoconfigure.web.servlet.MockMvcPrintOnlyOnFailureTestExecutionListener, org.springframework.boot.test.autoconfigure.web.servlet.WebDriverTestExecutionListener, org.springframework.test.context.web.ServletTestExecutionListener, org.springframework.test.context.support.DirtiesContextBeforeModesTestExecutionListener, org.springframework.test.context.support.DependencyInjectionTestExecutionListener, org.springframework.test.context.support.DirtiesContextTestExecutionListener, org.springframework.test.context.transaction.TransactionalTestExecutionListener, org.springframework.test.context.jdbc.SqlScriptsTestExecutionListener]
15-Jan-2019 05:16:17 2019-01-15 05:16:17.010  INFO   --- [           main] .b.t.c.SpringBootTestContextBootstrapper : Using TestExecutionListeners: [org.springframework.test.context.web.ServletTestExecutionListener@31ea9581, org.springframework.test.context.support.DirtiesContextBeforeModesTestExecutionListener@231f98ef, org.springframework.boot.test.autoconfigure.SpringBootDependencyInjectionTestExecutionListener@7c137fd5, org.springframework.test.context.support.DirtiesContextTestExecutionListener@183ec003, org.springframework.test.context.transaction.TransactionalTestExecutionListener@7d9d0818, org.springframework.test.context.jdbc.SqlScriptsTestExecutionListener@221a3fa4, org.springframework.boot.test.autoconfigure.web.servlet.MockMvcPrintOnlyOnFailureTestExecutionListener@451001e5, org.springframework.boot.test.autoconfigure.web.client.MockRestServiceServerResetTestExecutionListener@2b40ff9c, org.springframework.boot.test.mock.mockito.ResetMocksTestExecutionListener@3e08ff24, org.springframework.boot.test.autoconfigure.web.servlet.WebDriverTestExecutionListener@4d1c005e, org.springframework.boot.test.autoconfigure.restdocs.RestDocsTestExecutionListener@8462f31, org.springframework.boot.test.mock.mockito.MockitoTestExecutionListener@24569dba]
15-Jan-2019 05:16:17 Running org.springframework.cloud.dataflow.acceptance.test.AnalyticsTests
15-Jan-2019 05:16:17 2019-01-15 05:16:17.032  INFO   --- [           main] .b.t.c.SpringBootTestContextBootstrapper : Neither @ContextConfiguration nor @ContextHierarchy found for test class [org.springframework.cloud.dataflow.acceptance.test.AnalyticsTests], using SpringBootContextLoader
15-Jan-2019 05:16:17 2019-01-15 05:16:17.039  INFO   --- [           main] .b.t.c.SpringBootTestContextBootstrapper : Loaded default TestExecutionListener class names from location [META-INF/spring.factories]: [org.springframework.boot.test.mock.mockito.MockitoTestExecutionListener, org.springframework.boot.test.mock.mockito.ResetMocksTestExecutionListener, org.springframework.boot.test.autoconfigure.restdocs.RestDocsTestExecutionListener, org.springframework.boot.test.autoconfigure.web.client.MockRestServiceServerResetTestExecutionListener, org.springframework.boot.test.autoconfigure.web.servlet.MockMvcPrintOnlyOnFailureTestExecutionListener, org.springframework.boot.test.autoconfigure.web.servlet.WebDriverTestExecutionListener, org.springframework.test.context.web.ServletTestExecutionListener, org.springframework.test.context.support.DirtiesContextBeforeModesTestExecutionListener, org.springframework.test.context.support.DependencyInjectionTestExecutionListener, org.springframework.test.context.support.DirtiesContextTestExecutionListener, org.springframework.test.context.transaction.TransactionalTestExecutionListener, org.springframework.test.context.jdbc.SqlScriptsTestExecutionListener]
15-Jan-2019 05:16:17 2019-01-15 05:16:17.057  INFO   --- [           main] .b.t.c.SpringBootTestContextBootstrapper : Using TestExecutionListeners: [org.springframework.test.context.web.ServletTestExecutionListener@4b86805d, org.springframework.test.context.support.DirtiesContextBeforeModesTestExecutionListener@5852c06f, org.springframework.boot.test.autoconfigure.SpringBootDependencyInjectionTestExecutionListener@4149c063, org.springframework.test.context.support.DirtiesContextTestExecutionListener@9cb8225, org.springframework.test.context.transaction.TransactionalTestExecutionListener@76b07f29, org.springframework.test.context.jdbc.SqlScriptsTestExecutionListener@38af9828, org.springframework.boot.test.autoconfigure.web.servlet.MockMvcPrintOnlyOnFailureTestExecutionListener@376a0d86, org.springframework.boot.test.autoconfigure.web.client.MockRestServiceServerResetTestExecutionListener@62656be4, org.springframework.boot.test.mock.mockito.ResetMocksTestExecutionListener@17d919b6, org.springframework.boot.test.autoconfigure.web.servlet.WebDriverTestExecutionListener@53f3bdbd, org.springframework.boot.test.autoconfigure.restdocs.RestDocsTestExecutionListener@34129c78, org.springframework.boot.test.mock.mockito.MockitoTestExecutionListener@7d61eb55]
15-Jan-2019 05:16:17 2019-01-15 05:16:17.645  INFO 3283 --- [           main] s.c.a.AnnotationConfigApplicationContext : Refreshing org.springframework.context.annotation.AnnotationConfigApplicationContext@3228d990: startup date [Tue Jan 15 05:16:17 UTC 2019]; root of context hierarchy
15-Jan-2019 05:16:17 2019-01-15 05:16:17.944  INFO 3283 --- [           main] trationDelegate$BeanPostProcessorChecker : Bean 'configurationPropertiesRebinderAutoConfiguration' of type [class org.springframework.cloud.autoconfigure.ConfigurationPropertiesRebinderAutoConfiguration$$EnhancerBySpringCGLIB$$44458212] is not eligible for getting processed by all BeanPostProcessors (for example: not eligible for auto-proxying)
15-Jan-2019 05:16:18
15-Jan-2019 05:16:18   .   ____          _            __ _ _
15-Jan-2019 05:16:18 /\\ / ___'_ __ _ _(_)_ __  __ _ \ \ \ \
15-Jan-2019 05:16:18 ( ( )\___ | '_ | '_| | '_ \/ _` | \ \ \ \
15-Jan-2019 05:16:18 \\/  ___)| |_)| | | | | || (_| |  ) ) ) )
15-Jan-2019 05:16:18   '  |____| .__|_| |_|_| |_\__, | / / / /
15-Jan-2019 05:16:18 =========|_|==============|___/=/_/_/_/
15-Jan-2019 05:16:18 :: Spring Boot ::        (v1.4.1.RELEASE)
15-Jan-2019 05:16:18
15-Jan-2019 05:16:18 2019-01-15 05:16:18.220  INFO 3283 --- [           main] c.c.c.ConfigServicePropertySourceLocator : Fetching config from server at: http://localhost:8888
15-Jan-2019 05:16:18 2019-01-15 05:16:18.301  WARN 3283 --- [           main] c.c.c.ConfigServicePropertySourceLocator : Could not locate PropertySource: I/O error on GET request for "http://localhost:8888//blah": Connection refused (Connection refused); nested exception is java.net.ConnectException: Connection refused (Connection refused)
15-Jan-2019 05:16:18 2019-01-15 05:16:18.309  INFO 3283 --- [           main] o.s.c.d.acceptance.test.AnalyticsTests   : The following profiles are active: blah
15-Jan-2019 05:16:18 2019-01-15 05:16:18.525  INFO 3283 --- [           main] o.s.c.d.acceptance.test.AnalyticsTests   : Started AnalyticsTests in 1.405 seconds (JVM running for 2.077)
15-Jan-2019 05:16:18 2019-01-15 05:16:18.700  INFO 3283 --- [           main] junit.logTestName                        : Starting Test analyticsTest(org.springframework.cloud.dataflow.acceptance.test.AnalyticsTests)
15-Jan-2019 05:16:18 2019-01-15 05:16:18.706  INFO 3283 --- [           main] o.s.c.d.acceptance.test.AnalyticsTests   : Importing stream apps from uri resource: http://repo.spring.io/libs-release/org/springframework/cloud/stream/app/spring-cloud-stream-app-descriptor/Celsius.SR3/spring-cloud-stream-app-descriptor-Celsius.SR3.stream-apps-rabbit-maven
15-Jan-2019 05:16:19 2019-01-15 05:16:19.158  INFO 3283 --- [           main] o.s.c.d.acceptance.test.AnalyticsTests   : Creating stream 'httpCounter'
15-Jan-2019 05:16:19 2019-01-15 05:16:19.297  INFO 3283 --- [           main] o.s.c.d.acceptance.test.AnalyticsTests   : Deploying stream 'httpCounter' with properties: {app.*.logging.file=${PID}-test.log, app.*.endpoints.logfile.sensitive=false, app.*.management.endpoints.web.exposure.include=*}
15-Jan-2019 05:16:19 2019-01-15 05:16:19.765  INFO 3283 --- [           main] o.s.c.d.acceptance.test.AnalyticsTests   : Checking: Stream=httpCounter, status = deploying, status description = The stream is being deployed.
15-Jan-2019 05:16:19 2019-01-15 05:16:19.766  INFO 3283 --- [           main] o.s.c.d.acceptance.test.AnalyticsTests   : Sleeping to check status of Stream=httpCounter
15-Jan-2019 05:16:24 2019-01-15 05:16:24.777  INFO 3283 --- [           main] o.s.c.d.acceptance.test.AnalyticsTests   : Checking: Stream=httpCounter, status = deploying, status description = The stream is being deployed.
15-Jan-2019 05:16:24 2019-01-15 05:16:24.777  INFO 3283 --- [           main] o.s.c.d.acceptance.test.AnalyticsTests   : Sleeping to check status of Stream=httpCounter
15-Jan-2019 05:16:29 2019-01-15 05:16:29.790  INFO 3283 --- [           main] o.s.c.d.acceptance.test.AnalyticsTests   : Checking: Stream=httpCounter, status = deploying, status description = The stream is being deployed.
15-Jan-2019 05:16:29 2019-01-15 05:16:29.791  INFO 3283 --- [           main] o.s.c.d.acceptance.test.AnalyticsTests   : Sleeping to check status of Stream=httpCounter
15-Jan-2019 05:16:34 2019-01-15 05:16:34.806  INFO 3283 --- [           main] o.s.c.d.acceptance.test.AnalyticsTests   : Checking: Stream=httpCounter, status = deploying, status description = The stream is being deployed.
15-Jan-2019 05:16:34 2019-01-15 05:16:34.807  INFO 3283 --- [           main] o.s.c.d.acceptance.test.AnalyticsTests   : Sleeping to check status of Stream=httpCounter
15-Jan-2019 05:16:39 2019-01-15 05:16:39.819  INFO 3283 --- [           main] o.s.c.d.acceptance.test.AnalyticsTests   : Checking: Stream=httpCounter, status = deployed, status description = The stream has been successfully deployed
15-Jan-2019 05:16:39 2019-01-15 05:16:39.858  INFO 3283 --- [           main] o.s.c.d.acceptance.test.AnalyticsTests   : Sleeping to check status of Stream=httpCounter
15-Jan-2019 05:16:44 2019-01-15 05:16:44.858  INFO 3283 --- [           main] o.s.c.d.acceptance.test.AnalyticsTests   : Stream 'httpCounter' started with status: deployed
15-Jan-2019 05:16:44 2019-01-15 05:16:44.858  INFO 3283 --- [           main] o.s.c.d.acceptance.test.AnalyticsTests   : App 'http' has instances: {httpCounter.http-0=http://10.194.6.12:45409}
15-Jan-2019 05:16:44 2019-01-15 05:16:44.859  INFO 3283 --- [           main] o.s.c.d.acceptance.test.AnalyticsTests   : App 'counter' has instances: {httpCounter.counter-0=http://10.194.6.12:28829}
15-Jan-2019 05:16:44 2019-01-15 05:16:44.859  INFO 3283 --- [           main] o.s.c.d.acceptance.test.AnalyticsTests   : Looking for 'Started HttpSource' in logfile for http
15-Jan-2019 05:16:49 2019-01-15 05:16:49.860  INFO 3283 --- [           main] o.s.c.d.acceptance.test.AnalyticsTests   : Requesting log for app httpCounter.http-0
15-Jan-2019 05:16:50 2019-01-15 05:16:50.010  INFO 3283 --- [           main] o.s.c.d.acceptance.test.AnalyticsTests   : Retrieved logfile from 'http://10.194.6.12:45409/logfile
15-Jan-2019 05:16:50 2019-01-15 05:16:50.015  INFO 3283 --- [           main] o.s.c.d.acceptance.test.AnalyticsTests   : Matched all 'Started HttpSource' in logfile for instance httpCounter.http-0 of app http
15-Jan-2019 05:16:50 2019-01-15 05:16:50.018  INFO 3283 --- [           main] o.s.c.d.acceptance.test.AnalyticsTests   : Looking for 'Started CounterSink' in logfile for counter
15-Jan-2019 05:16:55 2019-01-15 05:16:55.018  INFO 3283 --- [           main] o.s.c.d.acceptance.test.AnalyticsTests   : Requesting log for app httpCounter.counter-0
15-Jan-2019 05:16:55 2019-01-15 05:16:55.178  INFO 3283 --- [           main] o.s.c.d.acceptance.test.AnalyticsTests   : Retrieved logfile from 'http://10.194.6.12:28829/logfile
15-Jan-2019 05:16:55 2019-01-15 05:16:55.179  INFO 3283 --- [           main] o.s.c.d.acceptance.test.AnalyticsTests   : Matched all 'Started CounterSink' in logfile for instance httpCounter.counter-0 of app counter
15-Jan-2019 05:17:00 2019-01-15 05:17:00.282  INFO 3283 --- [           main] junit.logTestName                        : Test analyticsTest(org.springframework.cloud.dataflow.acceptance.test.AnalyticsTests) Succeeded
15-Jan-2019 05:17:00 2019-01-15 05:17:00.282  INFO 3283 --- [           main] junit.logTestName                        : Finished Test analyticsTest(org.springframework.cloud.dataflow.acceptance.test.AnalyticsTests)
15-Jan-2019 05:17:00 2019-01-15 05:17:00.282  INFO 3283 --- [           main] o.s.c.d.acceptance.test.AnalyticsTests   : Destroy all streams
15-Jan-2019 05:17:00 Tests run: 1, Failures: 0, Errors: 0, Skipped: 0, Time elapsed: 43.301 sec - in org.springframework.cloud.dataflow.acceptance.test.AnalyticsTests
15-Jan-2019 05:17:00 Running org.springframework.cloud.dataflow.acceptance.test.WoodChuckTests
15-Jan-2019 05:17:00 2019-01-15 05:17:00.327  INFO 3283 --- [           main] .b.t.c.SpringBootTestContextBootstrapper : Neither @ContextConfiguration nor @ContextHierarchy found for test class [org.springframework.cloud.dataflow.acceptance.test.WoodChuckTests], using SpringBootContextLoader
15-Jan-2019 05:17:00 2019-01-15 05:17:00.342  INFO 3283 --- [           main] .b.t.c.SpringBootTestContextBootstrapper : Loaded default TestExecutionListener class names from location [META-INF/spring.factories]: [org.springframework.boot.test.mock.mockito.MockitoTestExecutionListener, org.springframework.boot.test.mock.mockito.ResetMocksTestExecutionListener, org.springframework.boot.test.autoconfigure.restdocs.RestDocsTestExecutionListener, org.springframework.boot.test.autoconfigure.web.client.MockRestServiceServerResetTestExecutionListener, org.springframework.boot.test.autoconfigure.web.servlet.MockMvcPrintOnlyOnFailureTestExecutionListener, org.springframework.boot.test.autoconfigure.web.servlet.WebDriverTestExecutionListener, org.springframework.test.context.web.ServletTestExecutionListener, org.springframework.test.context.support.DirtiesContextBeforeModesTestExecutionListener, org.springframework.test.context.support.DependencyInjectionTestExecutionListener, org.springframework.test.context.support.DirtiesContextTestExecutionListener, org.springframework.test.context.transaction.TransactionalTestExecutionListener, org.springframework.test.context.jdbc.SqlScriptsTestExecutionListener]
15-Jan-2019 05:17:00 2019-01-15 05:17:00.345  INFO 3283 --- [           main] .b.t.c.SpringBootTestContextBootstrapper : Using TestExecutionListeners: [org.springframework.test.context.web.ServletTestExecutionListener@121bb45b, org.springframework.test.context.support.DirtiesContextBeforeModesTestExecutionListener@4faa298, org.springframework.boot.test.autoconfigure.SpringBootDependencyInjectionTestExecutionListener@1cd3b138, org.springframework.test.context.support.DirtiesContextTestExecutionListener@151bf776, org.springframework.test.context.transaction.TransactionalTestExecutionListener@5a6d30e2, org.springframework.test.context.jdbc.SqlScriptsTestExecutionListener@b52b755, org.springframework.boot.test.autoconfigure.web.servlet.MockMvcPrintOnlyOnFailureTestExecutionListener@a098d76, org.springframework.boot.test.autoconfigure.web.client.MockRestServiceServerResetTestExecutionListener@40e37b06, org.springframework.boot.test.mock.mockito.ResetMocksTestExecutionListener@733aa9d8, org.springframework.boot.test.autoconfigure.web.servlet.WebDriverTestExecutionListener@6dcc40f5, org.springframework.boot.test.autoconfigure.restdocs.RestDocsTestExecutionListener@2b680207, org.springframework.boot.test.mock.mockito.MockitoTestExecutionListener@70887727]
15-Jan-2019 05:17:00 2019-01-15 05:17:00.426  INFO 3283 --- [           main] junit.logTestName                        : Starting Test testPartitioning(org.springframework.cloud.dataflow.acceptance.test.WoodChuckTests)
15-Jan-2019 05:17:00 2019-01-15 05:17:00.428  INFO 3283 --- [           main] o.s.c.d.acceptance.test.WoodChuckTests   : Creating stream 'WOODCHUCK-TEST'
15-Jan-2019 05:17:00 2019-01-15 05:17:00.449  INFO 3283 --- [           main] o.s.c.d.acceptance.test.WoodChuckTests   : Deploying stream 'WOODCHUCK-TEST' with properties: {app.log.logging.pattern.level=WOODCHUCK-${INSTANCE_INDEX:${CF_INSTANCE_INDEX:${spring.cloud.stream.instanceIndex:0}}} %5p, app.*.logging.file=${PID}-test.log, app.splitter.producer.partitionKeyExpression=payload, app.*.endpoints.logfile.sensitive=false, app.log.spring.cloud.stream.kafka.bindings.input.consumer.autoRebalanceEnabled=false, app.*.management.endpoints.web.exposure.include=*, deployer.log.count=2}
15-Jan-2019 05:17:01 2019-01-15 05:17:01.050  INFO 3283 --- [           main] o.s.c.d.acceptance.test.WoodChuckTests   : Checking: Stream=WOODCHUCK-TEST, status = deploying, status description = The stream is being deployed.
15-Jan-2019 05:17:01 2019-01-15 05:17:01.051  INFO 3283 --- [           main] o.s.c.d.acceptance.test.WoodChuckTests   : Sleeping to check status of Stream=WOODCHUCK-TEST
15-Jan-2019 05:17:06 2019-01-15 05:17:06.081  INFO 3283 --- [           main] o.s.c.d.acceptance.test.WoodChuckTests   : Checking: Stream=WOODCHUCK-TEST, status = deploying, status description = The stream is being deployed.
15-Jan-2019 05:17:06 2019-01-15 05:17:06.082  INFO 3283 --- [           main] o.s.c.d.acceptance.test.WoodChuckTests   : Sleeping to check status of Stream=WOODCHUCK-TEST
15-Jan-2019 05:17:11 2019-01-15 05:17:11.121  INFO 3283 --- [           main] o.s.c.d.acceptance.test.WoodChuckTests   : Checking: Stream=WOODCHUCK-TEST, status = deploying, status description = The stream is being deployed.
15-Jan-2019 05:17:11 2019-01-15 05:17:11.121  INFO 3283 --- [           main] o.s.c.d.acceptance.test.WoodChuckTests   : Sleeping to check status of Stream=WOODCHUCK-TEST
15-Jan-2019 05:17:16 2019-01-15 05:17:16.131  INFO 3283 --- [           main] o.s.c.d.acceptance.test.WoodChuckTests   : Checking: Stream=WOODCHUCK-TEST, status = deploying, status description = The stream is being deployed.
15-Jan-2019 05:17:16 2019-01-15 05:17:16.132  INFO 3283 --- [           main] o.s.c.d.acceptance.test.WoodChuckTests   : Sleeping to check status of Stream=WOODCHUCK-TEST
15-Jan-2019 05:17:21 2019-01-15 05:17:21.151  INFO 3283 --- [           main] o.s.c.d.acceptance.test.WoodChuckTests   : Checking: Stream=WOODCHUCK-TEST, status = deploying, status description = The stream is being deployed.
15-Jan-2019 05:17:21 2019-01-15 05:17:21.151  INFO 3283 --- [           main] o.s.c.d.acceptance.test.WoodChuckTests   : Sleeping to check status of Stream=WOODCHUCK-TEST
15-Jan-2019 05:17:26 2019-01-15 05:17:26.170  INFO 3283 --- [           main] o.s.c.d.acceptance.test.WoodChuckTests   : Checking: Stream=WOODCHUCK-TEST, status = deploying, status description = The stream is being deployed.
15-Jan-2019 05:17:26 2019-01-15 05:17:26.170  INFO 3283 --- [           main] o.s.c.d.acceptance.test.WoodChuckTests   : Sleeping to check status of Stream=WOODCHUCK-TEST
15-Jan-2019 05:17:31 2019-01-15 05:17:31.192  INFO 3283 --- [           main] o.s.c.d.acceptance.test.WoodChuckTests   : Checking: Stream=WOODCHUCK-TEST, status = deployed, status description = The stream has been successfully deployed
15-Jan-2019 05:17:31 2019-01-15 05:17:31.223  INFO 3283 --- [           main] o.s.c.d.acceptance.test.WoodChuckTests   : Sleeping to check status of Stream=WOODCHUCK-TEST
15-Jan-2019 05:17:36 2019-01-15 05:17:36.227  INFO 3283 --- [           main] o.s.c.d.acceptance.test.WoodChuckTests   : Stream 'WOODCHUCK-TEST' started with status: deployed
15-Jan-2019 05:17:36 2019-01-15 05:17:36.228  INFO 3283 --- [           main] o.s.c.d.acceptance.test.WoodChuckTests   : App 'log' has instances: {WOODCHUCK-TEST.log-0=http://10.194.6.12:55496, WOODCHUCK-TEST.log-1=http://10.194.6.12:58763}
15-Jan-2019 05:17:36 2019-01-15 05:17:36.228  INFO 3283 --- [           main] o.s.c.d.acceptance.test.WoodChuckTests   : App 'http' has instances: {WOODCHUCK-TEST.http-0=http://10.194.6.12:53113}
15-Jan-2019 05:17:36 2019-01-15 05:17:36.228  INFO 3283 --- [           main] o.s.c.d.acceptance.test.WoodChuckTests   : App 'splitter' has instances: {WOODCHUCK-TEST.splitter-0=http://10.194.6.12:49641}
15-Jan-2019 05:17:36 2019-01-15 05:17:36.228  INFO 3283 --- [           main] o.s.c.d.acceptance.test.WoodChuckTests   : Looking for 'Started HttpSource' in logfile for http
15-Jan-2019 05:17:41 2019-01-15 05:17:41.229  INFO 3283 --- [           main] o.s.c.d.acceptance.test.WoodChuckTests   : Requesting log for app WOODCHUCK-TEST.http-0
15-Jan-2019 05:17:41 2019-01-15 05:17:41.370  INFO 3283 --- [           main] o.s.c.d.acceptance.test.WoodChuckTests   : Retrieved logfile from 'http://10.194.6.12:53113/logfile
15-Jan-2019 05:17:41 2019-01-15 05:17:41.370  INFO 3283 --- [           main] o.s.c.d.acceptance.test.WoodChuckTests   : Matched all 'Started HttpSource' in logfile for instance WOODCHUCK-TEST.http-0 of app http
15-Jan-2019 05:17:41 2019-01-15 05:17:41.370  INFO 3283 --- [           main] o.s.c.d.acceptance.test.WoodChuckTests   : Looking for 'Started SplitterProcessor' in logfile for splitter
15-Jan-2019 05:17:46 2019-01-15 05:17:46.371  INFO 3283 --- [           main] o.s.c.d.acceptance.test.WoodChuckTests   : Requesting log for app WOODCHUCK-TEST.splitter-0
15-Jan-2019 05:17:46 2019-01-15 05:17:46.518  INFO 3283 --- [           main] o.s.c.d.acceptance.test.WoodChuckTests   : Retrieved logfile from 'http://10.194.6.12:49641/logfile
15-Jan-2019 05:17:46 2019-01-15 05:17:46.518  INFO 3283 --- [           main] o.s.c.d.acceptance.test.WoodChuckTests   : Matched all 'Started SplitterProcessor' in logfile for instance WOODCHUCK-TEST.splitter-0 of app splitter
15-Jan-2019 05:17:46 2019-01-15 05:17:46.518  INFO 3283 --- [           main] o.s.c.d.acceptance.test.WoodChuckTests   : Looking for 'Started LogSink' in logfile for log
15-Jan-2019 05:17:51 2019-01-15 05:17:51.518  INFO 3283 --- [           main] o.s.c.d.acceptance.test.WoodChuckTests   : Requesting log for app WOODCHUCK-TEST.log-0
15-Jan-2019 05:17:51 2019-01-15 05:17:51.658  INFO 3283 --- [           main] o.s.c.d.acceptance.test.WoodChuckTests   : Retrieved logfile from 'http://10.194.6.12:55496/logfile
15-Jan-2019 05:17:51 2019-01-15 05:17:51.659  INFO 3283 --- [           main] o.s.c.d.acceptance.test.WoodChuckTests   : Matched all 'Started LogSink' in logfile for instance WOODCHUCK-TEST.log-0 of app log
15-Jan-2019 05:17:51 2019-01-15 05:17:51.719  INFO 3283 --- [           main] o.s.c.d.acceptance.test.WoodChuckTests   : Looking for 'WOODCHUCK-0,How,chuck' in logfile for log
15-Jan-2019 05:17:56 2019-01-15 05:17:56.719  INFO 3283 --- [           main] o.s.c.d.acceptance.test.WoodChuckTests   : Requesting log for app WOODCHUCK-TEST.log-0
15-Jan-2019 05:17:56 2019-01-15 05:17:56.732  INFO 3283 --- [           main] o.s.c.d.acceptance.test.WoodChuckTests   : Retrieved logfile from 'http://10.194.6.12:55496/logfile
15-Jan-2019 05:17:56 2019-01-15 05:17:56.732  INFO 3283 --- [           main] o.s.c.d.acceptance.test.WoodChuckTests   : Matched all 'WOODCHUCK-0,How,chuck' in logfile for instance WOODCHUCK-TEST.log-0 of app log
15-Jan-2019 05:17:56 2019-01-15 05:17:56.732  INFO 3283 --- [           main] o.s.c.d.acceptance.test.WoodChuckTests   : Looking for 'WOODCHUCK-1,much,wood,would,if,a,woodchuck,could' in logfile for log
15-Jan-2019 05:18:01 2019-01-15 05:18:01.732  INFO 3283 --- [           main] o.s.c.d.acceptance.test.WoodChuckTests   : Requesting log for app WOODCHUCK-TEST.log-0
15-Jan-2019 05:18:01 2019-01-15 05:18:01.743  INFO 3283 --- [           main] o.s.c.d.acceptance.test.WoodChuckTests   : Retrieved logfile from 'http://10.194.6.12:55496/logfile
15-Jan-2019 05:18:01 2019-01-15 05:18:01.743  INFO 3283 --- [           main] o.s.c.d.acceptance.test.WoodChuckTests   : Requesting log for app WOODCHUCK-TEST.log-1
15-Jan-2019 05:18:01 2019-01-15 05:18:01.896  INFO 3283 --- [           main] o.s.c.d.acceptance.test.WoodChuckTests   : Retrieved logfile from 'http://10.194.6.12:58763/logfile
15-Jan-2019 05:18:01 2019-01-15 05:18:01.896  INFO 3283 --- [           main] o.s.c.d.acceptance.test.WoodChuckTests   : Matched all 'WOODCHUCK-1,much,wood,would,if,a,woodchuck,could' in logfile for instance WOODCHUCK-TEST.log-1 of app log
15-Jan-2019 05:18:01 2019-01-15 05:18:01.897  INFO 3283 --- [           main] junit.logTestName                        : Test testPartitioning(org.springframework.cloud.dataflow.acceptance.test.WoodChuckTests) Succeeded
15-Jan-2019 05:18:01 2019-01-15 05:18:01.898  INFO 3283 --- [           main] junit.logTestName                        : Finished Test testPartitioning(org.springframework.cloud.dataflow.acceptance.test.WoodChuckTests)
15-Jan-2019 05:18:01 2019-01-15 05:18:01.898  INFO 3283 --- [           main] o.s.c.d.acceptance.test.WoodChuckTests   : Destroy all streams
15-Jan-2019 05:18:01 Tests run: 1, Failures: 0, Errors: 0, Skipped: 0, Time elapsed: 61.623 sec - in org.springframework.cloud.dataflow.acceptance.test.WoodChuckTests
15-Jan-2019 05:18:01 Running org.springframework.cloud.dataflow.acceptance.test.HttpSourceTests
15-Jan-2019 05:18:01 2019-01-15 05:18:01.967  INFO 3283 --- [           main] .b.t.c.SpringBootTestContextBootstrapper : Neither @ContextConfiguration nor @ContextHierarchy found for test class [org.springframework.cloud.dataflow.acceptance.test.HttpSourceTests], using SpringBootContextLoader
15-Jan-2019 05:18:01 2019-01-15 05:18:01.973  INFO 3283 --- [           main] .b.t.c.SpringBootTestContextBootstrapper : Loaded default TestExecutionListener class names from location [META-INF/spring.factories]: [org.springframework.boot.test.mock.mockito.MockitoTestExecutionListener, org.springframework.boot.test.mock.mockito.ResetMocksTestExecutionListener, org.springframework.boot.test.autoconfigure.restdocs.RestDocsTestExecutionListener, org.springframework.boot.test.autoconfigure.web.client.MockRestServiceServerResetTestExecutionListener, org.springframework.boot.test.autoconfigure.web.servlet.MockMvcPrintOnlyOnFailureTestExecutionListener, org.springframework.boot.test.autoconfigure.web.servlet.WebDriverTestExecutionListener, org.springframework.test.context.web.ServletTestExecutionListener, org.springframework.test.context.support.DirtiesContextBeforeModesTestExecutionListener, org.springframework.test.context.support.DependencyInjectionTestExecutionListener, org.springframework.test.context.support.DirtiesContextTestExecutionListener, org.springframework.test.context.transaction.TransactionalTestExecutionListener, org.springframework.test.context.jdbc.SqlScriptsTestExecutionListener]
15-Jan-2019 05:18:01 2019-01-15 05:18:01.987  INFO 3283 --- [           main] .b.t.c.SpringBootTestContextBootstrapper : Using TestExecutionListeners: [org.springframework.test.context.web.ServletTestExecutionListener@75d4a80f, org.springframework.test.context.support.DirtiesContextBeforeModesTestExecutionListener@4596f8f3, org.springframework.boot.test.autoconfigure.SpringBootDependencyInjectionTestExecutionListener@ccf91df, org.springframework.test.context.support.DirtiesContextTestExecutionListener@117d32e, org.springframework.test.context.transaction.TransactionalTestExecutionListener@51d387d3, org.springframework.test.context.jdbc.SqlScriptsTestExecutionListener@2370ac7a, org.springframework.boot.test.autoconfigure.web.servlet.MockMvcPrintOnlyOnFailureTestExecutionListener@534180a2, org.springframework.boot.test.autoconfigure.web.client.MockRestServiceServerResetTestExecutionListener@6cf0a747, org.springframework.boot.test.mock.mockito.ResetMocksTestExecutionListener@21505815, org.springframework.boot.test.autoconfigure.web.servlet.WebDriverTestExecutionListener@7e53339, org.springframework.boot.test.autoconfigure.restdocs.RestDocsTestExecutionListener@58fef7f7, org.springframework.boot.test.mock.mockito.MockitoTestExecutionListener@31ddb930]
15-Jan-2019 05:18:02 2019-01-15 05:18:02.069  INFO 3283 --- [           main] junit.logTestName                        : Starting Test httpSourceTests(org.springframework.cloud.dataflow.acceptance.test.HttpSourceTests)
15-Jan-2019 05:18:02 2019-01-15 05:18:02.070  INFO 3283 --- [           main] o.s.c.d.acceptance.test.HttpSourceTests  : Creating stream 'HTTP-TEST'
15-Jan-2019 05:18:02 2019-01-15 05:18:02.107  INFO 3283 --- [           main] o.s.c.d.acceptance.test.HttpSourceTests  : Deploying stream 'HTTP-TEST' with properties: {app.*.logging.file=${PID}-test.log, app.*.endpoints.logfile.sensitive=false, app.*.management.endpoints.web.exposure.include=*}
15-Jan-2019 05:18:02 2019-01-15 05:18:02.467  INFO 3283 --- [           main] o.s.c.d.acceptance.test.HttpSourceTests  : Checking: Stream=HTTP-TEST, status = deploying, status description = The stream is being deployed.
15-Jan-2019 05:18:02 2019-01-15 05:18:02.467  INFO 3283 --- [           main] o.s.c.d.acceptance.test.HttpSourceTests  : Sleeping to check status of Stream=HTTP-TEST
15-Jan-2019 05:18:07 2019-01-15 05:18:07.477  INFO 3283 --- [           main] o.s.c.d.acceptance.test.HttpSourceTests  : Checking: Stream=HTTP-TEST, status = deploying, status description = The stream is being deployed.
15-Jan-2019 05:18:07 2019-01-15 05:18:07.477  INFO 3283 --- [           main] o.s.c.d.acceptance.test.HttpSourceTests  : Sleeping to check status of Stream=HTTP-TEST
15-Jan-2019 05:18:12 2019-01-15 05:18:12.487  INFO 3283 --- [           main] o.s.c.d.acceptance.test.HttpSourceTests  : Checking: Stream=HTTP-TEST, status = deploying, status description = The stream is being deployed.
15-Jan-2019 05:18:12 2019-01-15 05:18:12.489  INFO 3283 --- [           main] o.s.c.d.acceptance.test.HttpSourceTests  : Sleeping to check status of Stream=HTTP-TEST
15-Jan-2019 05:18:17 2019-01-15 05:18:17.504  INFO 3283 --- [           main] o.s.c.d.acceptance.test.HttpSourceTests  : Checking: Stream=HTTP-TEST, status = deployed, status description = The stream has been successfully deployed
15-Jan-2019 05:18:17 2019-01-15 05:18:17.522  INFO 3283 --- [           main] o.s.c.d.acceptance.test.HttpSourceTests  : Sleeping to check status of Stream=HTTP-TEST
15-Jan-2019 05:18:22 2019-01-15 05:18:22.522  INFO 3283 --- [           main] o.s.c.d.acceptance.test.HttpSourceTests  : Stream 'HTTP-TEST' started with status: deployed
15-Jan-2019 05:18:22 2019-01-15 05:18:22.522  INFO 3283 --- [           main] o.s.c.d.acceptance.test.HttpSourceTests  : App 'log' has instances: {HTTP-TEST.log-0=http://10.194.6.12:37374}
15-Jan-2019 05:18:22 2019-01-15 05:18:22.523  INFO 3283 --- [           main] o.s.c.d.acceptance.test.HttpSourceTests  : App 'http' has instances: {HTTP-TEST.http-0=http://10.194.6.12:29925}
15-Jan-2019 05:18:22 2019-01-15 05:18:22.529  INFO 3283 --- [           main] o.s.c.d.acceptance.test.HttpSourceTests  : Looking for 'Started HttpSource' in logfile for http
15-Jan-2019 05:18:27 2019-01-15 05:18:27.529  INFO 3283 --- [           main] o.s.c.d.acceptance.test.HttpSourceTests  : Requesting log for app HTTP-TEST.http-0
15-Jan-2019 05:18:27 2019-01-15 05:18:27.684  INFO 3283 --- [           main] o.s.c.d.acceptance.test.HttpSourceTests  : Retrieved logfile from 'http://10.194.6.12:29925/logfile
15-Jan-2019 05:18:27 2019-01-15 05:18:27.685  INFO 3283 --- [           main] o.s.c.d.acceptance.test.HttpSourceTests  : Matched all 'Started HttpSource' in logfile for instance HTTP-TEST.http-0 of app http
15-Jan-2019 05:18:27 2019-01-15 05:18:27.685  INFO 3283 --- [           main] o.s.c.d.acceptance.test.HttpSourceTests  : Looking for 'Started LogSink' in logfile for log
15-Jan-2019 05:18:32 2019-01-15 05:18:32.685  INFO 3283 --- [           main] o.s.c.d.acceptance.test.HttpSourceTests  : Requesting log for app HTTP-TEST.log-0
15-Jan-2019 05:18:32 2019-01-15 05:18:32.856  INFO 3283 --- [           main] o.s.c.d.acceptance.test.HttpSourceTests  : Retrieved logfile from 'http://10.194.6.12:37374/logfile
15-Jan-2019 05:18:32 2019-01-15 05:18:32.856  INFO 3283 --- [           main] o.s.c.d.acceptance.test.HttpSourceTests  : Matched all 'Started LogSink' in logfile for instance HTTP-TEST.log-0 of app log
15-Jan-2019 05:18:32 2019-01-15 05:18:32.907  INFO 3283 --- [           main] o.s.c.d.acceptance.test.HttpSourceTests  : Looking for '4336fffc-9c3c-4eae-8f93-a88dbd18a448' in logfile for log
15-Jan-2019 05:18:37 2019-01-15 05:18:37.907  INFO 3283 --- [           main] o.s.c.d.acceptance.test.HttpSourceTests  : Requesting log for app HTTP-TEST.log-0
15-Jan-2019 05:18:37 2019-01-15 05:18:37.920  INFO 3283 --- [           main] o.s.c.d.acceptance.test.HttpSourceTests  : Retrieved logfile from 'http://10.194.6.12:37374/logfile
15-Jan-2019 05:18:37 2019-01-15 05:18:37.921  INFO 3283 --- [           main] o.s.c.d.acceptance.test.HttpSourceTests  : Matched all '4336fffc-9c3c-4eae-8f93-a88dbd18a448' in logfile for instance HTTP-TEST.log-0 of app log
15-Jan-2019 05:18:37 2019-01-15 05:18:37.922  INFO 3283 --- [           main] junit.logTestName                        : Test httpSourceTests(org.springframework.cloud.dataflow.acceptance.test.HttpSourceTests) Succeeded
15-Jan-2019 05:18:37 2019-01-15 05:18:37.922  INFO 3283 --- [           main] junit.logTestName                        : Finished Test httpSourceTests(org.springframework.cloud.dataflow.acceptance.test.HttpSourceTests)
15-Jan-2019 05:18:37 2019-01-15 05:18:37.922  INFO 3283 --- [           main] o.s.c.d.acceptance.test.HttpSourceTests  : Destroy all streams
15-Jan-2019 05:18:37 Tests run: 1, Failures: 0, Errors: 0, Skipped: 0, Time elapsed: 35.994 sec - in org.springframework.cloud.dataflow.acceptance.test.HttpSourceTests
15-Jan-2019 05:18:37 Running org.springframework.cloud.dataflow.acceptance.test.TimestampTaskTests
15-Jan-2019 05:18:37 2019-01-15 05:18:37.969  INFO 3283 --- [           main] o.s.c.support.GenericApplicationContext  : Refreshing org.springframework.context.support.GenericApplicationContext@2b960a7: startup date [Tue Jan 15 05:18:37 UTC 2019]; root of context hierarchy
15-Jan-2019 05:18:38 2019-01-15 05:18:38.089  INFO 3283 --- [           main] junit.logTestName                        : Starting Test timeStampTests(org.springframework.cloud.dataflow.acceptance.test.TimestampTaskTests)
15-Jan-2019 05:18:38 2019-01-15 05:18:38.090  INFO 3283 --- [           main] o.s.c.d.a.test.AbstractTaskTests         : Importing task apps from uri resource: http://repo.spring.io/libs-release/org/springframework/cloud/task/app/spring-cloud-task-app-descriptor/Clark.RELEASE/spring-cloud-task-app-descriptor-Clark.RELEASE.task-apps-maven
15-Jan-2019 05:18:38 2019-01-15 05:18:38.264  INFO 3283 --- [           main] o.s.c.d.a.test.AbstractTaskTests         : Done importing task apps.
15-Jan-2019 05:18:43 2019-01-15 05:18:43.495  INFO 3283 --- [           main] junit.logTestName                        : Test timeStampTests(org.springframework.cloud.dataflow.acceptance.test.TimestampTaskTests) Succeeded
15-Jan-2019 05:18:43 2019-01-15 05:18:43.495  INFO 3283 --- [           main] junit.logTestName                        : Finished Test timeStampTests(org.springframework.cloud.dataflow.acceptance.test.TimestampTaskTests)
15-Jan-2019 05:18:43 2019-01-15 05:18:43.524  INFO 3283 --- [           main] junit.logTestName                        : Starting Test timeStampTestsMultipleLaunch(org.springframework.cloud.dataflow.acceptance.test.TimestampTaskTests)
15-Jan-2019 05:18:53 2019-01-15 05:18:53.866  INFO 3283 --- [           main] junit.logTestName                        : Test timeStampTestsMultipleLaunch(org.springframework.cloud.dataflow.acceptance.test.TimestampTaskTests) Succeeded
15-Jan-2019 05:18:53 2019-01-15 05:18:53.866  INFO 3283 --- [           main] junit.logTestName                        : Finished Test timeStampTestsMultipleLaunch(org.springframework.cloud.dataflow.acceptance.test.TimestampTaskTests)
15-Jan-2019 05:18:53 Tests run: 2, Failures: 0, Errors: 0, Skipped: 0, Time elapsed: 15.908 sec - in org.springframework.cloud.dataflow.acceptance.test.TimestampTaskTests
15-Jan-2019 05:18:53 Running org.springframework.cloud.dataflow.acceptance.test.TickTockTests
15-Jan-2019 05:18:53 2019-01-15 05:18:53.867  INFO 3283 --- [           main] .b.t.c.SpringBootTestContextBootstrapper : Neither @ContextConfiguration nor @ContextHierarchy found for test class [org.springframework.cloud.dataflow.acceptance.test.TickTockTests], using SpringBootContextLoader
15-Jan-2019 05:18:53 2019-01-15 05:18:53.871  INFO 3283 --- [           main] .b.t.c.SpringBootTestContextBootstrapper : Loaded default TestExecutionListener class names from location [META-INF/spring.factories]: [org.springframework.boot.test.mock.mockito.MockitoTestExecutionListener, org.springframework.boot.test.mock.mockito.ResetMocksTestExecutionListener, org.springframework.boot.test.autoconfigure.restdocs.RestDocsTestExecutionListener, org.springframework.boot.test.autoconfigure.web.client.MockRestServiceServerResetTestExecutionListener, org.springframework.boot.test.autoconfigure.web.servlet.MockMvcPrintOnlyOnFailureTestExecutionListener, org.springframework.boot.test.autoconfigure.web.servlet.WebDriverTestExecutionListener, org.springframework.test.context.web.ServletTestExecutionListener, org.springframework.test.context.support.DirtiesContextBeforeModesTestExecutionListener, org.springframework.test.context.support.DependencyInjectionTestExecutionListener, org.springframework.test.context.support.DirtiesContextTestExecutionListener, org.springframework.test.context.transaction.TransactionalTestExecutionListener, org.springframework.test.context.jdbc.SqlScriptsTestExecutionListener]
15-Jan-2019 05:18:53 2019-01-15 05:18:53.873  INFO 3283 --- [           main] .b.t.c.SpringBootTestContextBootstrapper : Using TestExecutionListeners: [org.springframework.test.context.web.ServletTestExecutionListener@1dbd580, org.springframework.test.context.support.DirtiesContextBeforeModesTestExecutionListener@6c101cc1, org.springframework.boot.test.autoconfigure.SpringBootDependencyInjectionTestExecutionListener@7d0d91a1, org.springframework.test.context.support.DirtiesContextTestExecutionListener@7fb48179, org.springframework.test.context.transaction.TransactionalTestExecutionListener@201c3cda, org.springframework.test.context.jdbc.SqlScriptsTestExecutionListener@4c86da0c, org.springframework.boot.test.autoconfigure.web.servlet.MockMvcPrintOnlyOnFailureTestExecutionListener@5d97caa4, org.springframework.boot.test.autoconfigure.web.client.MockRestServiceServerResetTestExecutionListener@6732726, org.springframework.boot.test.mock.mockito.ResetMocksTestExecutionListener@474821de, org.springframework.boot.test.autoconfigure.web.servlet.WebDriverTestExecutionListener@3d64c581, org.springframework.boot.test.autoconfigure.restdocs.RestDocsTestExecutionListener@5ec5ea63, org.springframework.boot.test.mock.mockito.MockitoTestExecutionListener@4190bc8a]
15-Jan-2019 05:18:53 2019-01-15 05:18:53.899  INFO 3283 --- [           main] junit.logTestName                        : Starting Test tickTockUpdateRollbackTests(org.springframework.cloud.dataflow.acceptance.test.TickTockTests)
15-Jan-2019 05:18:53 2019-01-15 05:18:53.907  INFO 3283 --- [           main] junit.logTestName                        : Finished Test tickTockUpdateRollbackTests(org.springframework.cloud.dataflow.acceptance.test.TickTockTests)
15-Jan-2019 05:18:53 2019-01-15 05:18:53.907  INFO 3283 --- [           main] o.s.c.d.acceptance.test.TickTockTests    : Destroy all streams
15-Jan-2019 05:18:53 2019-01-15 05:18:53.935  INFO 3283 --- [           main] junit.logTestName                        : Starting Test tickTockTests(org.springframework.cloud.dataflow.acceptance.test.TickTockTests)
15-Jan-2019 05:18:53 2019-01-15 05:18:53.936  INFO 3283 --- [           main] o.s.c.d.acceptance.test.TickTockTests    : Creating stream 'TICKTOCK'
15-Jan-2019 05:18:53 2019-01-15 05:18:53.948  INFO 3283 --- [           main] o.s.c.d.acceptance.test.TickTockTests    : Deploying stream 'TICKTOCK' with properties: {app.*.logging.file=${PID}-test.log, app.*.endpoints.logfile.sensitive=false, app.log.log.expression='TICKTOCK - TIMESTAMP: '.concat(payload), app.*.management.endpoints.web.exposure.include=*}
15-Jan-2019 05:18:54 2019-01-15 05:18:54.253  INFO 3283 --- [           main] o.s.c.d.acceptance.test.TickTockTests    : Checking: Stream=TICKTOCK, status = deploying, status description = The stream is being deployed.
15-Jan-2019 05:18:54 2019-01-15 05:18:54.254  INFO 3283 --- [           main] o.s.c.d.acceptance.test.TickTockTests    : Sleeping to check status of Stream=TICKTOCK
15-Jan-2019 05:18:59 2019-01-15 05:18:59.275  INFO 3283 --- [           main] o.s.c.d.acceptance.test.TickTockTests    : Checking: Stream=TICKTOCK, status = deploying, status description = The stream is being deployed.
15-Jan-2019 05:18:59 2019-01-15 05:18:59.275  INFO 3283 --- [           main] o.s.c.d.acceptance.test.TickTockTests    : Sleeping to check status of Stream=TICKTOCK
15-Jan-2019 05:19:04 2019-01-15 05:19:04.285  INFO 3283 --- [           main] o.s.c.d.acceptance.test.TickTockTests    : Checking: Stream=TICKTOCK, status = deploying, status description = The stream is being deployed.
15-Jan-2019 05:19:04 2019-01-15 05:19:04.286  INFO 3283 --- [           main] o.s.c.d.acceptance.test.TickTockTests    : Sleeping to check status of Stream=TICKTOCK
15-Jan-2019 05:19:09 2019-01-15 05:19:09.298  INFO 3283 --- [           main] o.s.c.d.acceptance.test.TickTockTests    : Checking: Stream=TICKTOCK, status = deployed, status description = The stream has been successfully deployed
15-Jan-2019 05:19:09 2019-01-15 05:19:09.316  INFO 3283 --- [           main] o.s.c.d.acceptance.test.TickTockTests    : Sleeping to check status of Stream=TICKTOCK
15-Jan-2019 05:19:14 2019-01-15 05:19:14.317  INFO 3283 --- [           main] o.s.c.d.acceptance.test.TickTockTests    : Stream 'TICKTOCK' started with status: deployed
15-Jan-2019 05:19:14 2019-01-15 05:19:14.318  INFO 3283 --- [           main] o.s.c.d.acceptance.test.TickTockTests    : App 'log' has instances: {TICKTOCK.log-0=http://10.194.6.12:26435}
15-Jan-2019 05:19:14 2019-01-15 05:19:14.318  INFO 3283 --- [           main] o.s.c.d.acceptance.test.TickTockTests    : App 'time' has instances: {TICKTOCK.time-0=http://10.194.6.12:42088}
15-Jan-2019 05:19:14 2019-01-15 05:19:14.318  INFO 3283 --- [           main] o.s.c.d.acceptance.test.TickTockTests    : Looking for 'Started TimeSource' in logfile for time
15-Jan-2019 05:19:19 2019-01-15 05:19:19.318  INFO 3283 --- [           main] o.s.c.d.acceptance.test.TickTockTests    : Requesting log for app TICKTOCK.time-0
15-Jan-2019 05:19:19 2019-01-15 05:19:19.497  INFO 3283 --- [           main] o.s.c.d.acceptance.test.TickTockTests    : Retrieved logfile from 'http://10.194.6.12:42088/logfile
15-Jan-2019 05:19:19 2019-01-15 05:19:19.497  INFO 3283 --- [           main] o.s.c.d.acceptance.test.TickTockTests    : Matched all 'Started TimeSource' in logfile for instance TICKTOCK.time-0 of app time
15-Jan-2019 05:19:19 2019-01-15 05:19:19.497  INFO 3283 --- [           main] o.s.c.d.acceptance.test.TickTockTests    : Looking for 'Started LogSink' in logfile for log
15-Jan-2019 05:19:24 2019-01-15 05:19:24.497  INFO 3283 --- [           main] o.s.c.d.acceptance.test.TickTockTests    : Requesting log for app TICKTOCK.log-0
15-Jan-2019 05:19:24 2019-01-15 05:19:24.652  INFO 3283 --- [           main] o.s.c.d.acceptance.test.TickTockTests    : Retrieved logfile from 'http://10.194.6.12:26435/logfile
15-Jan-2019 05:19:24 2019-01-15 05:19:24.653  INFO 3283 --- [           main] o.s.c.d.acceptance.test.TickTockTests    : Matched all 'Started LogSink' in logfile for instance TICKTOCK.log-0 of app log
15-Jan-2019 05:19:24 2019-01-15 05:19:24.653  INFO 3283 --- [           main] o.s.c.d.acceptance.test.TickTockTests    : Looking for 'TICKTOCK - TIMESTAMP:' in logfile for log
15-Jan-2019 05:19:29 2019-01-15 05:19:29.653  INFO 3283 --- [           main] o.s.c.d.acceptance.test.TickTockTests    : Requesting log for app TICKTOCK.log-0
15-Jan-2019 05:19:29 2019-01-15 05:19:29.665  INFO 3283 --- [           main] o.s.c.d.acceptance.test.TickTockTests    : Retrieved logfile from 'http://10.194.6.12:26435/logfile
15-Jan-2019 05:19:29 2019-01-15 05:19:29.665  INFO 3283 --- [           main] o.s.c.d.acceptance.test.TickTockTests    : Matched all 'TICKTOCK - TIMESTAMP:' in logfile for instance TICKTOCK.log-0 of app log
15-Jan-2019 05:19:29 2019-01-15 05:19:29.666  INFO 3283 --- [           main] junit.logTestName                        : Test tickTockTests(org.springframework.cloud.dataflow.acceptance.test.TickTockTests) Succeeded
15-Jan-2019 05:19:29 2019-01-15 05:19:29.667  INFO 3283 --- [           main] junit.logTestName                        : Finished Test tickTockTests(org.springframework.cloud.dataflow.acceptance.test.TickTockTests)
15-Jan-2019 05:19:29 2019-01-15 05:19:29.667  INFO 3283 --- [           main] o.s.c.d.acceptance.test.TickTockTests    : Destroy all streams
15-Jan-2019 05:19:29 2019-01-15 05:19:29.770  INFO 3283 --- [           main] junit.logTestName                        : Starting Test tickTockTestsFromConfigServer(org.springframework.cloud.dataflow.acceptance.test.TickTockTests)
15-Jan-2019 05:19:29 2019-01-15 05:19:29.774  INFO 3283 --- [           main] junit.logTestName                        : Finished Test tickTockTestsFromConfigServer(org.springframework.cloud.dataflow.acceptance.test.TickTockTests)
15-Jan-2019 05:19:29 2019-01-15 05:19:29.774  INFO 3283 --- [           main] o.s.c.d.acceptance.test.TickTockTests    : Destroy all streams
15-Jan-2019 05:19:29 Tests run: 3, Failures: 0, Errors: 0, Skipped: 2, Time elapsed: 35.931 sec - in org.springframework.cloud.dataflow.acceptance.test.TickTockTests
15-Jan-2019 05:19:29 Running org.springframework.cloud.dataflow.acceptance.test.TransformTests
15-Jan-2019 05:19:29 2019-01-15 05:19:29.802  INFO 3283 --- [           main] .b.t.c.SpringBootTestContextBootstrapper : Neither @ContextConfiguration nor @ContextHierarchy found for test class [org.springframework.cloud.dataflow.acceptance.test.TransformTests], using SpringBootContextLoader
15-Jan-2019 05:19:29 2019-01-15 05:19:29.813  INFO 3283 --- [           main] .b.t.c.SpringBootTestContextBootstrapper : Loaded default TestExecutionListener class names from location [META-INF/spring.factories]: [org.springframework.boot.test.mock.mockito.MockitoTestExecutionListener, org.springframework.boot.test.mock.mockito.ResetMocksTestExecutionListener, org.springframework.boot.test.autoconfigure.restdocs.RestDocsTestExecutionListener, org.springframework.boot.test.autoconfigure.web.client.MockRestServiceServerResetTestExecutionListener, org.springframework.boot.test.autoconfigure.web.servlet.MockMvcPrintOnlyOnFailureTestExecutionListener, org.springframework.boot.test.autoconfigure.web.servlet.WebDriverTestExecutionListener, org.springframework.test.context.web.ServletTestExecutionListener, org.springframework.test.context.support.DirtiesContextBeforeModesTestExecutionListener, org.springframework.test.context.support.DependencyInjectionTestExecutionListener, org.springframework.test.context.support.DirtiesContextTestExecutionListener, org.springframework.test.context.transaction.TransactionalTestExecutionListener, org.springframework.test.context.jdbc.SqlScriptsTestExecutionListener]
15-Jan-2019 05:19:29 2019-01-15 05:19:29.815  INFO 3283 --- [           main] .b.t.c.SpringBootTestContextBootstrapper : Using TestExecutionListeners: [org.springframework.test.context.web.ServletTestExecutionListener@4779aae6, org.springframework.test.context.support.DirtiesContextBeforeModesTestExecutionListener@2cd62003, org.springframework.boot.test.autoconfigure.SpringBootDependencyInjectionTestExecutionListener@61ab89b0, org.springframework.test.context.support.DirtiesContextTestExecutionListener@5478ce1e, org.springframework.test.context.transaction.TransactionalTestExecutionListener@5edc70ed, org.springframework.test.context.jdbc.SqlScriptsTestExecutionListener@4317850d, org.springframework.boot.test.autoconfigure.web.servlet.MockMvcPrintOnlyOnFailureTestExecutionListener@7e4c72d6, org.springframework.boot.test.autoconfigure.web.client.MockRestServiceServerResetTestExecutionListener@6cd64b3f, org.springframework.boot.test.mock.mockito.ResetMocksTestExecutionListener@51b01550, org.springframework.boot.test.autoconfigure.web.servlet.WebDriverTestExecutionListener@2ef0dd86, org.springframework.boot.test.autoconfigure.restdocs.RestDocsTestExecutionListener@3337d04c, org.springframework.boot.test.mock.mockito.MockitoTestExecutionListener@6de6faa6]
15-Jan-2019 05:19:29 2019-01-15 05:19:29.883  INFO 3283 --- [           main] junit.logTestName                        : Starting Test transformTests(org.springframework.cloud.dataflow.acceptance.test.TransformTests)
15-Jan-2019 05:19:29 2019-01-15 05:19:29.884  INFO 3283 --- [           main] o.s.c.d.acceptance.test.TransformTests   : Creating stream 'TRANSFORM-TEST'
15-Jan-2019 05:19:29 2019-01-15 05:19:29.902  INFO 3283 --- [           main] o.s.c.d.acceptance.test.TransformTests   : Deploying stream 'TRANSFORM-TEST' with properties: {app.*.logging.file=${PID}-test.log, app.*.endpoints.logfile.sensitive=false, app.*.management.endpoints.web.exposure.include=*}
15-Jan-2019 05:19:30 2019-01-15 05:19:30.356  INFO 3283 --- [           main] o.s.c.d.acceptance.test.TransformTests   : Checking: Stream=TRANSFORM-TEST, status = deploying, status description = The stream is being deployed.
15-Jan-2019 05:19:30 2019-01-15 05:19:30.356  INFO 3283 --- [           main] o.s.c.d.acceptance.test.TransformTests   : Sleeping to check status of Stream=TRANSFORM-TEST
15-Jan-2019 05:19:35 2019-01-15 05:19:35.369  INFO 3283 --- [           main] o.s.c.d.acceptance.test.TransformTests   : Checking: Stream=TRANSFORM-TEST, status = deploying, status description = The stream is being deployed.
15-Jan-2019 05:19:35 2019-01-15 05:19:35.369  INFO 3283 --- [           main] o.s.c.d.acceptance.test.TransformTests   : Sleeping to check status of Stream=TRANSFORM-TEST
15-Jan-2019 05:19:40 2019-01-15 05:19:40.378  INFO 3283 --- [           main] o.s.c.d.acceptance.test.TransformTests   : Checking: Stream=TRANSFORM-TEST, status = deploying, status description = The stream is being deployed.
15-Jan-2019 05:19:40 2019-01-15 05:19:40.379  INFO 3283 --- [           main] o.s.c.d.acceptance.test.TransformTests   : Sleeping to check status of Stream=TRANSFORM-TEST
15-Jan-2019 05:19:45 2019-01-15 05:19:45.389  INFO 3283 --- [           main] o.s.c.d.acceptance.test.TransformTests   : Checking: Stream=TRANSFORM-TEST, status = deploying, status description = The stream is being deployed.
15-Jan-2019 05:19:45 2019-01-15 05:19:45.389  INFO 3283 --- [           main] o.s.c.d.acceptance.test.TransformTests   : Sleeping to check status of Stream=TRANSFORM-TEST
15-Jan-2019 05:19:50 2019-01-15 05:19:50.430  INFO 3283 --- [           main] o.s.c.d.acceptance.test.TransformTests   : Checking: Stream=TRANSFORM-TEST, status = deploying, status description = The stream is being deployed.
15-Jan-2019 05:19:50 2019-01-15 05:19:50.431  INFO 3283 --- [           main] o.s.c.d.acceptance.test.TransformTests   : Sleeping to check status of Stream=TRANSFORM-TEST
15-Jan-2019 05:19:55 2019-01-15 05:19:55.442  INFO 3283 --- [           main] o.s.c.d.acceptance.test.TransformTests   : Checking: Stream=TRANSFORM-TEST, status = deployed, status description = The stream has been successfully deployed
15-Jan-2019 05:19:55 2019-01-15 05:19:55.465  INFO 3283 --- [           main] o.s.c.d.acceptance.test.TransformTests   : Sleeping to check status of Stream=TRANSFORM-TEST
15-Jan-2019 05:20:00 2019-01-15 05:20:00.465  INFO 3283 --- [           main] o.s.c.d.acceptance.test.TransformTests   : Stream 'TRANSFORM-TEST' started with status: deployed
15-Jan-2019 05:20:00 2019-01-15 05:20:00.465  INFO 3283 --- [           main] o.s.c.d.acceptance.test.TransformTests   : App 'transform' has instances: {TRANSFORM-TEST.transform-0=http://10.194.6.12:26074}
15-Jan-2019 05:20:00 2019-01-15 05:20:00.465  INFO 3283 --- [           main] o.s.c.d.acceptance.test.TransformTests   : App 'log' has instances: {TRANSFORM-TEST.log-0=http://10.194.6.12:38129}
15-Jan-2019 05:20:00 2019-01-15 05:20:00.465  INFO 3283 --- [           main] o.s.c.d.acceptance.test.TransformTests   : App 'http' has instances: {TRANSFORM-TEST.http-0=http://10.194.6.12:39217}
15-Jan-2019 05:20:00 2019-01-15 05:20:00.466  INFO 3283 --- [           main] o.s.c.d.acceptance.test.TransformTests   : Looking for 'Started HttpSource' in logfile for http
15-Jan-2019 05:20:05 2019-01-15 05:20:05.466  INFO 3283 --- [           main] o.s.c.d.acceptance.test.TransformTests   : Requesting log for app TRANSFORM-TEST.http-0
15-Jan-2019 05:20:05 2019-01-15 05:20:05.624  INFO 3283 --- [           main] o.s.c.d.acceptance.test.TransformTests   : Retrieved logfile from 'http://10.194.6.12:39217/logfile
15-Jan-2019 05:20:05 2019-01-15 05:20:05.625  INFO 3283 --- [           main] o.s.c.d.acceptance.test.TransformTests   : Matched all 'Started HttpSource' in logfile for instance TRANSFORM-TEST.http-0 of app http
15-Jan-2019 05:20:05 2019-01-15 05:20:05.653  INFO 3283 --- [           main] o.s.c.d.acceptance.test.TransformTests   : Looking for 'Started LogSink' in logfile for log
15-Jan-2019 05:20:10 2019-01-15 05:20:10.653  INFO 3283 --- [           main] o.s.c.d.acceptance.test.TransformTests   : Requesting log for app TRANSFORM-TEST.log-0
15-Jan-2019 05:20:10 2019-01-15 05:20:10.821  INFO 3283 --- [           main] o.s.c.d.acceptance.test.TransformTests   : Retrieved logfile from 'http://10.194.6.12:38129/logfile
15-Jan-2019 05:20:10 2019-01-15 05:20:10.821  INFO 3283 --- [           main] o.s.c.d.acceptance.test.TransformTests   : Matched all 'Started LogSink' in logfile for instance TRANSFORM-TEST.log-0 of app log
15-Jan-2019 05:20:10 2019-01-15 05:20:10.821  INFO 3283 --- [           main] o.s.c.d.acceptance.test.TransformTests   : Looking for 'ABCDEFG' in logfile for log
15-Jan-2019 05:20:15 2019-01-15 05:20:15.821  INFO 3283 --- [           main] o.s.c.d.acceptance.test.TransformTests   : Requesting log for app TRANSFORM-TEST.log-0
15-Jan-2019 05:20:15 2019-01-15 05:20:15.833  INFO 3283 --- [           main] o.s.c.d.acceptance.test.TransformTests   : Retrieved logfile from 'http://10.194.6.12:38129/logfile
15-Jan-2019 05:20:15 2019-01-15 05:20:15.833  INFO 3283 --- [           main] o.s.c.d.acceptance.test.TransformTests   : Matched all 'ABCDEFG' in logfile for instance TRANSFORM-TEST.log-0 of app log
15-Jan-2019 05:20:15 2019-01-15 05:20:15.836  INFO 3283 --- [           main] junit.logTestName                        : Test transformTests(org.springframework.cloud.dataflow.acceptance.test.TransformTests) Succeeded
15-Jan-2019 05:20:15 2019-01-15 05:20:15.837  INFO 3283 --- [           main] junit.logTestName                        : Finished Test transformTests(org.springframework.cloud.dataflow.acceptance.test.TransformTests)
15-Jan-2019 05:20:15 2019-01-15 05:20:15.837  INFO 3283 --- [           main] o.s.c.d.acceptance.test.TransformTests   : Destroy all streams
15-Jan-2019 05:20:16 Tests run: 1, Failures: 0, Errors: 0, Skipped: 0, Time elapsed: 46.216 sec - in org.springframework.cloud.dataflow.acceptance.test.TransformTests
15-Jan-2019 05:20:16 Running org.springframework.cloud.dataflow.acceptance.test.SchedulerTests
15-Jan-2019 05:20:16 2019-01-15 05:20:16.225  INFO 3283 --- [           main] s.c.a.AnnotationConfigApplicationContext : Refreshing org.springframework.context.annotation.AnnotationConfigApplicationContext@75babb67: startup date [Tue Jan 15 05:20:16 UTC 2019]; root of context hierarchy
15-Jan-2019 05:20:16 2019-01-15 05:20:16.272  INFO 3283 --- [           main] trationDelegate$BeanPostProcessorChecker : Bean 'configurationPropertiesRebinderAutoConfiguration' of type [class org.springframework.cloud.autoconfigure.ConfigurationPropertiesRebinderAutoConfiguration$$EnhancerBySpringCGLIB$$44458212] is not eligible for getting processed by all BeanPostProcessors (for example: not eligible for auto-proxying)
15-Jan-2019 05:20:16
15-Jan-2019 05:20:16   .   ____          _            __ _ _
15-Jan-2019 05:20:16 /\\ / ___'_ __ _ _(_)_ __  __ _ \ \ \ \
15-Jan-2019 05:20:16 ( ( )\___ | '_ | '_| | '_ \/ _` | \ \ \ \
15-Jan-2019 05:20:16 \\/  ___)| |_)| | | | | || (_| |  ) ) ) )
15-Jan-2019 05:20:16   '  |____| .__|_| |_|_| |_\__, | / / / /
15-Jan-2019 05:20:16 =========|_|==============|___/=/_/_/_/
15-Jan-2019 05:20:16 :: Spring Boot ::        (v1.4.1.RELEASE)
15-Jan-2019 05:20:16
15-Jan-2019 05:20:16 2019-01-15 05:20:16.391  INFO 3283 --- [           main] c.c.c.ConfigServicePropertySourceLocator : Fetching config from server at: http://localhost:8888
15-Jan-2019 05:20:16 2019-01-15 05:20:16.393  WARN 3283 --- [           main] c.c.c.ConfigServicePropertySourceLocator : Could not locate PropertySource: I/O error on GET request for "http://localhost:8888//blah": Connection refused (Connection refused); nested exception is java.net.ConnectException: Connection refused (Connection refused)
15-Jan-2019 05:20:16 2019-01-15 05:20:16.394  INFO 3283 --- [           main] o.a.maven.surefire.booter.ForkedBooter   : The following profiles are active: blah
15-Jan-2019 05:20:16 2019-01-15 05:20:16.396  INFO 3283 --- [           main] s.c.a.AnnotationConfigApplicationContext : Refreshing org.springframework.context.annotation.AnnotationConfigApplicationContext@1642eeae: startup date [Tue Jan 15 05:20:16 UTC 2019]; parent: org.springframework.context.annotation.AnnotationConfigApplicationContext@75babb67
15-Jan-2019 05:20:16 2019-01-15 05:20:16.449  INFO 3283 --- [           main] o.a.maven.surefire.booter.ForkedBooter   : Started ForkedBooter in 0.408 seconds (JVM running for 240.001)
15-Jan-2019 05:20:16 2019-01-15 05:20:16.450  INFO 3283 --- [           main] s.c.a.AnnotationConfigApplicationContext : Closing org.springframework.context.annotation.AnnotationConfigApplicationContext@1642eeae: startup date [Tue Jan 15 05:20:16 UTC 2019]; parent: org.springframework.context.annotation.AnnotationConfigApplicationContext@75babb67
15-Jan-2019 05:20:16 2019-01-15 05:20:16.452 ERROR 3283 --- [           main] o.s.c.d.a.test.util.SchedulerRule        : SCHEDULER IS NOT AVAILABLE, SKIPPING TESTS
15-Jan-2019 05:20:16
15-Jan-2019 05:20:16 java.lang.IllegalArgumentException: no SchedulerOperations bean is available.  Skipping test.
15-Jan-2019 05:20:16         at org.springframework.util.Assert.notNull(Assert.java:115)
15-Jan-2019 05:20:16         at org.springframework.cloud.dataflow.acceptance.test.util.SchedulerRule.obtainResource(SchedulerRule.java:57)
15-Jan-2019 05:20:16         at org.springframework.cloud.scheduler.spi.junit.AbstractExternalResourceTestSupport.apply(AbstractExternalResourceTestSupport.java:58)
15-Jan-2019 05:20:16         at org.junit.rules.RunRules.applyAll(RunRules.java:26)
15-Jan-2019 05:20:16         at org.junit.rules.RunRules.<init>(RunRules.java:15)
15-Jan-2019 05:20:16         at org.junit.runners.ParentRunner.withClassRules(ParentRunner.java:245)
15-Jan-2019 05:20:16         at org.junit.runners.ParentRunner.classBlock(ParentRunner.java:194)
15-Jan-2019 05:20:16         at org.junit.runners.ParentRunner.run(ParentRunner.java:362)
15-Jan-2019 05:20:16         at org.springframework.test.context.junit4.SpringJUnit4ClassRunner.run(SpringJUnit4ClassRunner.java:191)
15-Jan-2019 05:20:16         at org.apache.maven.surefire.junit4.JUnit4Provider.execute(JUnit4Provider.java:283)
15-Jan-2019 05:20:16         at org.apache.maven.surefire.junit4.JUnit4Provider.executeWithRerun(JUnit4Provider.java:173)
15-Jan-2019 05:20:16         at org.apache.maven.surefire.junit4.JUnit4Provider.executeTestSet(JUnit4Provider.java:153)
15-Jan-2019 05:20:16         at org.apache.maven.surefire.junit4.JUnit4Provider.invoke(JUnit4Provider.java:128)
15-Jan-2019 05:20:16         at org.apache.maven.surefire.booter.ForkedBooter.invokeProviderInSameClassLoader(ForkedBooter.java:203)
15-Jan-2019 05:20:16         at org.apache.maven.surefire.booter.ForkedBooter.runSuitesInProcess(ForkedBooter.java:155)
15-Jan-2019 05:20:16         at org.apache.maven.surefire.booter.ForkedBooter.main(ForkedBooter.java:103)
15-Jan-2019 05:20:16
15-Jan-2019 05:20:16 Tests run: 1, Failures: 0, Errors: 0, Skipped: 1, Time elapsed: 0.421 sec - in org.springframework.cloud.dataflow.acceptance.test.SchedulerTests
15-Jan-2019 05:20:16 Running org.springframework.cloud.dataflow.acceptance.test.NamedChannelTests
15-Jan-2019 05:20:16 2019-01-15 05:20:16.460  INFO 3283 --- [           main] .b.t.c.SpringBootTestContextBootstrapper : Neither @ContextConfiguration nor @ContextHierarchy found for test class [org.springframework.cloud.dataflow.acceptance.test.NamedChannelTests], using SpringBootContextLoader
15-Jan-2019 05:20:16 2019-01-15 05:20:16.465  INFO 3283 --- [           main] .b.t.c.SpringBootTestContextBootstrapper : Loaded default TestExecutionListener class names from location [META-INF/spring.factories]: [org.springframework.boot.test.mock.mockito.MockitoTestExecutionListener, org.springframework.boot.test.mock.mockito.ResetMocksTestExecutionListener, org.springframework.boot.test.autoconfigure.restdocs.RestDocsTestExecutionListener, org.springframework.boot.test.autoconfigure.web.client.MockRestServiceServerResetTestExecutionListener, org.springframework.boot.test.autoconfigure.web.servlet.MockMvcPrintOnlyOnFailureTestExecutionListener, org.springframework.boot.test.autoconfigure.web.servlet.WebDriverTestExecutionListener, org.springframework.test.context.web.ServletTestExecutionListener, org.springframework.test.context.support.DirtiesContextBeforeModesTestExecutionListener, org.springframework.test.context.support.DependencyInjectionTestExecutionListener, org.springframework.test.context.support.DirtiesContextTestExecutionListener, org.springframework.test.context.transaction.TransactionalTestExecutionListener, org.springframework.test.context.jdbc.SqlScriptsTestExecutionListener]
15-Jan-2019 05:20:16 2019-01-15 05:20:16.468  INFO 3283 --- [           main] .b.t.c.SpringBootTestContextBootstrapper : Using TestExecutionListeners: [org.springframework.test.context.web.ServletTestExecutionListener@416d56f2, org.springframework.test.context.support.DirtiesContextBeforeModesTestExecutionListener@6e31d989, org.springframework.boot.test.autoconfigure.SpringBootDependencyInjectionTestExecutionListener@1b01a0d, org.springframework.test.context.support.DirtiesContextTestExecutionListener@2ed71727, org.springframework.test.context.transaction.TransactionalTestExecutionListener@5261ec9, org.springframework.test.context.jdbc.SqlScriptsTestExecutionListener@65bb6275, org.springframework.boot.test.autoconfigure.web.servlet.MockMvcPrintOnlyOnFailureTestExecutionListener@64da6cbd, org.springframework.boot.test.autoconfigure.web.client.MockRestServiceServerResetTestExecutionListener@72a2312e, org.springframework.boot.test.mock.mockito.ResetMocksTestExecutionListener@47c7a9e5, org.springframework.boot.test.autoconfigure.web.servlet.WebDriverTestExecutionListener@7951c3a2, org.springframework.boot.test.autoconfigure.restdocs.RestDocsTestExecutionListener@4ed9f7b1, org.springframework.boot.test.mock.mockito.MockitoTestExecutionListener@2d119405]
15-Jan-2019 05:20:16 2019-01-15 05:20:16.499  INFO 3283 --- [           main] junit.logTestName                        : Starting Test testDestination(org.springframework.cloud.dataflow.acceptance.test.NamedChannelTests)
15-Jan-2019 05:20:16 2019-01-15 05:20:16.501  INFO 3283 --- [           main] o.s.c.d.a.test.NamedChannelTests         : Creating stream 'LOG-DESTINATION-SINK'
15-Jan-2019 05:20:16 2019-01-15 05:20:16.512  INFO 3283 --- [           main] o.s.c.d.a.test.NamedChannelTests         : Deploying stream 'LOG-DESTINATION-SINK' with properties: {app.*.logging.file=${PID}-test.log, app.*.endpoints.logfile.sensitive=false, app.*.management.endpoints.web.exposure.include=*}
15-Jan-2019 05:20:16 2019-01-15 05:20:16.652  INFO 3283 --- [           main] o.s.c.d.a.test.NamedChannelTests         : Checking: Stream=LOG-DESTINATION-SINK, status = deploying, status description = The stream is being deployed.
15-Jan-2019 05:20:16 2019-01-15 05:20:16.652  INFO 3283 --- [           main] o.s.c.d.a.test.NamedChannelTests         : Sleeping to check status of Stream=LOG-DESTINATION-SINK
15-Jan-2019 05:20:21 2019-01-15 05:20:21.660  INFO 3283 --- [           main] o.s.c.d.a.test.NamedChannelTests         : Checking: Stream=LOG-DESTINATION-SINK, status = deploying, status description = The stream is being deployed.
15-Jan-2019 05:20:21 2019-01-15 05:20:21.660  INFO 3283 --- [           main] o.s.c.d.a.test.NamedChannelTests         : Sleeping to check status of Stream=LOG-DESTINATION-SINK
15-Jan-2019 05:20:26 2019-01-15 05:20:26.668  INFO 3283 --- [           main] o.s.c.d.a.test.NamedChannelTests         : Checking: Stream=LOG-DESTINATION-SINK, status = deployed, status description = The stream has been successfully deployed
15-Jan-2019 05:20:26 2019-01-15 05:20:26.681  INFO 3283 --- [           main] o.s.c.d.a.test.NamedChannelTests         : Sleeping to check status of Stream=LOG-DESTINATION-SINK
15-Jan-2019 05:20:31 2019-01-15 05:20:31.682  INFO 3283 --- [           main] o.s.c.d.a.test.NamedChannelTests         : Stream 'LOG-DESTINATION-SINK' started with status: deployed
15-Jan-2019 05:20:31 2019-01-15 05:20:31.682  INFO 3283 --- [           main] o.s.c.d.a.test.NamedChannelTests         : App 'log' has instances: {LOG-DESTINATION-SINK.log-0=http://10.194.6.12:37187}
15-Jan-2019 05:20:31 2019-01-15 05:20:31.684  INFO 3283 --- [           main] o.s.c.d.a.test.NamedChannelTests         : Looking for 'Started LogSink' in logfile for log
15-Jan-2019 05:20:36 2019-01-15 05:20:36.684  INFO 3283 --- [           main] o.s.c.d.a.test.NamedChannelTests         : Requesting log for app LOG-DESTINATION-SINK.log-0
15-Jan-2019 05:20:36 2019-01-15 05:20:36.824  INFO 3283 --- [           main] o.s.c.d.a.test.NamedChannelTests         : Retrieved logfile from 'http://10.194.6.12:37187/logfile
15-Jan-2019 05:20:36 2019-01-15 05:20:36.824  INFO 3283 --- [           main] o.s.c.d.a.test.NamedChannelTests         : Matched all 'Started LogSink' in logfile for instance LOG-DESTINATION-SINK.log-0 of app log
15-Jan-2019 05:20:36 2019-01-15 05:20:36.825  INFO 3283 --- [           main] o.s.c.d.a.test.NamedChannelTests         : Creating stream 'HTTP-DESTINATION-SOURCE'
15-Jan-2019 05:20:36 2019-01-15 05:20:36.837  INFO 3283 --- [           main] o.s.c.d.a.test.NamedChannelTests         : Deploying stream 'HTTP-DESTINATION-SOURCE' with properties: {app.*.logging.file=${PID}-test.log, app.*.endpoints.logfile.sensitive=false, app.*.management.endpoints.web.exposure.include=*}
15-Jan-2019 05:20:36 2019-01-15 05:20:36.973  INFO 3283 --- [           main] o.s.c.d.a.test.NamedChannelTests         : Checking: Stream=HTTP-DESTINATION-SOURCE, status = deploying, status description = The stream is being deployed.
15-Jan-2019 05:20:36 2019-01-15 05:20:36.973  INFO 3283 --- [           main] o.s.c.d.a.test.NamedChannelTests         : Sleeping to check status of Stream=HTTP-DESTINATION-SOURCE
15-Jan-2019 05:20:41 2019-01-15 05:20:41.987  INFO 3283 --- [           main] o.s.c.d.a.test.NamedChannelTests         : Checking: Stream=HTTP-DESTINATION-SOURCE, status = deploying, status description = The stream is being deployed.
15-Jan-2019 05:20:41 2019-01-15 05:20:41.987  INFO 3283 --- [           main] o.s.c.d.a.test.NamedChannelTests         : Sleeping to check status of Stream=HTTP-DESTINATION-SOURCE
15-Jan-2019 05:20:46 2019-01-15 05:20:46.999  INFO 3283 --- [           main] o.s.c.d.a.test.NamedChannelTests         : Checking: Stream=HTTP-DESTINATION-SOURCE, status = deployed, status description = The stream has been successfully deployed
15-Jan-2019 05:20:47 2019-01-15 05:20:47.011  INFO 3283 --- [           main] o.s.c.d.a.test.NamedChannelTests         : Sleeping to check status of Stream=HTTP-DESTINATION-SOURCE
15-Jan-2019 05:20:52 2019-01-15 05:20:52.011  INFO 3283 --- [           main] o.s.c.d.a.test.NamedChannelTests         : Stream 'HTTP-DESTINATION-SOURCE' started with status: deployed
15-Jan-2019 05:20:52 2019-01-15 05:20:52.012  INFO 3283 --- [           main] o.s.c.d.a.test.NamedChannelTests         : App 'http' has instances: {HTTP-DESTINATION-SOURCE.http-0=http://10.194.6.12:51720}
15-Jan-2019 05:20:52 2019-01-15 05:20:52.012  INFO 3283 --- [           main] o.s.c.d.a.test.NamedChannelTests         : Looking for 'Started HttpSource' in logfile for http
15-Jan-2019 05:20:57 2019-01-15 05:20:57.012  INFO 3283 --- [           main] o.s.c.d.a.test.NamedChannelTests         : Requesting log for app HTTP-DESTINATION-SOURCE.http-0
15-Jan-2019 05:20:57 2019-01-15 05:20:57.160  INFO 3283 --- [           main] o.s.c.d.a.test.NamedChannelTests         : Retrieved logfile from 'http://10.194.6.12:51720/logfile
15-Jan-2019 05:20:57 2019-01-15 05:20:57.161  INFO 3283 --- [           main] o.s.c.d.a.test.NamedChannelTests         : Matched all 'Started HttpSource' in logfile for instance HTTP-DESTINATION-SOURCE.http-0 of app http
15-Jan-2019 05:20:57 2019-01-15 05:20:57.189  INFO 3283 --- [           main] o.s.c.d.a.test.NamedChannelTests         : Looking for 'abcdefg' in logfile for log
15-Jan-2019 05:21:02 2019-01-15 05:21:02.189  INFO 3283 --- [           main] o.s.c.d.a.test.NamedChannelTests         : Requesting log for app LOG-DESTINATION-SINK.log-0
15-Jan-2019 05:21:02 2019-01-15 05:21:02.211  INFO 3283 --- [           main] o.s.c.d.a.test.NamedChannelTests         : Retrieved logfile from 'http://10.194.6.12:37187/logfile
15-Jan-2019 05:21:02 2019-01-15 05:21:02.211  INFO 3283 --- [           main] o.s.c.d.a.test.NamedChannelTests         : Matched all 'abcdefg' in logfile for instance LOG-DESTINATION-SINK.log-0 of app log
15-Jan-2019 05:21:02 2019-01-15 05:21:02.212  INFO 3283 --- [           main] junit.logTestName                        : Test testDestination(org.springframework.cloud.dataflow.acceptance.test.NamedChannelTests) Succeeded
15-Jan-2019 05:21:02 2019-01-15 05:21:02.212  INFO 3283 --- [           main] junit.logTestName                        : Finished Test testDestination(org.springframework.cloud.dataflow.acceptance.test.NamedChannelTests)
15-Jan-2019 05:21:02 2019-01-15 05:21:02.212  INFO 3283 --- [           main] o.s.c.d.a.test.NamedChannelTests         : Destroy all streams
15-Jan-2019 05:21:02 2019-01-15 05:21:02.282  INFO 3283 --- [           main] junit.logTestName                        : Starting Test testTap(org.springframework.cloud.dataflow.acceptance.test.NamedChannelTests)
15-Jan-2019 05:21:02 2019-01-15 05:21:02.283  INFO 3283 --- [           main] o.s.c.d.a.test.NamedChannelTests         : Creating stream 'TAPHTTP'
15-Jan-2019 05:21:02 2019-01-15 05:21:02.320  INFO 3283 --- [           main] o.s.c.d.a.test.NamedChannelTests         : Deploying stream 'TAPHTTP' with properties: {app.*.logging.file=${PID}-test.log, app.*.endpoints.logfile.sensitive=false, app.*.management.endpoints.web.exposure.include=*}
15-Jan-2019 05:21:02 2019-01-15 05:21:02.613  INFO 3283 --- [           main] o.s.c.d.a.test.NamedChannelTests         : Checking: Stream=TAPHTTP, status = deploying, status description = The stream is being deployed.
15-Jan-2019 05:21:02 2019-01-15 05:21:02.614  INFO 3283 --- [           main] o.s.c.d.a.test.NamedChannelTests         : Sleeping to check status of Stream=TAPHTTP
15-Jan-2019 05:21:07 2019-01-15 05:21:07.625  INFO 3283 --- [           main] o.s.c.d.a.test.NamedChannelTests         : Checking: Stream=TAPHTTP, status = deploying, status description = The stream is being deployed.
15-Jan-2019 05:21:07 2019-01-15 05:21:07.625  INFO 3283 --- [           main] o.s.c.d.a.test.NamedChannelTests         : Sleeping to check status of Stream=TAPHTTP
15-Jan-2019 05:21:12 2019-01-15 05:21:12.644  INFO 3283 --- [           main] o.s.c.d.a.test.NamedChannelTests         : Checking: Stream=TAPHTTP, status = deploying, status description = The stream is being deployed.
15-Jan-2019 05:21:12 2019-01-15 05:21:12.644  INFO 3283 --- [           main] o.s.c.d.a.test.NamedChannelTests         : Sleeping to check status of Stream=TAPHTTP
15-Jan-2019 05:21:17 2019-01-15 05:21:17.655  INFO 3283 --- [           main] o.s.c.d.a.test.NamedChannelTests         : Checking: Stream=TAPHTTP, status = deployed, status description = The stream has been successfully deployed
15-Jan-2019 05:21:17 2019-01-15 05:21:17.672  INFO 3283 --- [           main] o.s.c.d.a.test.NamedChannelTests         : Sleeping to check status of Stream=TAPHTTP
15-Jan-2019 05:21:22 2019-01-15 05:21:22.672  INFO 3283 --- [           main] o.s.c.d.a.test.NamedChannelTests         : Stream 'TAPHTTP' started with status: deployed
15-Jan-2019 05:21:22 2019-01-15 05:21:22.673  INFO 3283 --- [           main] o.s.c.d.a.test.NamedChannelTests         : App 'log' has instances: {TAPHTTP.log-0=http://10.194.6.12:27874}
15-Jan-2019 05:21:22 2019-01-15 05:21:22.673  INFO 3283 --- [           main] o.s.c.d.a.test.NamedChannelTests         : App 'http' has instances: {TAPHTTP.http-0=http://10.194.6.12:48076}
15-Jan-2019 05:21:22 2019-01-15 05:21:22.673  INFO 3283 --- [           main] o.s.c.d.a.test.NamedChannelTests         : Looking for 'Started HttpSource' in logfile for http
15-Jan-2019 05:21:27 2019-01-15 05:21:27.673  INFO 3283 --- [           main] o.s.c.d.a.test.NamedChannelTests         : Requesting log for app TAPHTTP.http-0
15-Jan-2019 05:21:27 2019-01-15 05:21:27.837  INFO 3283 --- [           main] o.s.c.d.a.test.NamedChannelTests         : Retrieved logfile from 'http://10.194.6.12:48076/logfile
15-Jan-2019 05:21:27 2019-01-15 05:21:27.837  INFO 3283 --- [           main] o.s.c.d.a.test.NamedChannelTests         : Matched all 'Started HttpSource' in logfile for instance TAPHTTP.http-0 of app http
15-Jan-2019 05:21:27 2019-01-15 05:21:27.837  INFO 3283 --- [           main] o.s.c.d.a.test.NamedChannelTests         : Looking for 'Started LogSink' in logfile for log
15-Jan-2019 05:21:32 2019-01-15 05:21:32.837  INFO 3283 --- [           main] o.s.c.d.a.test.NamedChannelTests         : Requesting log for app TAPHTTP.log-0
15-Jan-2019 05:21:32 2019-01-15 05:21:32.988  INFO 3283 --- [           main] o.s.c.d.a.test.NamedChannelTests         : Retrieved logfile from 'http://10.194.6.12:27874/logfile
15-Jan-2019 05:21:32 2019-01-15 05:21:32.989  INFO 3283 --- [           main] o.s.c.d.a.test.NamedChannelTests         : Matched all 'Started LogSink' in logfile for instance TAPHTTP.log-0 of app log
15-Jan-2019 05:21:32 2019-01-15 05:21:32.989  INFO 3283 --- [           main] o.s.c.d.a.test.NamedChannelTests         : Creating stream 'TAPSTREAM'
15-Jan-2019 05:21:33 2019-01-15 05:21:32.999  INFO 3283 --- [           main] o.s.c.d.a.test.NamedChannelTests         : Deploying stream 'TAPSTREAM' with properties: {app.*.logging.file=${PID}-test.log, app.*.endpoints.logfile.sensitive=false, app.*.management.endpoints.web.exposure.include=*}
15-Jan-2019 05:21:33 2019-01-15 05:21:33.152  INFO 3283 --- [           main] o.s.c.d.a.test.NamedChannelTests         : Checking: Stream=TAPSTREAM, status = deploying, status description = The stream is being deployed.
15-Jan-2019 05:21:33 2019-01-15 05:21:33.152  INFO 3283 --- [           main] o.s.c.d.a.test.NamedChannelTests         : Sleeping to check status of Stream=TAPSTREAM
15-Jan-2019 05:21:38 2019-01-15 05:21:38.162  INFO 3283 --- [           main] o.s.c.d.a.test.NamedChannelTests         : Checking: Stream=TAPSTREAM, status = deploying, status description = The stream is being deployed.
15-Jan-2019 05:21:38 2019-01-15 05:21:38.163  INFO 3283 --- [           main] o.s.c.d.a.test.NamedChannelTests         : Sleeping to check status of Stream=TAPSTREAM
15-Jan-2019 05:21:43 2019-01-15 05:21:43.171  INFO 3283 --- [           main] o.s.c.d.a.test.NamedChannelTests         : Checking: Stream=TAPSTREAM, status = deployed, status description = The stream has been successfully deployed
15-Jan-2019 05:21:43 2019-01-15 05:21:43.182  INFO 3283 --- [           main] o.s.c.d.a.test.NamedChannelTests         : Sleeping to check status of Stream=TAPSTREAM
15-Jan-2019 05:21:48 2019-01-15 05:21:48.182  INFO 3283 --- [           main] o.s.c.d.a.test.NamedChannelTests         : Stream 'TAPSTREAM' started with status: deployed
15-Jan-2019 05:21:48 2019-01-15 05:21:48.183  INFO 3283 --- [           main] o.s.c.d.a.test.NamedChannelTests         : App 'log' has instances: {TAPSTREAM.log-0=http://10.194.6.12:27964}
15-Jan-2019 05:21:48 2019-01-15 05:21:48.183  INFO 3283 --- [           main] o.s.c.d.a.test.NamedChannelTests         : Looking for 'Started LogSink' in logfile for log
15-Jan-2019 05:21:53 2019-01-15 05:21:53.183  INFO 3283 --- [           main] o.s.c.d.a.test.NamedChannelTests         : Requesting log for app TAPSTREAM.log-0
15-Jan-2019 05:21:53 2019-01-15 05:21:53.327  INFO 3283 --- [           main] o.s.c.d.a.test.NamedChannelTests         : Retrieved logfile from 'http://10.194.6.12:27964/logfile
15-Jan-2019 05:21:53 2019-01-15 05:21:53.328  INFO 3283 --- [           main] o.s.c.d.a.test.NamedChannelTests         : Matched all 'Started LogSink' in logfile for instance TAPSTREAM.log-0 of app log
15-Jan-2019 05:21:53 2019-01-15 05:21:53.386  INFO 3283 --- [           main] o.s.c.d.a.test.NamedChannelTests         : Looking for 'abcdefg' in logfile for log
15-Jan-2019 05:21:58 2019-01-15 05:21:58.386  INFO 3283 --- [           main] o.s.c.d.a.test.NamedChannelTests         : Requesting log for app TAPSTREAM.log-0
15-Jan-2019 05:21:58 2019-01-15 05:21:58.401  INFO 3283 --- [           main] o.s.c.d.a.test.NamedChannelTests         : Retrieved logfile from 'http://10.194.6.12:27964/logfile
15-Jan-2019 05:21:58 2019-01-15 05:21:58.401  INFO 3283 --- [           main] o.s.c.d.a.test.NamedChannelTests         : Matched all 'abcdefg' in logfile for instance TAPSTREAM.log-0 of app log
15-Jan-2019 05:21:58 2019-01-15 05:21:58.402  INFO 3283 --- [           main] junit.logTestName                        : Test testTap(org.springframework.cloud.dataflow.acceptance.test.NamedChannelTests) Succeeded
15-Jan-2019 05:21:58 2019-01-15 05:21:58.402  INFO 3283 --- [           main] junit.logTestName                        : Finished Test testTap(org.springframework.cloud.dataflow.acceptance.test.NamedChannelTests)
15-Jan-2019 05:21:58 2019-01-15 05:21:58.402  INFO 3283 --- [           main] o.s.c.d.a.test.NamedChannelTests         : Destroy all streams
15-Jan-2019 05:21:58 2019-01-15 05:21:58.522  INFO 3283 --- [           main] junit.logTestName                        : Starting Test manyToOneTest(org.springframework.cloud.dataflow.acceptance.test.NamedChannelTests)
15-Jan-2019 05:21:58 2019-01-15 05:21:58.527  INFO 3283 --- [           main] o.s.c.d.a.test.NamedChannelTests         : Creating stream 'MANY-TO-ONE'
15-Jan-2019 05:21:58 2019-01-15 05:21:58.546  INFO 3283 --- [           main] o.s.c.d.a.test.NamedChannelTests         : Deploying stream 'MANY-TO-ONE' with properties: {app.*.logging.file=${PID}-test.log, app.*.endpoints.logfile.sensitive=false, app.*.management.endpoints.web.exposure.include=*}
15-Jan-2019 05:21:58 2019-01-15 05:21:58.730  INFO 3283 --- [           main] o.s.c.d.a.test.NamedChannelTests         : Checking: Stream=MANY-TO-ONE, status = deploying, status description = The stream is being deployed.
15-Jan-2019 05:21:58 2019-01-15 05:21:58.730  INFO 3283 --- [           main] o.s.c.d.a.test.NamedChannelTests         : Sleeping to check status of Stream=MANY-TO-ONE
15-Jan-2019 05:22:03 2019-01-15 05:22:03.742  INFO 3283 --- [           main] o.s.c.d.a.test.NamedChannelTests         : Checking: Stream=MANY-TO-ONE, status = deploying, status description = The stream is being deployed.
15-Jan-2019 05:22:03 2019-01-15 05:22:03.742  INFO 3283 --- [           main] o.s.c.d.a.test.NamedChannelTests         : Sleeping to check status of Stream=MANY-TO-ONE
15-Jan-2019 05:22:08 2019-01-15 05:22:08.753  INFO 3283 --- [           main] o.s.c.d.a.test.NamedChannelTests         : Checking: Stream=MANY-TO-ONE, status = deployed, status description = The stream has been successfully deployed
15-Jan-2019 05:22:08 2019-01-15 05:22:08.763  INFO 3283 --- [           main] o.s.c.d.a.test.NamedChannelTests         : Sleeping to check status of Stream=MANY-TO-ONE
15-Jan-2019 05:22:13 2019-01-15 05:22:13.764  INFO 3283 --- [           main] o.s.c.d.a.test.NamedChannelTests         : Stream 'MANY-TO-ONE' started with status: deployed
15-Jan-2019 05:22:13 2019-01-15 05:22:13.764  INFO 3283 --- [           main] o.s.c.d.a.test.NamedChannelTests         : App 'log' has instances: {MANY-TO-ONE.log-0=http://10.194.6.12:42537}
15-Jan-2019 05:22:13 2019-01-15 05:22:13.764  INFO 3283 --- [           main] o.s.c.d.a.test.NamedChannelTests         : Looking for 'Started LogSink' in logfile for log
15-Jan-2019 05:22:18 2019-01-15 05:22:18.764  INFO 3283 --- [           main] o.s.c.d.a.test.NamedChannelTests         : Requesting log for app MANY-TO-ONE.log-0
15-Jan-2019 05:22:18 2019-01-15 05:22:18.925  INFO 3283 --- [           main] o.s.c.d.a.test.NamedChannelTests         : Retrieved logfile from 'http://10.194.6.12:42537/logfile
15-Jan-2019 05:22:18 2019-01-15 05:22:18.926  INFO 3283 --- [           main] o.s.c.d.a.test.NamedChannelTests         : Matched all 'Started LogSink' in logfile for instance MANY-TO-ONE.log-0 of app log
15-Jan-2019 05:22:18 2019-01-15 05:22:18.926  INFO 3283 --- [           main] o.s.c.d.a.test.NamedChannelTests         : Creating stream 'HTTP-SOURCE-1'
15-Jan-2019 05:22:18 2019-01-15 05:22:18.944  INFO 3283 --- [           main] o.s.c.d.a.test.NamedChannelTests         : Deploying stream 'HTTP-SOURCE-1' with properties: {app.*.logging.file=${PID}-test.log, app.*.endpoints.logfile.sensitive=false, app.*.management.endpoints.web.exposure.include=*}
15-Jan-2019 05:22:19 2019-01-15 05:22:19.088  INFO 3283 --- [           main] o.s.c.d.a.test.NamedChannelTests         : Checking: Stream=HTTP-SOURCE-1, status = deploying, status description = The stream is being deployed.
15-Jan-2019 05:22:19 2019-01-15 05:22:19.088  INFO 3283 --- [           main] o.s.c.d.a.test.NamedChannelTests         : Sleeping to check status of Stream=HTTP-SOURCE-1
15-Jan-2019 05:22:24 2019-01-15 05:22:24.098  INFO 3283 --- [           main] o.s.c.d.a.test.NamedChannelTests         : Checking: Stream=HTTP-SOURCE-1, status = deploying, status description = The stream is being deployed.
15-Jan-2019 05:22:24 2019-01-15 05:22:24.098  INFO 3283 --- [           main] o.s.c.d.a.test.NamedChannelTests         : Sleeping to check status of Stream=HTTP-SOURCE-1
15-Jan-2019 05:22:29 2019-01-15 05:22:29.107  INFO 3283 --- [           main] o.s.c.d.a.test.NamedChannelTests         : Checking: Stream=HTTP-SOURCE-1, status = deployed, status description = The stream has been successfully deployed
15-Jan-2019 05:22:29 2019-01-15 05:22:29.115  INFO 3283 --- [           main] o.s.c.d.a.test.NamedChannelTests         : Sleeping to check status of Stream=HTTP-SOURCE-1
15-Jan-2019 05:22:34 2019-01-15 05:22:34.115  INFO 3283 --- [           main] o.s.c.d.a.test.NamedChannelTests         : Stream 'HTTP-SOURCE-1' started with status: deployed
15-Jan-2019 05:22:34 2019-01-15 05:22:34.115  INFO 3283 --- [           main] o.s.c.d.a.test.NamedChannelTests         : App 'http' has instances: {HTTP-SOURCE-1.http-0=http://10.194.6.12:20345}
15-Jan-2019 05:22:34 2019-01-15 05:22:34.116  INFO 3283 --- [           main] o.s.c.d.a.test.NamedChannelTests         : Looking for 'Started HttpSource' in logfile for http
15-Jan-2019 05:22:39 2019-01-15 05:22:39.116  INFO 3283 --- [           main] o.s.c.d.a.test.NamedChannelTests         : Requesting log for app HTTP-SOURCE-1.http-0
15-Jan-2019 05:22:39 2019-01-15 05:22:39.261  INFO 3283 --- [           main] o.s.c.d.a.test.NamedChannelTests         : Retrieved logfile from 'http://10.194.6.12:20345/logfile
15-Jan-2019 05:22:39 2019-01-15 05:22:39.261  INFO 3283 --- [           main] o.s.c.d.a.test.NamedChannelTests         : Matched all 'Started HttpSource' in logfile for instance HTTP-SOURCE-1.http-0 of app http
15-Jan-2019 05:22:39 2019-01-15 05:22:39.261  INFO 3283 --- [           main] o.s.c.d.a.test.NamedChannelTests         : Creating stream 'HTTP-SOURCE-2'
15-Jan-2019 05:22:39 2019-01-15 05:22:39.271  INFO 3283 --- [           main] o.s.c.d.a.test.NamedChannelTests         : Deploying stream 'HTTP-SOURCE-2' with properties: {app.*.logging.file=${PID}-test.log, app.*.endpoints.logfile.sensitive=false, app.*.management.endpoints.web.exposure.include=*}
15-Jan-2019 05:22:39 2019-01-15 05:22:39.417  INFO 3283 --- [           main] o.s.c.d.a.test.NamedChannelTests         : Checking: Stream=HTTP-SOURCE-2, status = deploying, status description = The stream is being deployed.
15-Jan-2019 05:22:39 2019-01-15 05:22:39.417  INFO 3283 --- [           main] o.s.c.d.a.test.NamedChannelTests         : Sleeping to check status of Stream=HTTP-SOURCE-2
15-Jan-2019 05:22:44 2019-01-15 05:22:44.428  INFO 3283 --- [           main] o.s.c.d.a.test.NamedChannelTests         : Checking: Stream=HTTP-SOURCE-2, status = deploying, status description = The stream is being deployed.
15-Jan-2019 05:22:44 2019-01-15 05:22:44.428  INFO 3283 --- [           main] o.s.c.d.a.test.NamedChannelTests         : Sleeping to check status of Stream=HTTP-SOURCE-2
15-Jan-2019 05:22:49 2019-01-15 05:22:49.438  INFO 3283 --- [           main] o.s.c.d.a.test.NamedChannelTests         : Checking: Stream=HTTP-SOURCE-2, status = deployed, status description = The stream has been successfully deployed
15-Jan-2019 05:22:49 2019-01-15 05:22:49.460  INFO 3283 --- [           main] o.s.c.d.a.test.NamedChannelTests         : Sleeping to check status of Stream=HTTP-SOURCE-2
15-Jan-2019 05:22:54 2019-01-15 05:22:54.461  INFO 3283 --- [           main] o.s.c.d.a.test.NamedChannelTests         : Stream 'HTTP-SOURCE-2' started with status: deployed
15-Jan-2019 05:22:54 2019-01-15 05:22:54.461  INFO 3283 --- [           main] o.s.c.d.a.test.NamedChannelTests         : App 'http' has instances: {HTTP-SOURCE-2.http-0=http://10.194.6.12:54447}
15-Jan-2019 05:22:54 2019-01-15 05:22:54.461  INFO 3283 --- [           main] o.s.c.d.a.test.NamedChannelTests         : Looking for 'Started HttpSource' in logfile for http
15-Jan-2019 05:22:59 2019-01-15 05:22:59.461  INFO 3283 --- [           main] o.s.c.d.a.test.NamedChannelTests         : Requesting log for app HTTP-SOURCE-2.http-0
15-Jan-2019 05:22:59 2019-01-15 05:22:59.611  INFO 3283 --- [           main] o.s.c.d.a.test.NamedChannelTests         : Retrieved logfile from 'http://10.194.6.12:54447/logfile
15-Jan-2019 05:22:59 2019-01-15 05:22:59.611  INFO 3283 --- [           main] o.s.c.d.a.test.NamedChannelTests         : Matched all 'Started HttpSource' in logfile for instance HTTP-SOURCE-2.http-0 of app http
15-Jan-2019 05:22:59 2019-01-15 05:22:59.644  INFO 3283 --- [           main] o.s.c.d.a.test.NamedChannelTests         : Looking for 'abcdefg' in logfile for log
15-Jan-2019 05:23:04 2019-01-15 05:23:04.644  INFO 3283 --- [           main] o.s.c.d.a.test.NamedChannelTests         : Requesting log for app MANY-TO-ONE.log-0
15-Jan-2019 05:23:04 2019-01-15 05:23:04.662  INFO 3283 --- [           main] o.s.c.d.a.test.NamedChannelTests         : Retrieved logfile from 'http://10.194.6.12:42537/logfile
15-Jan-2019 05:23:04 2019-01-15 05:23:04.662  INFO 3283 --- [           main] o.s.c.d.a.test.NamedChannelTests         : Matched all 'abcdefg' in logfile for instance MANY-TO-ONE.log-0 of app log
15-Jan-2019 05:23:04 2019-01-15 05:23:04.687  INFO 3283 --- [           main] o.s.c.d.a.test.NamedChannelTests         : Looking for 'hijklmn' in logfile for log
15-Jan-2019 05:23:09 2019-01-15 05:23:09.687  INFO 3283 --- [           main] o.s.c.d.a.test.NamedChannelTests         : Requesting log for app MANY-TO-ONE.log-0
15-Jan-2019 05:23:09 2019-01-15 05:23:09.697  INFO 3283 --- [           main] o.s.c.d.a.test.NamedChannelTests         : Retrieved logfile from 'http://10.194.6.12:42537/logfile
15-Jan-2019 05:23:09 2019-01-15 05:23:09.697  INFO 3283 --- [           main] o.s.c.d.a.test.NamedChannelTests         : Matched all 'hijklmn' in logfile for instance MANY-TO-ONE.log-0 of app log
15-Jan-2019 05:23:09 2019-01-15 05:23:09.698  INFO 3283 --- [           main] junit.logTestName                        : Test manyToOneTest(org.springframework.cloud.dataflow.acceptance.test.NamedChannelTests) Succeeded
15-Jan-2019 05:23:09 2019-01-15 05:23:09.698  INFO 3283 --- [           main] junit.logTestName                        : Finished Test manyToOneTest(org.springframework.cloud.dataflow.acceptance.test.NamedChannelTests)
15-Jan-2019 05:23:09 2019-01-15 05:23:09.698  INFO 3283 --- [           main] o.s.c.d.a.test.NamedChannelTests         : Destroy all streams
15-Jan-2019 05:23:09 2019-01-15 05:23:09.790  INFO 3283 --- [           main] junit.logTestName                        : Starting Test directedGraphTest(org.springframework.cloud.dataflow.acceptance.test.NamedChannelTests)
15-Jan-2019 05:23:09 2019-01-15 05:23:09.791  INFO 3283 --- [           main] o.s.c.d.a.test.NamedChannelTests         : Creating stream 'DIRECTED-GRAPH-DESTINATION1'
15-Jan-2019 05:23:09 2019-01-15 05:23:09.819  INFO 3283 --- [           main] o.s.c.d.a.test.NamedChannelTests         : Deploying stream 'DIRECTED-GRAPH-DESTINATION1' with properties: {app.*.logging.file=${PID}-test.log, app.*.endpoints.logfile.sensitive=false, app.*.management.endpoints.web.exposure.include=*}
15-Jan-2019 05:23:10 2019-01-15 05:23:10.151  INFO 3283 --- [           main] o.s.c.d.a.test.NamedChannelTests         : Checking: Stream=DIRECTED-GRAPH-DESTINATION1, status = deploying, status description = The stream is being deployed.
15-Jan-2019 05:23:10 2019-01-15 05:23:10.151  INFO 3283 --- [           main] o.s.c.d.a.test.NamedChannelTests         : Sleeping to check status of Stream=DIRECTED-GRAPH-DESTINATION1
15-Jan-2019 05:23:15 2019-01-15 05:23:15.160  INFO 3283 --- [           main] o.s.c.d.a.test.NamedChannelTests         : Checking: Stream=DIRECTED-GRAPH-DESTINATION1, status = deploying, status description = The stream is being deployed.
15-Jan-2019 05:23:15 2019-01-15 05:23:15.161  INFO 3283 --- [           main] o.s.c.d.a.test.NamedChannelTests         : Sleeping to check status of Stream=DIRECTED-GRAPH-DESTINATION1
15-Jan-2019 05:23:20 2019-01-15 05:23:20.170  INFO 3283 --- [           main] o.s.c.d.a.test.NamedChannelTests         : Checking: Stream=DIRECTED-GRAPH-DESTINATION1, status = deploying, status description = The stream is being deployed.
15-Jan-2019 05:23:20 2019-01-15 05:23:20.170  INFO 3283 --- [           main] o.s.c.d.a.test.NamedChannelTests         : Sleeping to check status of Stream=DIRECTED-GRAPH-DESTINATION1
15-Jan-2019 05:23:25 2019-01-15 05:23:25.177  INFO 3283 --- [           main] o.s.c.d.a.test.NamedChannelTests         : Checking: Stream=DIRECTED-GRAPH-DESTINATION1, status = deployed, status description = The stream has been successfully deployed
15-Jan-2019 05:23:25 2019-01-15 05:23:25.188  INFO 3283 --- [           main] o.s.c.d.a.test.NamedChannelTests         : Sleeping to check status of Stream=DIRECTED-GRAPH-DESTINATION1
15-Jan-2019 05:23:30 2019-01-15 05:23:30.188  INFO 3283 --- [           main] o.s.c.d.a.test.NamedChannelTests         : Stream 'DIRECTED-GRAPH-DESTINATION1' started with status: deployed
15-Jan-2019 05:23:30 2019-01-15 05:23:30.189  INFO 3283 --- [           main] o.s.c.d.a.test.NamedChannelTests         : App 'transform' has instances: {DIRECTED-GRAPH-DESTINATION1.transform-0=http://10.194.6.12:31289}
15-Jan-2019 05:23:30 2019-01-15 05:23:30.189  INFO 3283 --- [           main] o.s.c.d.a.test.NamedChannelTests         : App 'log' has instances: {DIRECTED-GRAPH-DESTINATION1.log-0=http://10.194.6.12:44398}
15-Jan-2019 05:23:30 2019-01-15 05:23:30.189  INFO 3283 --- [           main] o.s.c.d.a.test.NamedChannelTests         : Looking for 'Started LogSink' in logfile for log
15-Jan-2019 05:23:35 2019-01-15 05:23:35.189  INFO 3283 --- [           main] o.s.c.d.a.test.NamedChannelTests         : Requesting log for app DIRECTED-GRAPH-DESTINATION1.log-0
15-Jan-2019 05:23:35 2019-01-15 05:23:35.326  INFO 3283 --- [           main] o.s.c.d.a.test.NamedChannelTests         : Retrieved logfile from 'http://10.194.6.12:44398/logfile
15-Jan-2019 05:23:35 2019-01-15 05:23:35.326  INFO 3283 --- [           main] o.s.c.d.a.test.NamedChannelTests         : Matched all 'Started LogSink' in logfile for instance DIRECTED-GRAPH-DESTINATION1.log-0 of app log
15-Jan-2019 05:23:35 2019-01-15 05:23:35.326  INFO 3283 --- [           main] o.s.c.d.a.test.NamedChannelTests         : Creating stream 'DIRECTED-GRAPH-DESTINATION2'
15-Jan-2019 05:23:35 2019-01-15 05:23:35.338  INFO 3283 --- [           main] o.s.c.d.a.test.NamedChannelTests         : Deploying stream 'DIRECTED-GRAPH-DESTINATION2' with properties: {app.*.logging.file=${PID}-test.log, app.*.endpoints.logfile.sensitive=false, app.*.management.endpoints.web.exposure.include=*}
15-Jan-2019 05:23:35 2019-01-15 05:23:35.627  INFO 3283 --- [           main] o.s.c.d.a.test.NamedChannelTests         : Checking: Stream=DIRECTED-GRAPH-DESTINATION2, status = deploying, status description = The stream is being deployed.
15-Jan-2019 05:23:35 2019-01-15 05:23:35.627  INFO 3283 --- [           main] o.s.c.d.a.test.NamedChannelTests         : Sleeping to check status of Stream=DIRECTED-GRAPH-DESTINATION2
15-Jan-2019 05:23:40 2019-01-15 05:23:40.636  INFO 3283 --- [           main] o.s.c.d.a.test.NamedChannelTests         : Checking: Stream=DIRECTED-GRAPH-DESTINATION2, status = deploying, status description = The stream is being deployed.
15-Jan-2019 05:23:40 2019-01-15 05:23:40.636  INFO 3283 --- [           main] o.s.c.d.a.test.NamedChannelTests         : Sleeping to check status of Stream=DIRECTED-GRAPH-DESTINATION2
15-Jan-2019 05:23:45 2019-01-15 05:23:45.647  INFO 3283 --- [           main] o.s.c.d.a.test.NamedChannelTests         : Checking: Stream=DIRECTED-GRAPH-DESTINATION2, status = deploying, status description = The stream is being deployed.
15-Jan-2019 05:23:45 2019-01-15 05:23:45.647  INFO 3283 --- [           main] o.s.c.d.a.test.NamedChannelTests         : Sleeping to check status of Stream=DIRECTED-GRAPH-DESTINATION2
15-Jan-2019 05:23:50 2019-01-15 05:23:50.659  INFO 3283 --- [           main] o.s.c.d.a.test.NamedChannelTests         : Checking: Stream=DIRECTED-GRAPH-DESTINATION2, status = deployed, status description = The stream has been successfully deployed
15-Jan-2019 05:23:50 2019-01-15 05:23:50.696  INFO 3283 --- [           main] o.s.c.d.a.test.NamedChannelTests         : Sleeping to check status of Stream=DIRECTED-GRAPH-DESTINATION2
15-Jan-2019 05:23:55 2019-01-15 05:23:55.697  INFO 3283 --- [           main] o.s.c.d.a.test.NamedChannelTests         : Stream 'DIRECTED-GRAPH-DESTINATION2' started with status: deployed
15-Jan-2019 05:23:55 2019-01-15 05:23:55.697  INFO 3283 --- [           main] o.s.c.d.a.test.NamedChannelTests         : App 'transform' has instances: {DIRECTED-GRAPH-DESTINATION2.transform-0=http://10.194.6.12:54654}
15-Jan-2019 05:23:55 2019-01-15 05:23:55.697  INFO 3283 --- [           main] o.s.c.d.a.test.NamedChannelTests         : App 'log' has instances: {DIRECTED-GRAPH-DESTINATION2.log-0=http://10.194.6.12:30291}
15-Jan-2019 05:23:55 2019-01-15 05:23:55.697  INFO 3283 --- [           main] o.s.c.d.a.test.NamedChannelTests         : Looking for 'Started LogSink' in logfile for log
15-Jan-2019 05:24:00 2019-01-15 05:24:00.697  INFO 3283 --- [           main] o.s.c.d.a.test.NamedChannelTests         : Requesting log for app DIRECTED-GRAPH-DESTINATION2.log-0
15-Jan-2019 05:24:00 2019-01-15 05:24:00.875  INFO 3283 --- [           main] o.s.c.d.a.test.NamedChannelTests         : Retrieved logfile from 'http://10.194.6.12:30291/logfile
15-Jan-2019 05:24:00 2019-01-15 05:24:00.875  INFO 3283 --- [           main] o.s.c.d.a.test.NamedChannelTests         : Matched all 'Started LogSink' in logfile for instance DIRECTED-GRAPH-DESTINATION2.log-0 of app log
15-Jan-2019 05:24:00 2019-01-15 05:24:00.875  INFO 3283 --- [           main] o.s.c.d.a.test.NamedChannelTests         : Creating stream 'DIRECTED-GRAPH-HTTP-SOURCE'
15-Jan-2019 05:24:00 2019-01-15 05:24:00.886  INFO 3283 --- [           main] o.s.c.d.a.test.NamedChannelTests         : Deploying stream 'DIRECTED-GRAPH-HTTP-SOURCE' with properties: {app.*.logging.file=${PID}-test.log, app.*.endpoints.logfile.sensitive=false, app.*.management.endpoints.web.exposure.include=*}
15-Jan-2019 05:24:01 2019-01-15 05:24:01.155  INFO 3283 --- [           main] o.s.c.d.a.test.NamedChannelTests         : Checking: Stream=DIRECTED-GRAPH-HTTP-SOURCE, status = deploying, status description = The stream is being deployed.
15-Jan-2019 05:24:01 2019-01-15 05:24:01.156  INFO 3283 --- [           main] o.s.c.d.a.test.NamedChannelTests         : Sleeping to check status of Stream=DIRECTED-GRAPH-HTTP-SOURCE
15-Jan-2019 05:24:06 2019-01-15 05:24:06.174  INFO 3283 --- [           main] o.s.c.d.a.test.NamedChannelTests         : Checking: Stream=DIRECTED-GRAPH-HTTP-SOURCE, status = deploying, status description = The stream is being deployed.
15-Jan-2019 05:24:06 2019-01-15 05:24:06.174  INFO 3283 --- [           main] o.s.c.d.a.test.NamedChannelTests         : Sleeping to check status of Stream=DIRECTED-GRAPH-HTTP-SOURCE
15-Jan-2019 05:24:11 2019-01-15 05:24:11.192  INFO 3283 --- [           main] o.s.c.d.a.test.NamedChannelTests         : Checking: Stream=DIRECTED-GRAPH-HTTP-SOURCE, status = deploying, status description = The stream is being deployed.
15-Jan-2019 05:24:11 2019-01-15 05:24:11.192  INFO 3283 --- [           main] o.s.c.d.a.test.NamedChannelTests         : Sleeping to check status of Stream=DIRECTED-GRAPH-HTTP-SOURCE
15-Jan-2019 05:24:16 2019-01-15 05:24:16.219  INFO 3283 --- [           main] o.s.c.d.a.test.NamedChannelTests         : Checking: Stream=DIRECTED-GRAPH-HTTP-SOURCE, status = deployed, status description = The stream has been successfully deployed
15-Jan-2019 05:24:16 2019-01-15 05:24:16.275  INFO 3283 --- [           main] o.s.c.d.a.test.NamedChannelTests         : Sleeping to check status of Stream=DIRECTED-GRAPH-HTTP-SOURCE
15-Jan-2019 05:24:21 2019-01-15 05:24:21.275  INFO 3283 --- [           main] o.s.c.d.a.test.NamedChannelTests         : Stream 'DIRECTED-GRAPH-HTTP-SOURCE' started with status: deployed
15-Jan-2019 05:24:21 2019-01-15 05:24:21.275  INFO 3283 --- [           main] o.s.c.d.a.test.NamedChannelTests         : App 'router' has instances: {DIRECTED-GRAPH-HTTP-SOURCE.router-0=http://10.194.6.12:48210}
15-Jan-2019 05:24:21 2019-01-15 05:24:21.275  INFO 3283 --- [           main] o.s.c.d.a.test.NamedChannelTests         : App 'http' has instances: {DIRECTED-GRAPH-HTTP-SOURCE.http-0=http://10.194.6.12:53041}
15-Jan-2019 05:24:21 2019-01-15 05:24:21.275  INFO 3283 --- [           main] o.s.c.d.a.test.NamedChannelTests         : Looking for 'Started HttpSource' in logfile for http
15-Jan-2019 05:24:26 2019-01-15 05:24:26.275  INFO 3283 --- [           main] o.s.c.d.a.test.NamedChannelTests         : Requesting log for app DIRECTED-GRAPH-HTTP-SOURCE.http-0
15-Jan-2019 05:24:26 2019-01-15 05:24:26.414  INFO 3283 --- [           main] o.s.c.d.a.test.NamedChannelTests         : Retrieved logfile from 'http://10.194.6.12:53041/logfile
15-Jan-2019 05:24:26 2019-01-15 05:24:26.414  INFO 3283 --- [           main] o.s.c.d.a.test.NamedChannelTests         : Matched all 'Started HttpSource' in logfile for instance DIRECTED-GRAPH-HTTP-SOURCE.http-0 of app http
15-Jan-2019 05:24:26 2019-01-15 05:24:26.454  INFO 3283 --- [           main] o.s.c.d.a.test.NamedChannelTests         : Looking for 'abcd-foo' in logfile for log
15-Jan-2019 05:24:31 2019-01-15 05:24:31.454  INFO 3283 --- [           main] o.s.c.d.a.test.NamedChannelTests         : Requesting log for app DIRECTED-GRAPH-DESTINATION1.log-0
15-Jan-2019 05:24:31 2019-01-15 05:24:31.468  INFO 3283 --- [           main] o.s.c.d.a.test.NamedChannelTests         : Retrieved logfile from 'http://10.194.6.12:44398/logfile
15-Jan-2019 05:24:31 2019-01-15 05:24:31.468  INFO 3283 --- [           main] o.s.c.d.a.test.NamedChannelTests         : Matched all 'abcd-foo' in logfile for instance DIRECTED-GRAPH-DESTINATION1.log-0 of app log
15-Jan-2019 05:24:31 2019-01-15 05:24:31.468  INFO 3283 --- [           main] o.s.c.d.a.test.NamedChannelTests         : Looking for 'defg-bar' in logfile for log
15-Jan-2019 05:24:36 2019-01-15 05:24:36.468  INFO 3283 --- [           main] o.s.c.d.a.test.NamedChannelTests         : Requesting log for app DIRECTED-GRAPH-DESTINATION2.log-0
15-Jan-2019 05:24:36 2019-01-15 05:24:36.490  INFO 3283 --- [           main] o.s.c.d.a.test.NamedChannelTests         : Retrieved logfile from 'http://10.194.6.12:30291/logfile
15-Jan-2019 05:24:36 2019-01-15 05:24:36.491  INFO 3283 --- [           main] o.s.c.d.a.test.NamedChannelTests         : Matched all 'defg-bar' in logfile for instance DIRECTED-GRAPH-DESTINATION2.log-0 of app log
15-Jan-2019 05:24:36 2019-01-15 05:24:36.492  INFO 3283 --- [           main] junit.logTestName                        : Test directedGraphTest(org.springframework.cloud.dataflow.acceptance.test.NamedChannelTests) Succeeded
15-Jan-2019 05:24:36 2019-01-15 05:24:36.492  INFO 3283 --- [           main] junit.logTestName                        : Finished Test directedGraphTest(org.springframework.cloud.dataflow.acceptance.test.NamedChannelTests)
15-Jan-2019 05:24:36 2019-01-15 05:24:36.492  INFO 3283 --- [           main] o.s.c.d.a.test.NamedChannelTests         : Destroy all streams
15-Jan-2019 05:24:37 Tests run: 4, Failures: 0, Errors: 0, Skipped: 0, Time elapsed: 260.774 sec - in org.springframework.cloud.dataflow.acceptance.test.NamedChannelTests
15-Jan-2019 05:24:37 Running org.springframework.cloud.dataflow.acceptance.test.util.PlatformHelperTests
15-Jan-2019 05:24:37 Tests run: 3, Failures: 0, Errors: 0, Skipped: 0, Time elapsed: 0.078 sec - in org.springframework.cloud.dataflow.acceptance.test.util.PlatformHelperTests
15-Jan-2019 05:24:37 Running org.springframework.cloud.dataflow.acceptance.test.util.ApplicationTests
15-Jan-2019 05:24:37 Tests run: 2, Failures: 0, Errors: 0, Skipped: 0, Time elapsed: 0.001 sec - in org.springframework.cloud.dataflow.acceptance.test.util.ApplicationTests
15-Jan-2019 05:24:37 2019-01-15 05:24:37.316  INFO 3283 --- [       Thread-6] o.s.c.support.GenericApplicationContext  : Closing org.springframework.context.support.GenericApplicationContext@2b960a7: startup date [Tue Jan 15 05:18:37 UTC 2019]; root of context hierarchy
15-Jan-2019 05:24:37
15-Jan-2019 05:24:37 Results :
15-Jan-2019 05:24:37
15-Jan-2019 05:24:37 Tests run: 19, Failures: 0, Errors: 0, Skipped: 3
15-Jan-2019 05:24:37
15-Jan-2019 05:24:37 [INFO]
15-Jan-2019 05:24:37 [INFO] >>> maven-surefire-report-plugin:3.0.0-M3:report (default-cli) > [surefire]test @ spring-cloud-dataflow-acceptance-tests >>>
15-Jan-2019 05:24:37 [INFO]
15-Jan-2019 05:24:37 [INFO] --- maven-checkstyle-plugin:2.17:check (checkstyle-validation) @ spring-cloud-dataflow-acceptance-tests ---
15-Jan-2019 05:24:37 [INFO]
15-Jan-2019 05:24:37 [INFO] --- maven-resources-plugin:2.6:resources (default-resources) @ spring-cloud-dataflow-acceptance-tests ---
15-Jan-2019 05:24:37 [INFO] Using 'UTF-8' encoding to copy filtered resources.
15-Jan-2019 05:24:37 [INFO] skip non existing resourceDirectory /opt/bamboo-home/xml-data/build-dir/SCDT-LOCALCLASSIC-RABBIT/src/main/resources
15-Jan-2019 05:24:37 [INFO] skip non existing resourceDirectory /opt/bamboo-home/xml-data/build-dir/SCDT-LOCALCLASSIC-RABBIT/src/main/resources
15-Jan-2019 05:24:37 [INFO]
15-Jan-2019 05:24:37 [INFO] --- maven-compiler-plugin:3.1:compile (default-compile) @ spring-cloud-dataflow-acceptance-tests ---
15-Jan-2019 05:24:37 [INFO] Nothing to compile - all classes are up to date
15-Jan-2019 05:24:37 [INFO]
15-Jan-2019 05:24:37 [INFO] --- maven-resources-plugin:2.6:testResources (default-testResources) @ spring-cloud-dataflow-acceptance-tests ---
15-Jan-2019 05:24:37 [INFO] Using 'UTF-8' encoding to copy filtered resources.
15-Jan-2019 05:24:37 [INFO] Copying 1 resource
15-Jan-2019 05:24:37 [INFO]
15-Jan-2019 05:24:37 [INFO] --- maven-compiler-plugin:3.1:testCompile (default-testCompile) @ spring-cloud-dataflow-acceptance-tests ---
15-Jan-2019 05:24:37 [INFO] Nothing to compile - all classes are up to date
15-Jan-2019 05:24:37 [INFO]
15-Jan-2019 05:24:37 [INFO] --- maven-surefire-plugin:2.18.1:test (default-test) @ spring-cloud-dataflow-acceptance-tests ---
15-Jan-2019 05:24:37 [INFO] Skipping execution of surefire because it has already been run for this configuration
15-Jan-2019 05:24:37 [INFO]
15-Jan-2019 05:24:37 [INFO] <<< maven-surefire-report-plugin:3.0.0-M3:report (default-cli) < [surefire]test @ spring-cloud-dataflow-acceptance-tests <<<
15-Jan-2019 05:24:37 [INFO]
15-Jan-2019 05:24:37 [INFO] --- maven-surefire-report-plugin:3.0.0-M3:report (default-cli) @ spring-cloud-dataflow-acceptance-tests ---
15-Jan-2019 05:24:37 [WARNING] Unable to locate Test Source XRef to link to - DISABLED
15-Jan-2019 05:24:37 [INFO] ------------------------------------------------------------------------
15-Jan-2019 05:24:37 [INFO] BUILD SUCCESS
15-Jan-2019 05:24:37 [INFO] ------------------------------------------------------------------------
15-Jan-2019 05:24:37 [INFO] Total time: 08:24 min
15-Jan-2019 05:24:37 [INFO] Finished at: 2019-01-15T05:24:37+00:00
15-Jan-2019 05:24:38 [INFO] Final Memory: 60M/458M
15-Jan-2019 05:24:38 [INFO] ------------------------------------------------------------------------
15-Jan-2019 05:24:38 Clean up, clean up, everybody everywhere; clean up clean up, everybody do your share!
15-Jan-2019 05:24:38 Killing process PID [3126]
15-Jan-2019 05:24:38 No stopped containers
15-Jan-2019 05:24:38 Stopping mysql_mysql_1 ...
15-Jan-2019 05:24:40
15-Jan-2019 05:24:40 Stopping mysql_mysql_1 ... done
15-Jan-2019 05:24:41 Removing mysql_mysql_1 ...
15-Jan-2019 05:24:41
15-Jan-2019 05:24:41 Removing mysql_mysql_1 ... done
15-Jan-2019 05:24:41 Going to remove mysql_mysql_1
15-Jan-2019 05:24:41 No stopped containers
15-Jan-2019 05:24:41
15-Jan-2019 05:24:41 Finished task 'Execute Acceptance Tests' with result: Success
15-Jan-2019 05:24:41 Starting task 'JUnit Parser' of type 'com.atlassian.bamboo.plugins.testresultparser:task.testresultparser.junit'
15-Jan-2019 05:24:41 Parsing test results under /opt/bamboo-home/xml-data/build-dir/SCDT-LOCALCLASSIC-RABBIT...
15-Jan-2019 05:24:41 Finished task 'JUnit Parser' with result: Success
15-Jan-2019 05:24:41 Starting task 'clean up' of type 'com.atlassian.bamboo.plugins.scripttask:task.builder.script'
15-Jan-2019 05:24:41
Beginning to execute external process for build 'Spring Cloud Data Flow Acceptance Tests - Local + SCDF-1.7.4.BS + Classic (5am) - Run Data Flow Acceptance Tests for Rabbit #640 (SCDT-LOCALCLASSIC-RABBIT-640)'
... running command line:
/opt/bamboo-home/temp/SCDT-LOCALCLASSIC-RABBIT-640-ScriptBuildTask-7759666027036774392.sh
... in: /opt/bamboo-home/xml-data/build-dir/SCDT-LOCALCLASSIC-RABBIT
... using extra environment variables:
bamboo_planRepository_1_branch=master
bamboo_********_username_password=********
bamboo_signing_store_password=********
bamboo_capability_system_builder_ant_Ant_1_9=/opt/ant-1.9
bamboo_capability_system_builder_ant_Ant_1_8=/opt/ant-1.8
bamboo_planRepository_1_branchDisplayName=master
bamboo_capability_system_jdk_OpenJDK_7u181=/opt/openjdk-7
bamboo_repository_revision_number=81cf8e7d743b9305b6fcf979b96acb05142e6edc
bamboo_repository_247857231_previous_revision_number=4ffaad07559ccd9b8e54cbb085682eae686a1384
bamboo_capability_system_builder_node_Node_js_6=/usr/bin/node
bamboo_RIAK_BIN=/usr/sbin/riak
bamboo_buildKey=SCDT-LOCALCLASSIC-RABBIT
bamboo_sonar_token_password=********
bamboo_shortJobName=Run Data Flow Acceptance Tests for Rabbit
bamboo_capability_system_builder_gradle___gradlew=./gradlew
bamboo_buildResultsUrl=https://build.spring.io/browse/SCDT-LOCALCLASSIC-RABBIT-640
bamboo_capability_system_builder_mvn3_Maven_3_3=/opt/maven-3.3
bamboo_capability_system_builder_mvn3_Maven_3_2=/opt/maven-3.2
bamboo_capability_system_builder_mvn3_Maven_3_1=/opt/maven-3.1
bamboo_planRepository_repositoryUrl=https://github.com/spring-cloud/spring-cloud-dataflow-acceptance-tests.git
bamboo_agentId=208568325
bamboo_capability_system_builder_mvn3_Maven_3_5=/opt/maven-3.5
bamboo_capability_system_builder_mvn3_Maven_3_0=/opt/maven-3.0
bamboo_planRepository_revision=81cf8e7d743b9305b6fcf979b96acb05142e6edc
bamboo_planRepository_previousRevision=4ffaad07559ccd9b8e54cbb085682eae686a1384
bamboo_capability_remote_build=true
bamboo_repository_branch_name=master
bamboo_repository_247857231_branch_name=master
bamboo_scdf_acceptance_tests_password=********
bamboo_capability_Agent=bamboo-02.af.pivotal.io
bamboo_planRepository_branch=master
bamboo_planRepository_1_type=gitv2
bamboo_planRepository_branchName=master
bamboo_repository_247857231_name=Git
bamboo_sonar_password=********
bamboo_hg_cache_directory=/opt/bamboo-home/xml-data/build-dir/_hg-repositories-cache
bamboo_planRepository_1_username=spring-buildmaster
bamboo_planRepository_type=gitv2
bamboo_git_cache_directory=/opt/bamboo-home/xml-data/build-dir/_git-repositories-cache
bamboo_repository_247857231_revision_number=81cf8e7d743b9305b6fcf979b96acb05142e6edc
bamboo_repository_247857231_git_branch=master
bamboo_artifactory_username=buildmaster
bamboo_tmp_directory=/opt/bamboo-home/temp
bamboo_planKey=SCDT-LOCALCLASSIC
bamboo_planRepository_username=spring-buildmaster
bamboo_repository_247857231_git_repositoryUrl=https://github.com/spring-cloud/spring-cloud-dataflow-acceptance-tests.git
bamboo_JDK8_HOME=/opt/jdk-8
bamboo_planRepository_1_branchName=master
bamboo_sonar_version=5.6.3
bamboo_capability_system_jdk_JDK_1_11=/opt/jdk-11
bamboo_resultsUrl=https://build.spring.io/browse/SCDT-LOCALCLASSIC-RABBIT-640
bamboo_capability_system_jdk_JDK_1_10=/opt/jdk-10
bamboo_build_working_directory=/opt/bamboo-home/xml-data/build-dir/SCDT-LOCALCLASSIC-RABBIT
bamboo_planRepository_1_name=Git
bamboo_capability_system_os=ubuntu1604
bamboo_nexusPush_stagingProfile=buildmaster
bamboo_shortPlanName=Local + SCDF-1.7.4.BS + Classic (5am)
bamboo_planRepository_name=Git
bamboo_buildNumber=640
bamboo_planName=Spring Cloud Data Flow Acceptance Tests - Local + SCDF-1.7.4.BS + Classic (5am)
bamboo_JDK7_HOME=/opt/jdk-7
bamboo_build_commandline_com_atlassian_bamboo_plugins_scripttask_task_builder_script_7=/opt/bamboo-home/temp/SCDT-LOCALCLASSIC-RABBIT-640-ScriptBuildTask-1813954143714494907.sh
bamboo_shortPlanKey=LOCALCLASSIC
bamboo_shortJobKey=RABBIT
bamboo_artifactory_password=********
bamboo_buildTimeStamp=2019-01-15T05:14:24.346Z
bamboo_repository_previous_revision_number=4ffaad07559ccd9b8e54cbb085682eae686a1384
bamboo_sonar_username=buildmaster
bamboo_********_password=********
bamboo_repository_git_branch=master
bamboo_buildResultKey=SCDT-LOCALCLASSIC-RABBIT-640
bamboo_nexusPush_close=true
bamboo_buildPlanName=Spring Cloud Data Flow Acceptance Tests - Local + SCDF-1.7.4.BS + Classic (5am) - Run Data Flow Acceptance Tests for Rabbit
bamboo_planRepository_1_revision=81cf8e7d743b9305b6fcf979b96acb05142e6edc
bamboo_repository_name=Git
bamboo_signing_key_password=********
bamboo_repository_247857231_git_username=spring-buildmaster
bamboo_buildFailed=false
bamboo_capability_system_docker_executable=/usr/bin/docker
bamboo_capability_system_builder_groovy_Groovy_2_4=/opt/groovy-2.4
bamboo_capability_system_builder_command_Bash=/bin/bash
bamboo_jobFailed=false
bamboo_agentWorkingDirectory=/opt/bamboo-home/xml-data/build-dir
bamboo_capability_system_git_executable=/usr/bin/git
bamboo_repository_git_username=spring-buildmaster
bamboo_planRepository_1_previousRevision=4ffaad07559ccd9b8e54cbb085682eae686a1384
bamboo_capability_os_family=unix
bamboo_planRepository_branchDisplayName=master
bamboo_capability_system_builder_maven_Artifactory_Maven_3_5=/opt/maven-3.5
bamboo_capability_system_builder_maven_Artifactory_Maven_3_3=/opt/maven-3.3
bamboo_capability_system_builder_maven_Artifactory_Maven_3_2=/opt/maven-3.2
bamboo_s3_properties=/home/bamboo/tools/s3.properties
bamboo_capability_system_builder_maven_Artifactory_Maven_3_1=/opt/maven-3.1
bamboo_capability_system_builder_maven_Artifactory_Maven_3_0=/opt/maven-3.0
bamboo_plan_storageTag=plan-247660696
bamboo_repository_git_repositoryUrl=https://github.com/spring-cloud/spring-cloud-dataflow-acceptance-tests.git
bamboo_working_directory=/opt/bamboo-home/xml-data/build-dir/SCDT-LOCALCLASSIC-RABBIT
bamboo_planRepository_1_repositoryUrl=https://github.com/spring-cloud/spring-cloud-dataflow-acceptance-tests.git
bamboo_capability_system_jdk_JDK_1_8=/opt/jdk-8
bamboo_capability_system_jdk_JDK_1_9=/opt/jdk-9
bamboo_capability_system_jdk_JDK_1_6=/opt/jdk-6
bamboo_capability_system_jdk_JDK_1_7=/opt/jdk-7
bamboo_sonar_ip=10.194.6.9
15-Jan-2019 05:24:41 CLEANING UP RESOURCES AFTER RUNNING TESTS
15-Jan-2019 05:24:41 Environment variable JAVA_HOME must be set
15-Jan-2019 05:24:41 FINISHED CLEANING UP RESOURCES
15-Jan-2019 05:24:41 Finished task 'clean up' with result: Success
15-Jan-2019 05:24:41 Running post build plugin 'Docker Container Cleanup'
15-Jan-2019 05:24:41 Running post build plugin 'NCover Results Collector'
15-Jan-2019 05:24:41 Running post build plugin 'Artifactory Release Management Staging'
15-Jan-2019 05:24:41 Running post build plugin 'Artifactory Build Info Copier'
15-Jan-2019 05:24:41 Running post build plugin 'Artifactory Gradle Properties Info Copier'
15-Jan-2019 05:24:41 Running post build plugin 'Clover Results Collector'
15-Jan-2019 05:24:41 Running post build plugin 'npm Cache Cleanup'
15-Jan-2019 05:24:41 Running post build plugin 'Artifact Copier'
15-Jan-2019 05:24:41 Publishing an artifact: Test Results
15-Jan-2019 05:24:41 Finished publishing of artifact Job artifact: [Test Results], pattern: [**/target/surefire-reports/**/*.*] in 42.14 ms
15-Jan-2019 05:24:41 Publishing an artifact: App and Server Logs
15-Jan-2019 05:24:41 Finished publishing of artifact Job artifact: [App and Server Logs], pattern: [**/*.log] anchored at: [local] in 41.94 ms
15-Jan-2019 05:24:41 Successfully removed working directory at '/opt/bamboo-home/xml-data/build-dir/SCDT-LOCALCLASSIC-RABBIT'
15-Jan-2019 05:24:41 Finalising the build...
15-Jan-2019 05:24:41 Stopping timer.
15-Jan-2019 05:24:41 Build SCDT-LOCALCLASSIC-RABBIT-640 completed.
15-Jan-2019 05:24:41 Running on server: post build plugin 'NCover Results Collector'
15-Jan-2019 05:24:41 Running on server: post build plugin 'Build Hanging Detection Configuration'
15-Jan-2019 05:24:41 Running on server: post build plugin 'Clover Delta Calculator'
15-Jan-2019 05:24:41 Running on server: post build plugin 'Maven Dependencies Postprocessor'
15-Jan-2019 05:24:41 All post build plugins have finished
15-Jan-2019 05:24:41 Generating build results summary...
15-Jan-2019 05:24:41 Saving build results to disk...
15-Jan-2019 05:24:41 Logging substituted variables...
15-Jan-2019 05:24:41 Indexing build results...
15-Jan-2019 05:24:41 Finished building SCDT-LOCALCLASSIC-RABBIT-640.