Acceptance Tests for Spring Cloud Data Flow Local Server (Skipper mode)

Build: #30 failed Child of SCDT-LOCALCLASSIC-286

Stages & jobs

  1. Test Stage - Rabbit

  2. Test Stage - Kafka

Build result summary

Details

Completed
Duration
43 minutes
Labels
None
Revision
a89b17c89ddf395bb82ba09359cd0dd6b0b2fd27 a89b17c89ddf395bb82ba09359cd0dd6b0b2fd27
Total tests
34
Fixed in
#33 (Child of SCDT-LOCALCLASSIC-294)

Tests

Responsible

Code commits

Author Commit Message Commit date
Mark Pollack Mark Pollack a89b17c89ddf395bb82ba09359cd0dd6b0b2fd27 a89b17c89ddf395bb82ba09359cd0dd6b0b2fd27 Update to 1.4.0 snapshots
Mark Pollack Mark Pollack 55a707669c443d609f101f51107d825c90b22fae 55a707669c443d609f101f51107d825c90b22fae Update to latest snapshots in the 1.3.x line

Configuration changes

Plan configuration has changed since the last successful build. See the plan audit log for more details.

Tests

New test failures 8
Status Test View job Duration
Collapse Failed HttpSourceTests httpSourceTests History
Run Data Flow Acceptance Tests for Kafka 2 mins
org.springframework.cloud.dataflow.rest.client.DataFlowClientException: Error reading from URL [http://bit.ly/Celsius-SR1-stream-applications-kafka-10-maven]

	at org.springframework.cloud.dataflow.rest.client.VndErrorResponseErrorHandler.handleError(VndErrorResponseErrorHandler.java:63)
	at org.springframework.web.client.RestTemplate.handleResponse(RestTemplate.java:667)
	at org.springframework.web.client.RestTemplate.doExecute(RestTemplate.java:620)
	at org.springframework.web.client.RestTemplate.execute(RestTemplate.java:580)
	at org.springframework.web.client.RestTemplate.postForObject(RestTemplate.java:380)
	at org.springframework.cloud.dataflow.rest.client.AppRegistryTemplate.importFromResource(AppRegistryTemplate.java:106)
(34 more lines...)
Collapse Failed NamedChannelTests testTap History
Run Data Flow Acceptance Tests for Kafka 2 mins
org.springframework.cloud.dataflow.rest.client.DataFlowClientException: Error reading from URL [http://bit.ly/Celsius-SR1-stream-applications-kafka-10-maven]

	at org.springframework.cloud.dataflow.rest.client.VndErrorResponseErrorHandler.handleError(VndErrorResponseErrorHandler.java:63)
	at org.springframework.web.client.RestTemplate.handleResponse(RestTemplate.java:667)
	at org.springframework.web.client.RestTemplate.doExecute(RestTemplate.java:620)
	at org.springframework.web.client.RestTemplate.execute(RestTemplate.java:580)
	at org.springframework.web.client.RestTemplate.postForObject(RestTemplate.java:380)
	at org.springframework.cloud.dataflow.rest.client.AppRegistryTemplate.importFromResource(AppRegistryTemplate.java:106)
(34 more lines...)
Collapse Failed NamedChannelTests directedGraphTest History
Run Data Flow Acceptance Tests for Kafka 2 mins
org.springframework.cloud.dataflow.rest.client.DataFlowClientException: Error reading from URL [http://bit.ly/Celsius-SR1-stream-applications-kafka-10-maven]

	at org.springframework.cloud.dataflow.rest.client.VndErrorResponseErrorHandler.handleError(VndErrorResponseErrorHandler.java:63)
	at org.springframework.web.client.RestTemplate.handleResponse(RestTemplate.java:667)
	at org.springframework.web.client.RestTemplate.doExecute(RestTemplate.java:620)
	at org.springframework.web.client.RestTemplate.execute(RestTemplate.java:580)
	at org.springframework.web.client.RestTemplate.postForObject(RestTemplate.java:380)
	at org.springframework.cloud.dataflow.rest.client.AppRegistryTemplate.importFromResource(AppRegistryTemplate.java:106)
(34 more lines...)
Collapse Failed TickTockTests tickTockTestsFromConfigServer History
Run Data Flow Acceptance Tests for Kafka 2 mins
org.springframework.cloud.dataflow.rest.client.DataFlowClientException: Error reading from URL [http://bit.ly/Celsius-SR1-stream-applications-kafka-10-maven]

	at org.springframework.cloud.dataflow.rest.client.VndErrorResponseErrorHandler.handleError(VndErrorResponseErrorHandler.java:63)
	at org.springframework.web.client.RestTemplate.handleResponse(RestTemplate.java:667)
	at org.springframework.web.client.RestTemplate.doExecute(RestTemplate.java:620)
	at org.springframework.web.client.RestTemplate.execute(RestTemplate.java:580)
	at org.springframework.web.client.RestTemplate.postForObject(RestTemplate.java:380)
	at org.springframework.cloud.dataflow.rest.client.AppRegistryTemplate.importFromResource(AppRegistryTemplate.java:106)
(34 more lines...)
Collapse Failed TimestampTaskTests timeStampTests History
Run Data Flow Acceptance Tests for Kafka 2 mins
org.springframework.cloud.dataflow.rest.client.DataFlowClientException: Error reading from URL [http://bit.ly/Clark-GA-task-applications-maven]

	at org.springframework.cloud.dataflow.rest.client.VndErrorResponseErrorHandler.handleError(VndErrorResponseErrorHandler.java:63)
	at org.springframework.web.client.RestTemplate.handleResponse(RestTemplate.java:667)
	at org.springframework.web.client.RestTemplate.doExecute(RestTemplate.java:620)
	at org.springframework.web.client.RestTemplate.execute(RestTemplate.java:580)
	at org.springframework.web.client.RestTemplate.postForObject(RestTemplate.java:380)
	at org.springframework.cloud.dataflow.rest.client.AppRegistryTemplate.importFromResource(AppRegistryTemplate.java:106)
(33 more lines...)
Collapse Failed TimestampTaskTests taskNoLaunch History
Run Data Flow Acceptance Tests for Kafka 2 mins
org.springframework.cloud.dataflow.rest.client.DataFlowClientException: Error reading from URL [http://bit.ly/Clark-GA-task-applications-maven]

	at org.springframework.cloud.dataflow.rest.client.VndErrorResponseErrorHandler.handleError(VndErrorResponseErrorHandler.java:63)
	at org.springframework.web.client.RestTemplate.handleResponse(RestTemplate.java:667)
	at org.springframework.web.client.RestTemplate.doExecute(RestTemplate.java:620)
	at org.springframework.web.client.RestTemplate.execute(RestTemplate.java:580)
	at org.springframework.web.client.RestTemplate.postForObject(RestTemplate.java:380)
	at org.springframework.cloud.dataflow.rest.client.AppRegistryTemplate.importFromResource(AppRegistryTemplate.java:106)
(33 more lines...)
Collapse Failed TimestampTaskTests timeStampTestsMultipleLaunch History
Run Data Flow Acceptance Tests for Kafka 2 mins
org.springframework.cloud.dataflow.rest.client.DataFlowClientException: Error reading from URL [http://bit.ly/Clark-GA-task-applications-maven]

	at org.springframework.cloud.dataflow.rest.client.VndErrorResponseErrorHandler.handleError(VndErrorResponseErrorHandler.java:63)
	at org.springframework.web.client.RestTemplate.handleResponse(RestTemplate.java:667)
	at org.springframework.web.client.RestTemplate.doExecute(RestTemplate.java:620)
	at org.springframework.web.client.RestTemplate.execute(RestTemplate.java:580)
	at org.springframework.web.client.RestTemplate.postForObject(RestTemplate.java:380)
	at org.springframework.cloud.dataflow.rest.client.AppRegistryTemplate.importFromResource(AppRegistryTemplate.java:106)
(33 more lines...)
Collapse Failed WoodChuckTests testPartitioning History
Run Data Flow Acceptance Tests for Kafka 2 mins
org.springframework.cloud.dataflow.rest.client.DataFlowClientException: Error reading from URL [http://bit.ly/Celsius-SR1-stream-applications-kafka-10-maven]

	at org.springframework.cloud.dataflow.rest.client.VndErrorResponseErrorHandler.handleError(VndErrorResponseErrorHandler.java:63)
	at org.springframework.web.client.RestTemplate.handleResponse(RestTemplate.java:667)
	at org.springframework.web.client.RestTemplate.doExecute(RestTemplate.java:620)
	at org.springframework.web.client.RestTemplate.execute(RestTemplate.java:580)
	at org.springframework.web.client.RestTemplate.postForObject(RestTemplate.java:380)
	at org.springframework.cloud.dataflow.rest.client.AppRegistryTemplate.importFromResource(AppRegistryTemplate.java:106)
(34 more lines...)