Local + SCDF-1.7.5.BS + Skipper 1.1.5.BS

Build: #301 failed Scheduled with changes by 6 people

Stages & jobs

  1. Test Stage - Kafka

  2. Test Stage - Rabbit

Build result summary

Details

Completed
Duration
36 minutes
Labels
None
Revision
9428959847537bdf16faad0bbcfb2b3d0e88495d 9428959847537bdf16faad0bbcfb2b3d0e88495d
Total tests
22

Tests

Responsible

Code commits

Author Commit Message Commit date
Ilayaperumal Gopinathan Ilayaperumal Gopinathan 9428959847537bdf16faad0bbcfb2b3d0e88495d 9428959847537bdf16faad0bbcfb2b3d0e88495d Update K8s common Kafka config for resource URLs
Janne Valkealahti Janne Valkealahti 9ec8b30587f59c2e86a3512c6b941b22b0375dce 9ec8b30587f59c2e86a3512c6b941b22b0375dce Change to correct scdf 20x version
Janne Valkealahti Janne Valkealahti df01d9a2a82366375ea1b057d37341bad451aae6 df01d9a2a82366375ea1b057d37341bad451aae6 More mysql8 changes
Janne Valkealahti Janne Valkealahti 7c870949800d9e376823aa7a15f6e04dfb65df8c 7c870949800d9e376823aa7a15f6e04dfb65df8c Add mysql driver to timestamp-batch
Janne Valkealahti Janne Valkealahti aa913ad3901f3219104d45773e6caab5ca7ab45f aa913ad3901f3219104d45773e6caab5ca7ab45f Change back to http in inter docker communication

Configuration changes

Plan configuration has changed since the last successful build. See the plan audit log for more details.

Tests

New test failures 4
Status Test View job Duration
Collapse Failed AnalyticsTests analyticsTest History
Run Data Flow Acceptance Tests for Kafka 1 min
org.springframework.cloud.dataflow.rest.client.DataFlowClientException: httpCounter

	at org.springframework.cloud.dataflow.rest.client.VndErrorResponseErrorHandler.handleError(VndErrorResponseErrorHandler.java:63)
	at org.springframework.web.client.RestTemplate.handleResponse(RestTemplate.java:667)
	at org.springframework.web.client.RestTemplate.doExecute(RestTemplate.java:620)
	at org.springframework.web.client.RestTemplate.execute(RestTemplate.java:580)
	at org.springframework.web.client.RestTemplate.getForObject(RestTemplate.java:287)
	at org.springframework.cloud.dataflow.rest.client.CounterTemplate.retrieve(CounterTemplate.java:48)
(1 more lines...)
Collapse Failed ComposedTaskTests ctrMultipleLaunchWithArguments History
Run Data Flow Acceptance Tests for Kafka 3 mins
java.lang.AssertionError: null
	at org.junit.Assert.fail(Assert.java:86)
	at org.junit.Assert.assertTrue(Assert.java:41)
	at org.junit.Assert.assertTrue(Assert.java:52)
	at org.springframework.cloud.dataflow.acceptance.test.ComposedTaskTests.assertTaskExecutions(ComposedTaskTests.java:65)
	at org.springframework.cloud.dataflow.acceptance.test.ComposedTaskTests.ctrMultipleLaunchWithArguments(ComposedTaskTests.java:57)
Collapse Failed ComposedTaskTests ctrMultipleLaunch History
Run Data Flow Acceptance Tests for Kafka 3 mins
java.lang.AssertionError: null
	at org.junit.Assert.fail(Assert.java:86)
	at org.junit.Assert.assertTrue(Assert.java:41)
	at org.junit.Assert.assertTrue(Assert.java:52)
	at org.springframework.cloud.dataflow.acceptance.test.ComposedTaskTests.assertTaskExecutions(ComposedTaskTests.java:65)
	at org.springframework.cloud.dataflow.acceptance.test.ComposedTaskTests.ctrMultipleLaunch(ComposedTaskTests.java:47)
Collapse Failed ComposedTaskTests ctrLaunch History
Run Data Flow Acceptance Tests for Kafka 3 mins
java.lang.AssertionError: null
	at org.junit.Assert.fail(Assert.java:86)
	at org.junit.Assert.assertTrue(Assert.java:41)
	at org.junit.Assert.assertTrue(Assert.java:52)
	at org.springframework.cloud.dataflow.acceptance.test.ComposedTaskTests.assertTaskExecutions(ComposedTaskTests.java:65)
	at org.springframework.cloud.dataflow.acceptance.test.ComposedTaskTests.ctrLaunch(ComposedTaskTests.java:41)

Jira issues

IssueDescriptionStatus
Unknown Issue TypeLICENSE-2Could not obtain issue details from Jira