Local + SCDF-1.7.5.BS + Skipper 1.1.5.BS

Build: #304 failed Scheduled with changes by Janne Valkealahti

Stages & jobs

  1. Test Stage - Kafka

  2. Test Stage - Rabbit

Build result summary

Details

Completed
Duration
36 minutes
Labels
None
Revision
0f3ab5b407e53f87831a1d0baae0bcb57f205ea2 0f3ab5b407e53f87831a1d0baae0bcb57f205ea2
Total tests
22
Failing since
#301 (Scheduled with changes by 6 people)

Responsible

Code commits

Author Commit Message Commit date
Janne Valkealahti Janne Valkealahti 0f3ab5b407e53f87831a1d0baae0bcb57f205ea2 0f3ab5b407e53f87831a1d0baae0bcb57f205ea2 Fix jsonpath checks
Janne Valkealahti Janne Valkealahti 19b51b6d15f758485d991025b18327a960c9880c 19b51b6d15f758485d991025b18327a960c9880c Fix jsonpath checks
Janne Valkealahti Janne Valkealahti 0480bd739b1689938fed9eb147746765d7ac6da5 0480bd739b1689938fed9eb147746765d7ac6da5 Dataflow 22x and task test changes

Configuration changes

Plan configuration has changed since the last successful build. See the plan audit log for more details.

Tests

New test failures 8
Status Test View job Duration
Collapse Failed HttpSourceTests httpSourceTests History
Run Data Flow Acceptance Tests for Kafka 3 mins
java.lang.AssertionError: Sink not started
	at org.junit.Assert.fail(Assert.java:88)
	at org.junit.Assert.assertTrue(Assert.java:41)
	at org.springframework.cloud.dataflow.acceptance.test.HttpSourceTests.httpSourceTests(HttpSourceTests.java:44)
Collapse Failed NamedChannelTests testDestination History
Run Data Flow Acceptance Tests for Kafka 3 mins
java.lang.AssertionError: ':LOG-DESTINATION > log' not started
	at org.junit.Assert.fail(Assert.java:88)
	at org.junit.Assert.assertTrue(Assert.java:41)
	at org.springframework.cloud.dataflow.acceptance.test.NamedChannelTests.deployStream(NamedChannelTests.java:89)
	at org.springframework.cloud.dataflow.acceptance.test.NamedChannelTests.deployLog(NamedChannelTests.java:96)
	at org.springframework.cloud.dataflow.acceptance.test.NamedChannelTests.testDestination(NamedChannelTests.java:35)
Collapse Failed NamedChannelTests manyToOneTest History
Run Data Flow Acceptance Tests for Kafka 3 mins
java.lang.AssertionError: ':MANY-TO-ONE-DESTINATION > log' not started
	at org.junit.Assert.fail(Assert.java:88)
	at org.junit.Assert.assertTrue(Assert.java:41)
	at org.springframework.cloud.dataflow.acceptance.test.NamedChannelTests.deployStream(NamedChannelTests.java:89)
	at org.springframework.cloud.dataflow.acceptance.test.NamedChannelTests.deployLog(NamedChannelTests.java:96)
	at org.springframework.cloud.dataflow.acceptance.test.NamedChannelTests.manyToOneTest(NamedChannelTests.java:58)
Collapse Failed NamedChannelTests testTap History
Run Data Flow Acceptance Tests for Kafka 3 mins
java.lang.AssertionError: 'http | log' not started
	at org.junit.Assert.fail(Assert.java:88)
	at org.junit.Assert.assertTrue(Assert.java:41)
	at org.springframework.cloud.dataflow.acceptance.test.NamedChannelTests.testTap(NamedChannelTests.java:47)
Collapse Failed TickTockTests tickTockUpdateRollbackTests History
Run Data Flow Acceptance Tests for Kafka 3 mins
java.lang.AssertionError: Sink not started
	at org.junit.Assert.fail(Assert.java:88)
	at org.junit.Assert.assertTrue(Assert.java:41)
	at org.springframework.cloud.dataflow.acceptance.test.TickTockTests.tickTockUpdateRollbackTests(TickTockTests.java:69)
Collapse Failed TickTockTests tickTockTests History
Run Data Flow Acceptance Tests for Kafka 3 mins
java.lang.AssertionError: Sink not started
	at org.junit.Assert.fail(Assert.java:88)
	at org.junit.Assert.assertTrue(Assert.java:41)
	at org.springframework.cloud.dataflow.acceptance.test.TickTockTests.tickTockTests(TickTockTests.java:49)
Collapse Failed TransformTests transformTests History
Run Data Flow Acceptance Tests for Kafka 43 secs
org.springframework.web.client.HttpServerErrorException: 500 null
	at org.springframework.web.client.DefaultResponseErrorHandler.handleError(DefaultResponseErrorHandler.java:94)
	at org.springframework.web.client.RestTemplate.handleResponse(RestTemplate.java:667)
	at org.springframework.web.client.RestTemplate.doExecute(RestTemplate.java:620)
	at org.springframework.web.client.RestTemplate.execute(RestTemplate.java:580)
	at org.springframework.web.client.RestTemplate.postForObject(RestTemplate.java:380)
	at org.springframework.cloud.dataflow.acceptance.test.AbstractStreamTests.httpPostData(AbstractStreamTests.java:353)
	at org.springframework.cloud.dataflow.acceptance.test.TransformTests.transformTests(TransformTests.java:42)
Collapse Failed WoodChuckTests testPartitioning History
Run Data Flow Acceptance Tests for Kafka 3 mins
java.lang.AssertionError: Processor not started
	at org.junit.Assert.fail(Assert.java:88)
	at org.junit.Assert.assertTrue(Assert.java:41)
	at org.springframework.cloud.dataflow.acceptance.test.WoodChuckTests.testPartitioning(WoodChuckTests.java:46)
Existing test failures 1
Status Test Failing since View job Duration
java.lang.AssertionError: Sink not started
	at org.junit.Assert.fail(Assert.java:88)
	at org.junit.Assert.assertTrue(Assert.java:41)
	at org.springframework.cloud.dataflow.acceptance.test.AnalyticsTests.analyticsTest(AnalyticsTests.java:62)
Fixed tests 3
Status Test Failing since View job Duration
Successful ComposedTaskTests ctrMultipleLaunchWithArguments History
Failing since build #301 (Scheduled with changes by 6 people) Run Data Flow Acceptance Tests for Kafka 1 min
Successful ComposedTaskTests ctrMultipleLaunch History
Failing since build #301 (Scheduled with changes by 6 people) Run Data Flow Acceptance Tests for Kafka 1 min
Successful ComposedTaskTests ctrLaunch History
Failing since build #301 (Scheduled with changes by 6 people) Run Data Flow Acceptance Tests for Kafka 50 secs