Local + SCDF-1.7.5.BS + Skipper 1.1.5.BS

Build: #304 failed

Job: Run Data Flow Acceptance Tests for Kafka failed

Stages & jobs

  1. Test Stage - Kafka

  2. Test Stage - Rabbit

Job result summary

Completed
Duration
35 minutes
Agent
bamboo-18.af.pivotal.io
Revision
0f3ab5b407e53f87831a1d0baae0bcb57f205ea2 0f3ab5b407e53f87831a1d0baae0bcb57f205ea2
Total tests
22
Failing since
#301 (Scheduled – )

Tests

  • 22 tests in total
  • 9 tests failed
  • 8 failures are new
  • 3 tests were fixed
  • 3 tests were quarantined / skipped
  • 33 minutes taken in total.
New test failures 8
Status Test Duration
Collapse Failed HttpSourceTests httpSourceTests History
3 mins
java.lang.AssertionError: Sink not started
	at org.junit.Assert.fail(Assert.java:88)
	at org.junit.Assert.assertTrue(Assert.java:41)
	at org.springframework.cloud.dataflow.acceptance.test.HttpSourceTests.httpSourceTests(HttpSourceTests.java:44)
Collapse Failed NamedChannelTests manyToOneTest History
3 mins
java.lang.AssertionError: ':MANY-TO-ONE-DESTINATION > log' not started
	at org.junit.Assert.fail(Assert.java:88)
	at org.junit.Assert.assertTrue(Assert.java:41)
	at org.springframework.cloud.dataflow.acceptance.test.NamedChannelTests.deployStream(NamedChannelTests.java:89)
	at org.springframework.cloud.dataflow.acceptance.test.NamedChannelTests.deployLog(NamedChannelTests.java:96)
	at org.springframework.cloud.dataflow.acceptance.test.NamedChannelTests.manyToOneTest(NamedChannelTests.java:58)
Collapse Failed NamedChannelTests testDestination History
3 mins
java.lang.AssertionError: ':LOG-DESTINATION > log' not started
	at org.junit.Assert.fail(Assert.java:88)
	at org.junit.Assert.assertTrue(Assert.java:41)
	at org.springframework.cloud.dataflow.acceptance.test.NamedChannelTests.deployStream(NamedChannelTests.java:89)
	at org.springframework.cloud.dataflow.acceptance.test.NamedChannelTests.deployLog(NamedChannelTests.java:96)
	at org.springframework.cloud.dataflow.acceptance.test.NamedChannelTests.testDestination(NamedChannelTests.java:35)
Collapse Failed NamedChannelTests testTap History
3 mins
java.lang.AssertionError: 'http | log' not started
	at org.junit.Assert.fail(Assert.java:88)
	at org.junit.Assert.assertTrue(Assert.java:41)
	at org.springframework.cloud.dataflow.acceptance.test.NamedChannelTests.testTap(NamedChannelTests.java:47)
Collapse Failed TickTockTests tickTockTests History
3 mins
java.lang.AssertionError: Sink not started
	at org.junit.Assert.fail(Assert.java:88)
	at org.junit.Assert.assertTrue(Assert.java:41)
	at org.springframework.cloud.dataflow.acceptance.test.TickTockTests.tickTockTests(TickTockTests.java:49)
Collapse Failed TickTockTests tickTockUpdateRollbackTests History
3 mins
java.lang.AssertionError: Sink not started
	at org.junit.Assert.fail(Assert.java:88)
	at org.junit.Assert.assertTrue(Assert.java:41)
	at org.springframework.cloud.dataflow.acceptance.test.TickTockTests.tickTockUpdateRollbackTests(TickTockTests.java:69)
Collapse Failed TransformTests transformTests History
43 secs
org.springframework.web.client.HttpServerErrorException: 500 null
	at org.springframework.web.client.DefaultResponseErrorHandler.handleError(DefaultResponseErrorHandler.java:94)
	at org.springframework.web.client.RestTemplate.handleResponse(RestTemplate.java:667)
	at org.springframework.web.client.RestTemplate.doExecute(RestTemplate.java:620)
	at org.springframework.web.client.RestTemplate.execute(RestTemplate.java:580)
	at org.springframework.web.client.RestTemplate.postForObject(RestTemplate.java:380)
	at org.springframework.cloud.dataflow.acceptance.test.AbstractStreamTests.httpPostData(AbstractStreamTests.java:353)
	at org.springframework.cloud.dataflow.acceptance.test.TransformTests.transformTests(TransformTests.java:42)
Collapse Failed WoodChuckTests testPartitioning History
3 mins
java.lang.AssertionError: Processor not started
	at org.junit.Assert.fail(Assert.java:88)
	at org.junit.Assert.assertTrue(Assert.java:41)
	at org.springframework.cloud.dataflow.acceptance.test.WoodChuckTests.testPartitioning(WoodChuckTests.java:46)
Existing test failures 1
Status Test Failing since Duration
java.lang.AssertionError: Sink not started
	at org.junit.Assert.fail(Assert.java:88)
	at org.junit.Assert.assertTrue(Assert.java:41)
	at org.springframework.cloud.dataflow.acceptance.test.AnalyticsTests.analyticsTest(AnalyticsTests.java:62)
Fixed tests 3
Status Test Failing since Duration
Successful ComposedTaskTests ctrLaunch History
Failing since build #301 (Scheduled) 50 secs
Successful ComposedTaskTests ctrMultipleLaunch History
Failing since build #301 (Scheduled) 1 min
Successful ComposedTaskTests ctrMultipleLaunchWithArguments History
Failing since build #301 (Scheduled) 1 min

Error summary

The build generated some errors. See the full build log for more details.

Pulling mysql (mysql:5.7)...
Creating mysql_mysql_1 ...

Creating mysql_mysql_1 ... done
Pulling zookeeper (wurstmeister/zookeeper:)...
Pulling kafka (wurstmeister/kafka:2.11-0.11.0.3)...
Creating kafka_kafka_1 ...
Creating kafka_zookeeper_1 ...

Creating kafka_kafka_1     ... done

Creating kafka_zookeeper_1 ... done
2019-07-30 00:01:50 URL:https://repo.spring.io/libs-snapshot/org/springframework/cloud/spring-cloud-skipper-server/1.1.5.BUILD-SNAPSHOT/spring-cloud-skipper-server-1.1.5.BUILD-SNAPSHOT.jar [74127033/74127033] -> "/opt/bamboo-home/xml-data/build-dir/SCDT-LOCALSKIPPER11X-KAFKA/local/skipper-server/skipper-server.jar" [1]
Failed to connect to localhost:7577. Attempt  #1/60... will try again in [5] seconds
Failed to connect to localhost:7577. Attempt  #2/60... will try again in [5] seconds
Failed to connect to localhost:7577. Attempt  #3/60... will try again in [5] seconds
Failed to connect to localhost:7577. Attempt  #4/60... will try again in [5] seconds
2019-07-30 00:02:16 URL:https://repo.spring.io/libs-snapshot/org/springframework/cloud/spring-cloud-dataflow-server-local/1.7.5.BUILD-SNAPSHOT/spring-cloud-dataflow-server-local-1.7.5.BUILD-SNAPSHOT.jar [66157835/66157835] -> "/opt/bamboo-home/xml-data/build-dir/SCDT-LOCALSKIPPER11X-KAFKA/local/server/scdf-server.jar" [1]
Failed to connect to localhost:9393. Attempt  #1/60... will try again in [5] seconds
Failed to connect to localhost:9393. Attempt  #2/60... will try again in [5] seconds
Failed to connect to localhost:9393. Attempt  #3/60... will try again in [5] seconds
--2019-07-30 00:02:32--  http://localhost:9393/about
Resolving localhost (localhost)... ::1, 127.0.0.1
Connecting to localhost (localhost)|::1|:9393... connected.
HTTP request sent, awaiting response... 200
Length: unspecified [application/hal+json]
Saving to: ‘STDOUT’

     0K .                                                       183M=0s

2019-07-30 00:02:33 (183 MB/s) - written to stdout [1689]

--2019-07-30 00:02:33--  http://localhost:7577/api/about
Resolving localhost (localhost)... ::1, 127.0.0.1
Connecting to localhost (localhost)|::1|:7577... connected.
HTTP request sent, awaiting response... 200
Length: unspecified [application/hal+json]
Saving to: ‘STDOUT’

     0K                                                        56.1M=0s

2019-07-30 00:02:33 (56.1 MB/s) - written to stdout [426]

Killing process PID [5482]
Killing process PID [5405]
Stopping mysql_mysql_1 ...

Stopping mysql_mysql_1 ... done
Removing mysql_mysql_1 ...

Removing mysql_mysql_1 ... done
Stopping kafka_kafka_1     ...
Stopping kafka_zookeeper_1 ...

Stopping kafka_kafka_1     ... done

Stopping kafka_zookeeper_1 ... done
Removing kafka_kafka_1     ...
Removing kafka_zookeeper_1 ...

Removing kafka_zookeeper_1 ... done

Removing kafka_kafka_1     ... done