Local + SCDF-1.7.5.BS + Skipper 1.1.5.BS

Build: #532 failed

Job: Run Data Flow Acceptance Tests for Kafka failed

Stages & jobs

  1. Test Stage - Kafka

  2. Test Stage - Rabbit

Job result summary

Completed
Duration
39 minutes
Agent
bamboo-19.af.pivotal.io
Revision
dd41fb40bc32a7a65c2616a8ca39a0a5c2402ad1 dd41fb40bc32a7a65c2616a8ca39a0a5c2402ad1
Total tests
22
Failing since
#301 (Scheduled – )

Tests

  • 22 tests in total
  • 9 tests failed
  • 3 tests were quarantined / skipped
  • 36 minutes taken in total.
Existing test failures 9
Status Test Failing since Duration
java.lang.AssertionError: Sink not started
	at org.junit.Assert.fail(Assert.java:88)
	at org.junit.Assert.assertTrue(Assert.java:41)
	at org.springframework.cloud.dataflow.acceptance.test.AnalyticsTests.analyticsTest(AnalyticsTests.java:62)
java.lang.AssertionError: Sink not started
	at org.junit.Assert.fail(Assert.java:88)
	at org.junit.Assert.assertTrue(Assert.java:41)
	at org.springframework.cloud.dataflow.acceptance.test.HttpSourceTests.httpSourceTests(HttpSourceTests.java:44)
java.lang.AssertionError: ':MANY-TO-ONE-DESTINATION > log' not started
	at org.junit.Assert.fail(Assert.java:88)
	at org.junit.Assert.assertTrue(Assert.java:41)
	at org.springframework.cloud.dataflow.acceptance.test.NamedChannelTests.deployStream(NamedChannelTests.java:89)
	at org.springframework.cloud.dataflow.acceptance.test.NamedChannelTests.deployLog(NamedChannelTests.java:96)
	at org.springframework.cloud.dataflow.acceptance.test.NamedChannelTests.manyToOneTest(NamedChannelTests.java:58)
java.lang.AssertionError: ':LOG-DESTINATION > log' not started
	at org.junit.Assert.fail(Assert.java:88)
	at org.junit.Assert.assertTrue(Assert.java:41)
	at org.springframework.cloud.dataflow.acceptance.test.NamedChannelTests.deployStream(NamedChannelTests.java:89)
	at org.springframework.cloud.dataflow.acceptance.test.NamedChannelTests.deployLog(NamedChannelTests.java:96)
	at org.springframework.cloud.dataflow.acceptance.test.NamedChannelTests.testDestination(NamedChannelTests.java:35)
java.lang.AssertionError: 'http | log' not started
	at org.junit.Assert.fail(Assert.java:88)
	at org.junit.Assert.assertTrue(Assert.java:41)
	at org.springframework.cloud.dataflow.acceptance.test.NamedChannelTests.testTap(NamedChannelTests.java:47)
java.lang.AssertionError: Sink not started
	at org.junit.Assert.fail(Assert.java:88)
	at org.junit.Assert.assertTrue(Assert.java:41)
	at org.springframework.cloud.dataflow.acceptance.test.TickTockTests.tickTockTests(TickTockTests.java:49)
java.lang.AssertionError: Sink not started
	at org.junit.Assert.fail(Assert.java:88)
	at org.junit.Assert.assertTrue(Assert.java:41)
	at org.springframework.cloud.dataflow.acceptance.test.TickTockTests.tickTockUpdateRollbackTests(TickTockTests.java:69)
java.lang.AssertionError: Sink not started
	at org.junit.Assert.fail(Assert.java:88)
	at org.junit.Assert.assertTrue(Assert.java:41)
	at org.springframework.cloud.dataflow.acceptance.test.TransformTests.transformTests(TransformTests.java:43)
java.lang.AssertionError: Processor not started
	at org.junit.Assert.fail(Assert.java:88)
	at org.junit.Assert.assertTrue(Assert.java:41)
	at org.springframework.cloud.dataflow.acceptance.test.WoodChuckTests.testPartitioning(WoodChuckTests.java:46)

Error summary

The build generated some errors. See the full build log for more details.

Pulling mysql (mysql:5.7)...
Creating mysql_mysql_1 ...

Creating mysql_mysql_1 ... done
Pulling zookeeper (wurstmeister/zookeeper:)...
Pulling kafka (wurstmeister/kafka:2.11-0.11.0.3)...
Creating kafka_zookeeper_1 ...
Creating kafka_kafka_1     ...

Creating kafka_kafka_1     ... done

Creating kafka_zookeeper_1 ... done
2020-03-14 00:02:35 URL:https://repo.spring.io/libs-snapshot/org/springframework/cloud/spring-cloud-skipper-server/1.1.5.BUILD-SNAPSHOT/spring-cloud-skipper-server-1.1.5.BUILD-SNAPSHOT.jar [74127033/74127033] -> "/opt/bamboo-home/xml-data/build-dir/SCDT-LOCALSKIPPER11X-KAFKA/local/skipper-server/skipper-server.jar" [1]
Failed to connect to localhost:7577. Attempt  #1/60... will try again in [5] seconds
Failed to connect to localhost:7577. Attempt  #2/60... will try again in [5] seconds
Failed to connect to localhost:7577. Attempt  #3/60... will try again in [5] seconds
Failed to connect to localhost:7577. Attempt  #4/60... will try again in [5] seconds
2020-03-14 00:03:00 URL:https://repo.spring.io/libs-snapshot/org/springframework/cloud/spring-cloud-dataflow-server-local/1.7.5.BUILD-SNAPSHOT/spring-cloud-dataflow-server-local-1.7.5.BUILD-SNAPSHOT.jar [66157835/66157835] -> "/opt/bamboo-home/xml-data/build-dir/SCDT-LOCALSKIPPER11X-KAFKA/local/server/scdf-server.jar" [1]
Failed to connect to localhost:9393. Attempt  #1/60... will try again in [5] seconds
Failed to connect to localhost:9393. Attempt  #2/60... will try again in [5] seconds
Failed to connect to localhost:9393. Attempt  #3/60... will try again in [5] seconds
--2020-03-14 00:03:16--  http://localhost:9393/about
Resolving localhost (localhost)... ::1, 127.0.0.1
Connecting to localhost (localhost)|::1|:9393... connected.
HTTP request sent, awaiting response... 200
Length: unspecified [application/hal+json]
Saving to: ‘STDOUT’

     0K .                                                       170M=0s

2020-03-14 00:03:17 (170 MB/s) - written to stdout [1689]

--2020-03-14 00:03:17--  http://localhost:7577/api/about
Resolving localhost (localhost)... ::1, 127.0.0.1
Connecting to localhost (localhost)|::1|:7577... connected.
HTTP request sent, awaiting response... 200
Length: unspecified [application/hal+json]
Saving to: ‘STDOUT’

     0K                                                        50.2M=0s

2020-03-14 00:03:17 (50.2 MB/s) - written to stdout [426]

Killing process PID [11456]
Killing process PID [11338]
Stopping mysql_mysql_1 ...

Stopping mysql_mysql_1 ... done
Removing mysql_mysql_1 ...

Removing mysql_mysql_1 ... done
Stopping kafka_kafka_1     ...
Stopping kafka_zookeeper_1 ...

Stopping kafka_kafka_1     ... done

Stopping kafka_zookeeper_1 ... done
Removing kafka_kafka_1     ...
Removing kafka_zookeeper_1 ...

Removing kafka_zookeeper_1 ... done

Removing kafka_kafka_1     ... done