Local Acceptance tests for SCDF 2.1.x and Skipper 2.0.x

Build: #148 failed Scheduled

Stages & jobs

  1. Test Stage - Kafka

  2. Test Stage - Rabbit

Build result summary

Details

Completed
Duration
68 minutes
Labels
None
Revision
ccc77f664d11e18a3b7f2fa17f012d09d08432a9 ccc77f664d11e18a3b7f2fa17f012d09d08432a9
Total tests
22

Tests

Responsible

No one has taken responsibility for this failure

Tests

New test failures 3
Status Test View job Duration
Collapse Failed ComposedTaskTests ctrMultipleLaunchWithArguments History
Run Data Flow Acceptance Tests for Kafka 3 mins
java.lang.AssertionError: null
	at org.junit.Assert.fail(Assert.java:86)
	at org.junit.Assert.assertTrue(Assert.java:41)
	at org.junit.Assert.assertTrue(Assert.java:52)
	at org.springframework.cloud.dataflow.acceptance.test.ComposedTaskTests.assertTaskExecutions(ComposedTaskTests.java:65)
	at org.springframework.cloud.dataflow.acceptance.test.ComposedTaskTests.ctrMultipleLaunchWithArguments(ComposedTaskTests.java:57)
Collapse Failed ComposedTaskTests ctrMultipleLaunch History
Run Data Flow Acceptance Tests for Kafka 3 mins
java.lang.AssertionError: null
	at org.junit.Assert.fail(Assert.java:86)
	at org.junit.Assert.assertTrue(Assert.java:41)
	at org.junit.Assert.assertTrue(Assert.java:52)
	at org.springframework.cloud.dataflow.acceptance.test.ComposedTaskTests.assertTaskExecutions(ComposedTaskTests.java:65)
	at org.springframework.cloud.dataflow.acceptance.test.ComposedTaskTests.ctrMultipleLaunch(ComposedTaskTests.java:47)
Collapse Failed ComposedTaskTests ctrLaunch History
Run Data Flow Acceptance Tests for Kafka 3 mins
java.lang.AssertionError: null
	at org.junit.Assert.fail(Assert.java:86)
	at org.junit.Assert.assertTrue(Assert.java:41)
	at org.junit.Assert.assertTrue(Assert.java:52)
	at org.springframework.cloud.dataflow.acceptance.test.ComposedTaskTests.assertTaskExecutions(ComposedTaskTests.java:65)
	at org.springframework.cloud.dataflow.acceptance.test.ComposedTaskTests.ctrLaunch(ComposedTaskTests.java:41)