Local Acceptance tests for SCDF 2.1.x and Skipper 2.0.x

Build: #180 failed Scheduled

Stages & jobs

  1. Test Stage - Kafka

  2. Test Stage - Rabbit

Test results

  • 22 tests in total
  • 3 tests failed
  • 4 tests were quarantined / skipped
  • 21 minutes taken in total.
Existing test failures 3
Status Test Failing since View job Duration
java.lang.AssertionError: null
	at org.junit.Assert.fail(Assert.java:86)
	at org.junit.Assert.assertTrue(Assert.java:41)
	at org.junit.Assert.assertTrue(Assert.java:52)
	at org.springframework.cloud.dataflow.acceptance.test.ComposedTaskTests.assertTaskExecutions(ComposedTaskTests.java:65)
	at org.springframework.cloud.dataflow.acceptance.test.ComposedTaskTests.ctrMultipleLaunchWithArguments(ComposedTaskTests.java:57)
java.lang.AssertionError: null
	at org.junit.Assert.fail(Assert.java:86)
	at org.junit.Assert.assertTrue(Assert.java:41)
	at org.junit.Assert.assertTrue(Assert.java:52)
	at org.springframework.cloud.dataflow.acceptance.test.ComposedTaskTests.assertTaskExecutions(ComposedTaskTests.java:65)
	at org.springframework.cloud.dataflow.acceptance.test.ComposedTaskTests.ctrMultipleLaunch(ComposedTaskTests.java:47)
java.lang.AssertionError: null
	at org.junit.Assert.fail(Assert.java:86)
	at org.junit.Assert.assertTrue(Assert.java:41)
	at org.junit.Assert.assertTrue(Assert.java:52)
	at org.springframework.cloud.dataflow.acceptance.test.ComposedTaskTests.assertTaskExecutions(ComposedTaskTests.java:65)
	at org.springframework.cloud.dataflow.acceptance.test.ComposedTaskTests.ctrLaunch(ComposedTaskTests.java:41)
Skipped tests 4
Status Test Failing since View job
Skipped AnalyticsTests analyticsTest History
Failing since build #2 (Manual run by Mark Pollack) Run Data Flow Acceptance Tests for Kafka
Skipped NamedChannelTests directedGraphTest History
Run Data Flow Acceptance Tests for Kafka
Skipped SchedulerTests org.springframework.cloud.dataflow.acceptance.test.SchedulerTests History
Run Data Flow Acceptance Tests for Kafka
Skipped TickTockTests tickTockTestsFromConfigServer History
Run Data Flow Acceptance Tests for Kafka