Local Acceptance tests for SCDF 2.1.x and Skipper 2.0.x

Build: #184 failed Scheduled

Stages & jobs

  1. Test Stage - Kafka

  2. Test Stage - Rabbit

Build result summary

Details

Completed
Duration
51 minutes
Labels
None
Revision
31b1e288f779c0c3050502fe073a1959a4d5d153 31b1e288f779c0c3050502fe073a1959a4d5d153
Total tests
22
Failing since
#148 (Scheduled – )

Responsible

This build has been failing since #148
No one has taken responsibility

Tests

New test failures 1
Status Test View job Duration
Collapse Failed NamedChannelTests manyToOneTest History
Run Data Flow Acceptance Tests for Kafka 10 mins
java.lang.IllegalStateException: Unable to start stream MANY-TO-ONE.  Definition = :MANY-TO-ONE-DESTINATION > log
	at org.springframework.cloud.dataflow.acceptance.test.AbstractStreamTests.streamAvailable(AbstractStreamTests.java:284)
	at org.springframework.cloud.dataflow.acceptance.test.AbstractStreamTests.deployStream(AbstractStreamTests.java:183)
	at org.springframework.cloud.dataflow.acceptance.test.NamedChannelTests.deployStream(NamedChannelTests.java:88)
	at org.springframework.cloud.dataflow.acceptance.test.NamedChannelTests.deployLog(NamedChannelTests.java:96)
	at org.springframework.cloud.dataflow.acceptance.test.NamedChannelTests.manyToOneTest(NamedChannelTests.java:58)
Existing test failures 3
Status Test Failing since View job Duration
java.lang.AssertionError: null
	at org.junit.Assert.fail(Assert.java:86)
	at org.junit.Assert.assertTrue(Assert.java:41)
	at org.junit.Assert.assertTrue(Assert.java:52)
	at org.springframework.cloud.dataflow.acceptance.test.ComposedTaskTests.assertTaskExecutions(ComposedTaskTests.java:65)
	at org.springframework.cloud.dataflow.acceptance.test.ComposedTaskTests.ctrLaunch(ComposedTaskTests.java:41)
java.lang.AssertionError: null
	at org.junit.Assert.fail(Assert.java:86)
	at org.junit.Assert.assertTrue(Assert.java:41)
	at org.junit.Assert.assertTrue(Assert.java:52)
	at org.springframework.cloud.dataflow.acceptance.test.ComposedTaskTests.assertTaskExecutions(ComposedTaskTests.java:65)
	at org.springframework.cloud.dataflow.acceptance.test.ComposedTaskTests.ctrMultipleLaunch(ComposedTaskTests.java:47)
java.lang.AssertionError: null
	at org.junit.Assert.fail(Assert.java:86)
	at org.junit.Assert.assertTrue(Assert.java:41)
	at org.junit.Assert.assertTrue(Assert.java:52)
	at org.springframework.cloud.dataflow.acceptance.test.ComposedTaskTests.assertTaskExecutions(ComposedTaskTests.java:65)
	at org.springframework.cloud.dataflow.acceptance.test.ComposedTaskTests.ctrMultipleLaunchWithArguments(ComposedTaskTests.java:57)