Local Acceptance tests for SCDF 2.1.x and Skipper 2.0.x

Build: #184 failed Scheduled

Stages & jobs

  1. Test Stage - Kafka

  2. Test Stage - Rabbit

Test results

  • 22 tests in total
  • 4 tests failed
  • 1 failure is new
  • 4 tests were quarantined / skipped
  • 29 minutes taken in total.
New test failures 1
Status Test View job Duration
Collapse Failed NamedChannelTests manyToOneTest History
Run Data Flow Acceptance Tests for Kafka 10 mins
java.lang.IllegalStateException: Unable to start stream MANY-TO-ONE.  Definition = :MANY-TO-ONE-DESTINATION > log
	at org.springframework.cloud.dataflow.acceptance.test.AbstractStreamTests.streamAvailable(AbstractStreamTests.java:284)
	at org.springframework.cloud.dataflow.acceptance.test.AbstractStreamTests.deployStream(AbstractStreamTests.java:183)
	at org.springframework.cloud.dataflow.acceptance.test.NamedChannelTests.deployStream(NamedChannelTests.java:88)
	at org.springframework.cloud.dataflow.acceptance.test.NamedChannelTests.deployLog(NamedChannelTests.java:96)
	at org.springframework.cloud.dataflow.acceptance.test.NamedChannelTests.manyToOneTest(NamedChannelTests.java:58)
Existing test failures 3
Status Test Failing since View job Duration
java.lang.AssertionError: null
	at org.junit.Assert.fail(Assert.java:86)
	at org.junit.Assert.assertTrue(Assert.java:41)
	at org.junit.Assert.assertTrue(Assert.java:52)
	at org.springframework.cloud.dataflow.acceptance.test.ComposedTaskTests.assertTaskExecutions(ComposedTaskTests.java:65)
	at org.springframework.cloud.dataflow.acceptance.test.ComposedTaskTests.ctrLaunch(ComposedTaskTests.java:41)
java.lang.AssertionError: null
	at org.junit.Assert.fail(Assert.java:86)
	at org.junit.Assert.assertTrue(Assert.java:41)
	at org.junit.Assert.assertTrue(Assert.java:52)
	at org.springframework.cloud.dataflow.acceptance.test.ComposedTaskTests.assertTaskExecutions(ComposedTaskTests.java:65)
	at org.springframework.cloud.dataflow.acceptance.test.ComposedTaskTests.ctrMultipleLaunch(ComposedTaskTests.java:47)
java.lang.AssertionError: null
	at org.junit.Assert.fail(Assert.java:86)
	at org.junit.Assert.assertTrue(Assert.java:41)
	at org.junit.Assert.assertTrue(Assert.java:52)
	at org.springframework.cloud.dataflow.acceptance.test.ComposedTaskTests.assertTaskExecutions(ComposedTaskTests.java:65)
	at org.springframework.cloud.dataflow.acceptance.test.ComposedTaskTests.ctrMultipleLaunchWithArguments(ComposedTaskTests.java:57)
Skipped tests 4
Status Test Failing since View job
Skipped AnalyticsTests analyticsTest History
Failing since build #2 (Manual run by Mark Pollack) Run Data Flow Acceptance Tests for Kafka
Skipped NamedChannelTests directedGraphTest History
Run Data Flow Acceptance Tests for Kafka
Skipped SchedulerTests org.springframework.cloud.dataflow.acceptance.test.SchedulerTests History
Run Data Flow Acceptance Tests for Kafka
Skipped TickTockTests tickTockTestsFromConfigServer History
Run Data Flow Acceptance Tests for Kafka