Local Acceptance tests for SCDF 2.1.x and Skipper 2.0.x

Build: #2 failed Manual run by Mark Pollack

Stages & jobs

  1. Test Stage - Kafka

  2. Test Stage - Rabbit

Build result summary

Details

Completed
Duration
2 minutes
Labels
None
Revision
583bb093ba93c2193a044a960f1c7d4321b70d14 583bb093ba93c2193a044a960f1c7d4321b70d14
Total tests
22
Fixed in
#6 (Manual run by Ilayaperumal Gopinathan)

Tests

Responsible

Code commits

Author Commit Message Commit date
Mark Pollack Mark Pollack 583bb093ba93c2193a044a960f1c7d4321b70d14 583bb093ba93c2193a044a960f1c7d4321b70d14 remove loop on cf logs command
Ilayaperumal Gopinathan Ilayaperumal Gopinathan 520b6282e1db9c1c6d411da82bec8b3e44447d2c 520b6282e1db9c1c6d411da82bec8b3e44447d2c Update app import URIs to use the latest
 - dataflow.spring.io redirects
 - Remove unused app registration usages
 - update for local, CF and K8s environment properties for Kafka/RabbitMQ binders

Resolves #205

Address review comments
Mark Pollack Mark Pollack 82e35b903476d4f9091852bced5a96fe294fbe2a 82e35b903476d4f9091852bced5a96fe294fbe2a Read input stream before waiting on process exit
Mark Pollack Mark Pollack 5f35b3b63fa8d55d5242548d55a6f058404a3a6a 5f35b3b63fa8d55d5242548d55a6f058404a3a6a Retry CF log command execution
Ilayaperumal Gopinathan Ilayaperumal Gopinathan 575ed38bf6aa5520a00a0ee029aed57cfc6bf1d5 575ed38bf6aa5520a00a0ee029aed57cfc6bf1d5 Update wget to use --no-check-certificate

Configuration changes

Plan configuration has changed since the last successful build. See the plan audit log for more details.

Tests

New test failures 14
Status Test View job Duration
Collapse Failed AnalyticsTests analyticsTest History
Run Data Flow Acceptance Tests for Kafka < 1 sec
org.springframework.beans.factory.BeanCreationException: Error creating bean with name 'org.springframework.cloud.dataflow.acceptance.test.AnalyticsTests': Invocation of init method failed; nested exception is org.springframework.web.client.ResourceAccessException: I/O error on GET request for "https://localhost:9393": Unrecognized SSL message, plaintext connection?; nested exception is javax.net.ssl.SSLException: Unrecognized SSL message, plaintext connection?
	at org.springframework.beans.factory.support.AbstractAutowireCapableBeanFactory.initializeBean(AbstractAutowireCapableBeanFactory.java:1583)
	at org.springframework.beans.factory.support.AbstractAutowireCapableBeanFactory.initializeBean(AbstractAutowireCapableBeanFactory.java:399)
	at org.springframework.test.context.support.DependencyInjectionTestExecutionListener.injectDependencies(DependencyInjectionTestExecutionListener.java:119)
	at org.springframework.test.context.support.DependencyInjectionTestExecutionListener.prepareTestInstance(DependencyInjectionTestExecutionListener.java:83)
	at org.springframework.boot.test.autoconfigure.SpringBootDependencyInjectionTestExecutionListener.prepareTestInstance(SpringBootDependencyInjectionTestExecutionListener.java:44)
	at org.springframework.test.context.TestContextManager.prepareTestInstance(TestContextManager.java:230)
	at org.springframework.test.context.junit4.SpringJUnit4ClassRunner.createTest(SpringJUnit4ClassRunner.java:228)
(105 more lines...)
Collapse Failed ComposedTaskTests ctrMultipleLaunch History
Run Data Flow Acceptance Tests for Kafka < 1 sec
org.springframework.beans.factory.BeanCreationException: Error creating bean with name 'org.springframework.cloud.dataflow.acceptance.test.ComposedTaskTests': Invocation of init method failed; nested exception is org.springframework.web.client.ResourceAccessException: I/O error on GET request for "https://localhost:9393": Unrecognized SSL message, plaintext connection?; nested exception is javax.net.ssl.SSLException: Unrecognized SSL message, plaintext connection?
	at org.springframework.beans.factory.support.AbstractAutowireCapableBeanFactory.initializeBean(AbstractAutowireCapableBeanFactory.java:1583)
	at org.springframework.beans.factory.support.AbstractAutowireCapableBeanFactory.initializeBean(AbstractAutowireCapableBeanFactory.java:399)
	at org.springframework.test.context.support.DependencyInjectionTestExecutionListener.injectDependencies(DependencyInjectionTestExecutionListener.java:119)
	at org.springframework.test.context.support.DependencyInjectionTestExecutionListener.prepareTestInstance(DependencyInjectionTestExecutionListener.java:83)
	at org.springframework.test.context.TestContextManager.prepareTestInstance(TestContextManager.java:230)
	at org.springframework.test.context.junit4.SpringJUnit4ClassRunner.createTest(SpringJUnit4ClassRunner.java:228)
	at org.springframework.test.context.junit4.SpringJUnit4ClassRunner$1.runReflectiveCall(SpringJUnit4ClassRunner.java:287)
(102 more lines...)
Collapse Failed ComposedTaskTests ctrMultipleLaunchWithProperties History
Run Data Flow Acceptance Tests for Kafka < 1 sec
org.springframework.beans.factory.BeanCreationException: Error creating bean with name 'org.springframework.cloud.dataflow.acceptance.test.ComposedTaskTests': Invocation of init method failed; nested exception is org.springframework.web.client.ResourceAccessException: I/O error on GET request for "https://localhost:9393": Unrecognized SSL message, plaintext connection?; nested exception is javax.net.ssl.SSLException: Unrecognized SSL message, plaintext connection?
	at org.springframework.beans.factory.support.AbstractAutowireCapableBeanFactory.initializeBean(AbstractAutowireCapableBeanFactory.java:1583)
	at org.springframework.beans.factory.support.AbstractAutowireCapableBeanFactory.initializeBean(AbstractAutowireCapableBeanFactory.java:399)
	at org.springframework.test.context.support.DependencyInjectionTestExecutionListener.injectDependencies(DependencyInjectionTestExecutionListener.java:119)
	at org.springframework.test.context.support.DependencyInjectionTestExecutionListener.prepareTestInstance(DependencyInjectionTestExecutionListener.java:83)
	at org.springframework.test.context.TestContextManager.prepareTestInstance(TestContextManager.java:230)
	at org.springframework.test.context.junit4.SpringJUnit4ClassRunner.createTest(SpringJUnit4ClassRunner.java:228)
	at org.springframework.test.context.junit4.SpringJUnit4ClassRunner$1.runReflectiveCall(SpringJUnit4ClassRunner.java:287)
(102 more lines...)
Collapse Failed ComposedTaskTests ctrLaunch History
Run Data Flow Acceptance Tests for Kafka < 1 sec
org.springframework.beans.factory.BeanCreationException: Error creating bean with name 'org.springframework.cloud.dataflow.acceptance.test.ComposedTaskTests': Invocation of init method failed; nested exception is org.springframework.web.client.ResourceAccessException: I/O error on GET request for "https://localhost:9393": Unrecognized SSL message, plaintext connection?; nested exception is javax.net.ssl.SSLException: Unrecognized SSL message, plaintext connection?
	at org.springframework.beans.factory.support.AbstractAutowireCapableBeanFactory.initializeBean(AbstractAutowireCapableBeanFactory.java:1583)
	at org.springframework.beans.factory.support.AbstractAutowireCapableBeanFactory.initializeBean(AbstractAutowireCapableBeanFactory.java:399)
	at org.springframework.test.context.support.DependencyInjectionTestExecutionListener.injectDependencies(DependencyInjectionTestExecutionListener.java:119)
	at org.springframework.test.context.support.DependencyInjectionTestExecutionListener.prepareTestInstance(DependencyInjectionTestExecutionListener.java:83)
	at org.springframework.test.context.TestContextManager.prepareTestInstance(TestContextManager.java:230)
	at org.springframework.test.context.junit4.SpringJUnit4ClassRunner.createTest(SpringJUnit4ClassRunner.java:228)
	at org.springframework.test.context.junit4.SpringJUnit4ClassRunner$1.runReflectiveCall(SpringJUnit4ClassRunner.java:287)
(102 more lines...)
Collapse Failed HttpSourceTests httpSourceTests History
Run Data Flow Acceptance Tests for Kafka < 1 sec
org.springframework.beans.factory.BeanCreationException: Error creating bean with name 'org.springframework.cloud.dataflow.acceptance.test.HttpSourceTests': Invocation of init method failed; nested exception is org.springframework.web.client.ResourceAccessException: I/O error on GET request for "https://localhost:9393": Unrecognized SSL message, plaintext connection?; nested exception is javax.net.ssl.SSLException: Unrecognized SSL message, plaintext connection?
	at org.springframework.beans.factory.support.AbstractAutowireCapableBeanFactory.initializeBean(AbstractAutowireCapableBeanFactory.java:1583)
	at org.springframework.beans.factory.support.AbstractAutowireCapableBeanFactory.initializeBean(AbstractAutowireCapableBeanFactory.java:399)
	at org.springframework.test.context.support.DependencyInjectionTestExecutionListener.injectDependencies(DependencyInjectionTestExecutionListener.java:119)
	at org.springframework.test.context.support.DependencyInjectionTestExecutionListener.prepareTestInstance(DependencyInjectionTestExecutionListener.java:83)
	at org.springframework.boot.test.autoconfigure.SpringBootDependencyInjectionTestExecutionListener.prepareTestInstance(SpringBootDependencyInjectionTestExecutionListener.java:44)
	at org.springframework.test.context.TestContextManager.prepareTestInstance(TestContextManager.java:230)
	at org.springframework.test.context.junit4.SpringJUnit4ClassRunner.createTest(SpringJUnit4ClassRunner.java:228)
(105 more lines...)
Collapse Failed NamedChannelTests testDestination History
Run Data Flow Acceptance Tests for Kafka < 1 sec
org.springframework.beans.factory.BeanCreationException: Error creating bean with name 'org.springframework.cloud.dataflow.acceptance.test.NamedChannelTests': Invocation of init method failed; nested exception is org.springframework.web.client.ResourceAccessException: I/O error on GET request for "https://localhost:9393": Unrecognized SSL message, plaintext connection?; nested exception is javax.net.ssl.SSLException: Unrecognized SSL message, plaintext connection?
	at org.springframework.beans.factory.support.AbstractAutowireCapableBeanFactory.initializeBean(AbstractAutowireCapableBeanFactory.java:1583)
	at org.springframework.beans.factory.support.AbstractAutowireCapableBeanFactory.initializeBean(AbstractAutowireCapableBeanFactory.java:399)
	at org.springframework.test.context.support.DependencyInjectionTestExecutionListener.injectDependencies(DependencyInjectionTestExecutionListener.java:119)
	at org.springframework.test.context.support.DependencyInjectionTestExecutionListener.prepareTestInstance(DependencyInjectionTestExecutionListener.java:83)
	at org.springframework.boot.test.autoconfigure.SpringBootDependencyInjectionTestExecutionListener.prepareTestInstance(SpringBootDependencyInjectionTestExecutionListener.java:44)
	at org.springframework.test.context.TestContextManager.prepareTestInstance(TestContextManager.java:230)
	at org.springframework.test.context.junit4.SpringJUnit4ClassRunner.createTest(SpringJUnit4ClassRunner.java:228)
(105 more lines...)
Collapse Failed NamedChannelTests testTap History
Run Data Flow Acceptance Tests for Kafka < 1 sec
org.springframework.beans.factory.BeanCreationException: Error creating bean with name 'org.springframework.cloud.dataflow.acceptance.test.NamedChannelTests': Invocation of init method failed; nested exception is org.springframework.web.client.ResourceAccessException: I/O error on GET request for "https://localhost:9393": Unrecognized SSL message, plaintext connection?; nested exception is javax.net.ssl.SSLException: Unrecognized SSL message, plaintext connection?
	at org.springframework.beans.factory.support.AbstractAutowireCapableBeanFactory.initializeBean(AbstractAutowireCapableBeanFactory.java:1583)
	at org.springframework.beans.factory.support.AbstractAutowireCapableBeanFactory.initializeBean(AbstractAutowireCapableBeanFactory.java:399)
	at org.springframework.test.context.support.DependencyInjectionTestExecutionListener.injectDependencies(DependencyInjectionTestExecutionListener.java:119)
	at org.springframework.test.context.support.DependencyInjectionTestExecutionListener.prepareTestInstance(DependencyInjectionTestExecutionListener.java:83)
	at org.springframework.boot.test.autoconfigure.SpringBootDependencyInjectionTestExecutionListener.prepareTestInstance(SpringBootDependencyInjectionTestExecutionListener.java:44)
	at org.springframework.test.context.TestContextManager.prepareTestInstance(TestContextManager.java:230)
	at org.springframework.test.context.junit4.SpringJUnit4ClassRunner.createTest(SpringJUnit4ClassRunner.java:228)
(105 more lines...)
Collapse Failed NamedChannelTests manyToOneTest History
Run Data Flow Acceptance Tests for Kafka < 1 sec
org.springframework.beans.factory.BeanCreationException: Error creating bean with name 'org.springframework.cloud.dataflow.acceptance.test.NamedChannelTests': Invocation of init method failed; nested exception is org.springframework.web.client.ResourceAccessException: I/O error on GET request for "https://localhost:9393": Unrecognized SSL message, plaintext connection?; nested exception is javax.net.ssl.SSLException: Unrecognized SSL message, plaintext connection?
	at org.springframework.beans.factory.support.AbstractAutowireCapableBeanFactory.initializeBean(AbstractAutowireCapableBeanFactory.java:1583)
	at org.springframework.beans.factory.support.AbstractAutowireCapableBeanFactory.initializeBean(AbstractAutowireCapableBeanFactory.java:399)
	at org.springframework.test.context.support.DependencyInjectionTestExecutionListener.injectDependencies(DependencyInjectionTestExecutionListener.java:119)
	at org.springframework.test.context.support.DependencyInjectionTestExecutionListener.prepareTestInstance(DependencyInjectionTestExecutionListener.java:83)
	at org.springframework.boot.test.autoconfigure.SpringBootDependencyInjectionTestExecutionListener.prepareTestInstance(SpringBootDependencyInjectionTestExecutionListener.java:44)
	at org.springframework.test.context.TestContextManager.prepareTestInstance(TestContextManager.java:230)
	at org.springframework.test.context.junit4.SpringJUnit4ClassRunner.createTest(SpringJUnit4ClassRunner.java:228)
(105 more lines...)
Collapse Failed TickTockTests tickTockTests History
Run Data Flow Acceptance Tests for Kafka < 1 sec
org.springframework.beans.factory.BeanCreationException: Error creating bean with name 'org.springframework.cloud.dataflow.acceptance.test.TickTockTests': Invocation of init method failed; nested exception is org.springframework.web.client.ResourceAccessException: I/O error on GET request for "https://localhost:9393": Unrecognized SSL message, plaintext connection?; nested exception is javax.net.ssl.SSLException: Unrecognized SSL message, plaintext connection?
	at org.springframework.beans.factory.support.AbstractAutowireCapableBeanFactory.initializeBean(AbstractAutowireCapableBeanFactory.java:1583)
	at org.springframework.beans.factory.support.AbstractAutowireCapableBeanFactory.initializeBean(AbstractAutowireCapableBeanFactory.java:399)
	at org.springframework.test.context.support.DependencyInjectionTestExecutionListener.injectDependencies(DependencyInjectionTestExecutionListener.java:119)
	at org.springframework.test.context.support.DependencyInjectionTestExecutionListener.prepareTestInstance(DependencyInjectionTestExecutionListener.java:83)
	at org.springframework.boot.test.autoconfigure.SpringBootDependencyInjectionTestExecutionListener.prepareTestInstance(SpringBootDependencyInjectionTestExecutionListener.java:44)
	at org.springframework.test.context.TestContextManager.prepareTestInstance(TestContextManager.java:230)
	at org.springframework.test.context.junit4.SpringJUnit4ClassRunner.createTest(SpringJUnit4ClassRunner.java:228)
(105 more lines...)
Collapse Failed TickTockTests tickTockUpdateRollbackTests History
Run Data Flow Acceptance Tests for Kafka < 1 sec
org.springframework.beans.factory.BeanCreationException: Error creating bean with name 'org.springframework.cloud.dataflow.acceptance.test.TickTockTests': Invocation of init method failed; nested exception is org.springframework.web.client.ResourceAccessException: I/O error on GET request for "https://localhost:9393": Unrecognized SSL message, plaintext connection?; nested exception is javax.net.ssl.SSLException: Unrecognized SSL message, plaintext connection?
	at org.springframework.beans.factory.support.AbstractAutowireCapableBeanFactory.initializeBean(AbstractAutowireCapableBeanFactory.java:1583)
	at org.springframework.beans.factory.support.AbstractAutowireCapableBeanFactory.initializeBean(AbstractAutowireCapableBeanFactory.java:399)
	at org.springframework.test.context.support.DependencyInjectionTestExecutionListener.injectDependencies(DependencyInjectionTestExecutionListener.java:119)
	at org.springframework.test.context.support.DependencyInjectionTestExecutionListener.prepareTestInstance(DependencyInjectionTestExecutionListener.java:83)
	at org.springframework.boot.test.autoconfigure.SpringBootDependencyInjectionTestExecutionListener.prepareTestInstance(SpringBootDependencyInjectionTestExecutionListener.java:44)
	at org.springframework.test.context.TestContextManager.prepareTestInstance(TestContextManager.java:230)
	at org.springframework.test.context.junit4.SpringJUnit4ClassRunner.createTest(SpringJUnit4ClassRunner.java:228)
(105 more lines...)
Collapse Failed TimestampTaskTests timeStampTests History
Run Data Flow Acceptance Tests for Kafka < 1 sec
org.springframework.beans.factory.BeanCreationException: Error creating bean with name 'org.springframework.cloud.dataflow.acceptance.test.TimestampTaskTests': Invocation of init method failed; nested exception is org.springframework.web.client.ResourceAccessException: I/O error on GET request for "https://localhost:9393": Unrecognized SSL message, plaintext connection?; nested exception is javax.net.ssl.SSLException: Unrecognized SSL message, plaintext connection?
	at org.springframework.beans.factory.support.AbstractAutowireCapableBeanFactory.initializeBean(AbstractAutowireCapableBeanFactory.java:1583)
	at org.springframework.beans.factory.support.AbstractAutowireCapableBeanFactory.initializeBean(AbstractAutowireCapableBeanFactory.java:399)
	at org.springframework.test.context.support.DependencyInjectionTestExecutionListener.injectDependencies(DependencyInjectionTestExecutionListener.java:119)
	at org.springframework.test.context.support.DependencyInjectionTestExecutionListener.prepareTestInstance(DependencyInjectionTestExecutionListener.java:83)
	at org.springframework.test.context.TestContextManager.prepareTestInstance(TestContextManager.java:230)
	at org.springframework.test.context.junit4.SpringJUnit4ClassRunner.createTest(SpringJUnit4ClassRunner.java:228)
	at org.springframework.test.context.junit4.SpringJUnit4ClassRunner$1.runReflectiveCall(SpringJUnit4ClassRunner.java:287)
(102 more lines...)
Collapse Failed TimestampTaskTests timeStampTestsMultipleLaunch History
Run Data Flow Acceptance Tests for Kafka < 1 sec
org.springframework.beans.factory.BeanCreationException: Error creating bean with name 'org.springframework.cloud.dataflow.acceptance.test.TimestampTaskTests': Invocation of init method failed; nested exception is org.springframework.web.client.ResourceAccessException: I/O error on GET request for "https://localhost:9393": Unrecognized SSL message, plaintext connection?; nested exception is javax.net.ssl.SSLException: Unrecognized SSL message, plaintext connection?
	at org.springframework.beans.factory.support.AbstractAutowireCapableBeanFactory.initializeBean(AbstractAutowireCapableBeanFactory.java:1583)
	at org.springframework.beans.factory.support.AbstractAutowireCapableBeanFactory.initializeBean(AbstractAutowireCapableBeanFactory.java:399)
	at org.springframework.test.context.support.DependencyInjectionTestExecutionListener.injectDependencies(DependencyInjectionTestExecutionListener.java:119)
	at org.springframework.test.context.support.DependencyInjectionTestExecutionListener.prepareTestInstance(DependencyInjectionTestExecutionListener.java:83)
	at org.springframework.test.context.TestContextManager.prepareTestInstance(TestContextManager.java:230)
	at org.springframework.test.context.junit4.SpringJUnit4ClassRunner.createTest(SpringJUnit4ClassRunner.java:228)
	at org.springframework.test.context.junit4.SpringJUnit4ClassRunner$1.runReflectiveCall(SpringJUnit4ClassRunner.java:287)
(102 more lines...)
Collapse Failed TransformTests transformTests History
Run Data Flow Acceptance Tests for Kafka < 1 sec
org.springframework.beans.factory.BeanCreationException: Error creating bean with name 'org.springframework.cloud.dataflow.acceptance.test.TransformTests': Invocation of init method failed; nested exception is org.springframework.web.client.ResourceAccessException: I/O error on GET request for "https://localhost:9393": Unrecognized SSL message, plaintext connection?; nested exception is javax.net.ssl.SSLException: Unrecognized SSL message, plaintext connection?
	at org.springframework.beans.factory.support.AbstractAutowireCapableBeanFactory.initializeBean(AbstractAutowireCapableBeanFactory.java:1583)
	at org.springframework.beans.factory.support.AbstractAutowireCapableBeanFactory.initializeBean(AbstractAutowireCapableBeanFactory.java:399)
	at org.springframework.test.context.support.DependencyInjectionTestExecutionListener.injectDependencies(DependencyInjectionTestExecutionListener.java:119)
	at org.springframework.test.context.support.DependencyInjectionTestExecutionListener.prepareTestInstance(DependencyInjectionTestExecutionListener.java:83)
	at org.springframework.boot.test.autoconfigure.SpringBootDependencyInjectionTestExecutionListener.prepareTestInstance(SpringBootDependencyInjectionTestExecutionListener.java:44)
	at org.springframework.test.context.TestContextManager.prepareTestInstance(TestContextManager.java:230)
	at org.springframework.test.context.junit4.SpringJUnit4ClassRunner.createTest(SpringJUnit4ClassRunner.java:228)
(105 more lines...)
Collapse Failed WoodChuckTests testPartitioning History
Run Data Flow Acceptance Tests for Kafka < 1 sec
org.springframework.beans.factory.BeanCreationException: Error creating bean with name 'org.springframework.cloud.dataflow.acceptance.test.WoodChuckTests': Invocation of init method failed; nested exception is org.springframework.web.client.ResourceAccessException: I/O error on GET request for "https://localhost:9393": Unrecognized SSL message, plaintext connection?; nested exception is javax.net.ssl.SSLException: Unrecognized SSL message, plaintext connection?
	at org.springframework.beans.factory.support.AbstractAutowireCapableBeanFactory.initializeBean(AbstractAutowireCapableBeanFactory.java:1583)
	at org.springframework.beans.factory.support.AbstractAutowireCapableBeanFactory.initializeBean(AbstractAutowireCapableBeanFactory.java:399)
	at org.springframework.test.context.support.DependencyInjectionTestExecutionListener.injectDependencies(DependencyInjectionTestExecutionListener.java:119)
	at org.springframework.test.context.support.DependencyInjectionTestExecutionListener.prepareTestInstance(DependencyInjectionTestExecutionListener.java:83)
	at org.springframework.boot.test.autoconfigure.SpringBootDependencyInjectionTestExecutionListener.prepareTestInstance(SpringBootDependencyInjectionTestExecutionListener.java:44)
	at org.springframework.test.context.TestContextManager.prepareTestInstance(TestContextManager.java:230)
	at org.springframework.test.context.junit4.SpringJUnit4ClassRunner.createTest(SpringJUnit4ClassRunner.java:228)
(105 more lines...)

Jira issues

IssueDescriptionStatus
Unknown Issue TypeLICENSE-2Could not obtain issue details from Jira