Build result summary

Details

Completed
Duration
6 minutes
Labels
None
Revision
07f855a129c4e1b87c1abdab3cd4f951fda72de1 07f855a129c4e1b87c1abdab3cd4f951fda72de1
Total tests
109
Fixed in
#12 (Rebuilt by mbg_at_pivotal)

Tests

Responsible

No one has taken responsibility for this failure

Code commits

Author Commit Message Commit date
Marius Bogoevici <mbogoevici@pivotal.io> Marius Bogoevici <mbogoevici@pivotal.io> 07f855a129c4e1b87c1abdab3cd4f951fda72de1 07f855a129c4e1b87c1abdab3cd4f951fda72de1 Use `KafkaBinderConfigurationProperties` directly
Fixes #548

- Remove redundant property copying
- Make `socketBufferSize` configurable (it wasn't provided as a configuration option)

Tests

New test failures 2
Status Test View job Duration
Collapse Failed RawModeKafkaBinderTests testTwoRequiredGroups History
Build SCS 10 secs
java.lang.AssertionError:  Expected: not null      but: was null
java.lang.AssertionError: 
Expected: not null
     but: was null
	at org.hamcrest.MatcherAssert.assertThat(MatcherAssert.java:20)
	at org.junit.Assert.assertThat(Assert.java:956)
	at org.junit.Assert.assertThat(Assert.java:923)
	at org.springframework.cloud.stream.binder.PartitionCapableBinderTests.testTwoRequiredGroups(PartitionCapableBinderTests.java:163)
(33 more lines...)
Collapse Failed RawModeKafkaBinderTests testPartitionedModuleSpEL History
Build SCS 39 secs
java.lang.AssertionError
	at org.junit.Assert.fail(Assert.java:86)
	at org.junit.Assert.assertTrue(Assert.java:41)
	at org.junit.Assert.assertNotNull(Assert.java:712)
	at org.junit.Assert.assertNotNull(Assert.java:722)
	at org.springframework.cloud.stream.binder.kafka.RawModeKafkaBinderTests.testPartitionedModuleSpEL(RawModeKafkaBinderTests.java:157)
	at sun.reflect.NativeMethodAccessorImpl.invoke0(Native Method)
	at sun.reflect.NativeMethodAccessorImpl.invoke(NativeMethodAccessorImpl.java:62)
(31 more lines...)