Build result summary

Details

Completed
Duration
5 minutes
Labels
None
Revision
6c4a271078bd8e32ed3e88ebad2c08755a39bbbe 6c4a271078bd8e32ed3e88ebad2c08755a39bbbe
Total tests
111
Fixed in
#15 (Manual run by mbg_at_pivotal)

Tests

Responsible

No one has taken responsibility for this failure

Code commits

Author Commit Message Commit date
Marius Bogoevici <mbogoevici@pivotal.io> Marius Bogoevici <mbogoevici@pivotal.io> 6c4a271078bd8e32ed3e88ebad2c08755a39bbbe 6c4a271078bd8e32ed3e88ebad2c08755a39bbbe GH-541 Make reconnect time for Kafka/Rabbit configurable
Marius Bogoevici <mbogoevici@pivotal.io> Marius Bogoevici <mbogoevici@pivotal.io> 25a8415f56351bce64b692547f5c995ed6666650 25a8415f56351bce64b692547f5c995ed6666650 Move tests to AssertJ

Tests

New test failures 3
Status Test View job Duration
Collapse Failed KafkaBinderTests testTwoRequiredGroups History
Build SCS 10 secs
java.lang.AssertionError:  Expecting actual not to be null
java.lang.AssertionError: 
Expecting actual not to be null
	at org.springframework.cloud.stream.binder.PartitionCapableBinderTests.testTwoRequiredGroups(PartitionCapableBinderTests.java:155)
	at sun.reflect.NativeMethodAccessorImpl.invoke0(Native Method)
	at sun.reflect.NativeMethodAccessorImpl.invoke(NativeMethodAccessorImpl.java:62)
	at sun.reflect.DelegatingMethodAccessorImpl.invoke(DelegatingMethodAccessorImpl.java:43)
	at java.lang.reflect.Method.invoke(Method.java:497)
(29 more lines...)
Collapse Failed KafkaBinderTests testPartitionedModuleJava History
Build SCS 15 secs
java.lang.AssertionError:  Expecting actual not to be null
java.lang.AssertionError: 
Expecting actual not to be null
	at org.springframework.cloud.stream.binder.PartitionCapableBinderTests.testPartitionedModuleJava(PartitionCapableBinderTests.java:288)
	at sun.reflect.NativeMethodAccessorImpl.invoke0(Native Method)
	at sun.reflect.NativeMethodAccessorImpl.invoke(NativeMethodAccessorImpl.java:62)
	at sun.reflect.DelegatingMethodAccessorImpl.invoke(DelegatingMethodAccessorImpl.java:43)
	at java.lang.reflect.Method.invoke(Method.java:497)
(29 more lines...)
Collapse Failed KafkaBinderTests testDefaultAutoCommitOnErrorWithoutDlq History
Build SCS 1 sec
org.junit.ComparisonFailure: expected:<"test.[5f3d75a9-7f33-4f3f-bce3-551cc778682f]"> but was:<"test.[0fe04a7e-c56f-45a9-bbdd-6aaa7d4a737e]">
	at sun.reflect.NativeConstructorAccessorImpl.newInstance0(Native Method)
	at sun.reflect.NativeConstructorAccessorImpl.newInstance(NativeConstructorAccessorImpl.java:62)
	at sun.reflect.DelegatingConstructorAccessorImpl.newInstance(DelegatingConstructorAccessorImpl.java:45)
	at org.springframework.cloud.stream.binder.kafka.KafkaBinderTests.testDefaultAutoCommitOnErrorWithoutDlq(KafkaBinderTests.java:216)
	at sun.reflect.NativeMethodAccessorImpl.invoke0(Native Method)
	at sun.reflect.NativeMethodAccessorImpl.invoke(NativeMethodAccessorImpl.java:62)
	at sun.reflect.DelegatingMethodAccessorImpl.invoke(DelegatingMethodAccessorImpl.java:43)
(30 more lines...)

Jira issues

IssueDescriptionStatus
Unknown Issue TypeGH-541Could not obtain issue details from Jira