Build: #61 failed Rebuilt by mbg_at_pivotal

Test results

  • 64 tests in total
  • 22 tests failed
  • 22 failures are new
  • 2 tests were quarantined / skipped
  • 2 minutes taken in total.
New test failures 22
Status Test View job Duration
Collapse Failed Kafka09BinderTests testDefaultConsumerStartsAtEarliest History
Build Kafka Binder < 1 sec
org.springframework.cloud.stream.binder.BinderException: Exception thrown while starting consumer: 
	at org.springframework.cloud.stream.binder.AbstractMessageChannelBinder.doBindConsumer(AbstractMessageChannelBinder.java:224)
	at org.springframework.cloud.stream.binder.AbstractMessageChannelBinder.doBindConsumer(AbstractMessageChannelBinder.java:53)
	at org.springframework.cloud.stream.binder.AbstractBinder.bindConsumer(AbstractBinder.java:141)
	at org.springframework.cloud.stream.binder.AbstractTestBinder.bindConsumer(AbstractTestBinder.java:50)
	at org.springframework.cloud.stream.binder.AbstractTestBinder.bindConsumer(AbstractTestBinder.java:31)
	at org.springframework.cloud.stream.binder.kafka.KafkaBinderTests.testDefaultConsumerStartsAtEarliest(KafkaBinderTests.java:434)
	at sun.reflect.NativeMethodAccessorImpl.invoke0(Native Method)
(38 more lines...)
Collapse Failed Kafka09BinderTests testSendAndReceiveNoOriginalContentType History
Build Kafka Binder 10 secs
java.lang.AssertionError:  Expecting actual not to be null
java.lang.AssertionError: 
Expecting actual not to be null
	at org.springframework.cloud.stream.binder.AbstractBinderTests.testSendAndReceiveNoOriginalContentType(AbstractBinderTests.java:198)
	at sun.reflect.NativeMethodAccessorImpl.invoke0(Native Method)
	at sun.reflect.NativeMethodAccessorImpl.invoke(NativeMethodAccessorImpl.java:62)
	at sun.reflect.DelegatingMethodAccessorImpl.invoke(DelegatingMethodAccessorImpl.java:43)
	at java.lang.reflect.Method.invoke(Method.java:497)
(29 more lines...)
Collapse Failed Kafka09BinderTests testEarliest History
Build Kafka Binder < 1 sec
org.springframework.cloud.stream.binder.BinderException: Exception thrown while starting consumer: 
	at org.springframework.cloud.stream.binder.AbstractMessageChannelBinder.doBindConsumer(AbstractMessageChannelBinder.java:224)
	at org.springframework.cloud.stream.binder.AbstractMessageChannelBinder.doBindConsumer(AbstractMessageChannelBinder.java:53)
	at org.springframework.cloud.stream.binder.AbstractBinder.bindConsumer(AbstractBinder.java:141)
	at org.springframework.cloud.stream.binder.AbstractTestBinder.bindConsumer(AbstractTestBinder.java:50)
	at org.springframework.cloud.stream.binder.AbstractTestBinder.bindConsumer(AbstractTestBinder.java:31)
	at org.springframework.cloud.stream.binder.kafka.KafkaBinderTests.testEarliest(KafkaBinderTests.java:467)
	at sun.reflect.NativeMethodAccessorImpl.invoke0(Native Method)
(38 more lines...)
Collapse Failed Kafka09BinderTests testSendAndReceive History
Build Kafka Binder 10 secs
java.lang.AssertionError:  Expecting actual not to be null
java.lang.AssertionError: 
Expecting actual not to be null
	at org.springframework.cloud.stream.binder.AbstractBinderTests.testSendAndReceive(AbstractBinderTests.java:126)
	at sun.reflect.NativeMethodAccessorImpl.invoke0(Native Method)
	at sun.reflect.NativeMethodAccessorImpl.invoke(NativeMethodAccessorImpl.java:62)
	at sun.reflect.DelegatingMethodAccessorImpl.invoke(DelegatingMethodAccessorImpl.java:43)
	at java.lang.reflect.Method.invoke(Method.java:497)
(29 more lines...)
Collapse Failed Kafka09BinderTests testDefaultAutoCommitOnErrorWithoutDlq History
Build Kafka Binder < 1 sec
org.springframework.cloud.stream.binder.BinderException: Exception thrown while starting consumer: 
	at org.springframework.cloud.stream.binder.AbstractMessageChannelBinder.doBindConsumer(AbstractMessageChannelBinder.java:224)
	at org.springframework.cloud.stream.binder.AbstractMessageChannelBinder.doBindConsumer(AbstractMessageChannelBinder.java:53)
	at org.springframework.cloud.stream.binder.AbstractBinder.bindConsumer(AbstractBinder.java:141)
	at org.springframework.cloud.stream.binder.AbstractTestBinder.bindConsumer(AbstractTestBinder.java:50)
	at org.springframework.cloud.stream.binder.AbstractTestBinder.bindConsumer(AbstractTestBinder.java:31)
	at org.springframework.cloud.stream.binder.kafka.KafkaBinderTests.testDefaultAutoCommitOnErrorWithoutDlq(KafkaBinderTests.java:157)
	at sun.reflect.NativeMethodAccessorImpl.invoke0(Native Method)
(38 more lines...)
Collapse Failed Kafka09BinderTests testSendAndReceiveMultipleTopics History
Build Kafka Binder < 1 sec
org.springframework.cloud.stream.binder.BinderException: Exception thrown while starting consumer: 
	at org.springframework.cloud.stream.binder.AbstractMessageChannelBinder.doBindConsumer(AbstractMessageChannelBinder.java:224)
	at org.springframework.cloud.stream.binder.AbstractMessageChannelBinder.doBindConsumer(AbstractMessageChannelBinder.java:53)
	at org.springframework.cloud.stream.binder.AbstractBinder.bindConsumer(AbstractBinder.java:141)
	at org.springframework.cloud.stream.binder.AbstractTestBinder.bindConsumer(AbstractTestBinder.java:50)
	at org.springframework.cloud.stream.binder.AbstractTestBinder.bindConsumer(AbstractTestBinder.java:31)
	at org.springframework.cloud.stream.binder.kafka.KafkaBinderTests.testSendAndReceiveMultipleTopics(KafkaBinderTests.java:610)
	at sun.reflect.NativeMethodAccessorImpl.invoke0(Native Method)
(38 more lines...)
Collapse Failed Kafka09BinderTests testCompression History
Build Kafka Binder < 1 sec
org.springframework.cloud.stream.binder.BinderException: Exception thrown while starting consumer: 
	at org.springframework.cloud.stream.binder.AbstractMessageChannelBinder.doBindConsumer(AbstractMessageChannelBinder.java:224)
	at org.springframework.cloud.stream.binder.AbstractMessageChannelBinder.doBindConsumer(AbstractMessageChannelBinder.java:53)
	at org.springframework.cloud.stream.binder.AbstractBinder.bindConsumer(AbstractBinder.java:141)
	at org.springframework.cloud.stream.binder.AbstractTestBinder.bindConsumer(AbstractTestBinder.java:50)
	at org.springframework.cloud.stream.binder.AbstractTestBinder.bindConsumer(AbstractTestBinder.java:31)
	at org.springframework.cloud.stream.binder.kafka.KafkaBinderTests.testCompression(KafkaBinderTests.java:294)
	at sun.reflect.NativeMethodAccessorImpl.invoke0(Native Method)
(38 more lines...)
Collapse Failed Kafka09BinderTests testDefaultAutoCommitOnErrorWithDlq History
Build Kafka Binder < 1 sec
org.springframework.cloud.stream.binder.BinderException: Exception thrown while starting consumer: 
	at org.springframework.cloud.stream.binder.AbstractMessageChannelBinder.doBindConsumer(AbstractMessageChannelBinder.java:224)
	at org.springframework.cloud.stream.binder.AbstractMessageChannelBinder.doBindConsumer(AbstractMessageChannelBinder.java:53)
	at org.springframework.cloud.stream.binder.AbstractBinder.bindConsumer(AbstractBinder.java:141)
	at org.springframework.cloud.stream.binder.AbstractTestBinder.bindConsumer(AbstractTestBinder.java:50)
	at org.springframework.cloud.stream.binder.AbstractTestBinder.bindConsumer(AbstractTestBinder.java:31)
	at org.springframework.cloud.stream.binder.kafka.KafkaBinderTests.testDefaultAutoCommitOnErrorWithDlq(KafkaBinderTests.java:209)
	at sun.reflect.NativeMethodAccessorImpl.invoke0(Native Method)
(38 more lines...)
Collapse Failed Kafka09BinderTests testTwoRequiredGroups History
Build Kafka Binder < 1 sec
org.springframework.cloud.stream.binder.BinderException: Exception thrown while starting consumer: 
	at org.springframework.cloud.stream.binder.AbstractMessageChannelBinder.doBindConsumer(AbstractMessageChannelBinder.java:224)
	at org.springframework.cloud.stream.binder.AbstractMessageChannelBinder.doBindConsumer(AbstractMessageChannelBinder.java:53)
	at org.springframework.cloud.stream.binder.AbstractBinder.bindConsumer(AbstractBinder.java:141)
	at org.springframework.cloud.stream.binder.AbstractTestBinder.bindConsumer(AbstractTestBinder.java:50)
	at org.springframework.cloud.stream.binder.AbstractTestBinder.bindConsumer(AbstractTestBinder.java:31)
	at org.springframework.cloud.stream.binder.kafka.KafkaBinderTests.testTwoRequiredGroups(KafkaBinderTests.java:739)
	at sun.reflect.NativeMethodAccessorImpl.invoke0(Native Method)
(38 more lines...)
Collapse Failed Kafka09BinderTests testResume History
Build Kafka Binder < 1 sec
org.springframework.cloud.stream.binder.BinderException: Exception thrown while starting consumer: 
	at org.springframework.cloud.stream.binder.AbstractMessageChannelBinder.doBindConsumer(AbstractMessageChannelBinder.java:224)
	at org.springframework.cloud.stream.binder.AbstractMessageChannelBinder.doBindConsumer(AbstractMessageChannelBinder.java:53)
	at org.springframework.cloud.stream.binder.AbstractBinder.bindConsumer(AbstractBinder.java:141)
	at org.springframework.cloud.stream.binder.AbstractTestBinder.bindConsumer(AbstractTestBinder.java:50)
	at org.springframework.cloud.stream.binder.AbstractTestBinder.bindConsumer(AbstractTestBinder.java:31)
	at org.springframework.cloud.stream.binder.kafka.KafkaBinderTests.testResume(KafkaBinderTests.java:557)
	at sun.reflect.NativeMethodAccessorImpl.invoke0(Native Method)
(38 more lines...)
Collapse Failed Kafka09BinderTests testDlqAndRetry History
Build Kafka Binder < 1 sec
org.springframework.cloud.stream.binder.BinderException: Exception thrown while starting consumer: 
	at org.springframework.cloud.stream.binder.AbstractMessageChannelBinder.doBindConsumer(AbstractMessageChannelBinder.java:224)
	at org.springframework.cloud.stream.binder.AbstractMessageChannelBinder.doBindConsumer(AbstractMessageChannelBinder.java:53)
	at org.springframework.cloud.stream.binder.AbstractBinder.bindConsumer(AbstractBinder.java:141)
	at org.springframework.cloud.stream.binder.AbstractTestBinder.bindConsumer(AbstractTestBinder.java:50)
	at org.springframework.cloud.stream.binder.AbstractTestBinder.bindConsumer(AbstractTestBinder.java:31)
	at org.springframework.cloud.stream.binder.kafka.KafkaBinderTests.testDlqAndRetry(KafkaBinderTests.java:116)
	at sun.reflect.NativeMethodAccessorImpl.invoke0(Native Method)
(38 more lines...)
Collapse Failed RawModeKafka09BinderTests testTwoRequiredGroups History
Build Kafka Binder < 1 sec
org.springframework.cloud.stream.binder.BinderException: Exception thrown while starting consumer: 
	at org.springframework.cloud.stream.binder.AbstractMessageChannelBinder.doBindConsumer(AbstractMessageChannelBinder.java:224)
	at org.springframework.cloud.stream.binder.AbstractMessageChannelBinder.doBindConsumer(AbstractMessageChannelBinder.java:53)
	at org.springframework.cloud.stream.binder.AbstractBinder.bindConsumer(AbstractBinder.java:141)
	at org.springframework.cloud.stream.binder.AbstractTestBinder.bindConsumer(AbstractTestBinder.java:50)
	at org.springframework.cloud.stream.binder.AbstractTestBinder.bindConsumer(AbstractTestBinder.java:31)
	at org.springframework.cloud.stream.binder.kafka.KafkaBinderTests.testTwoRequiredGroups(KafkaBinderTests.java:739)
	at sun.reflect.NativeMethodAccessorImpl.invoke0(Native Method)
(38 more lines...)
Collapse Failed RawModeKafka09BinderTests testSendAndReceiveWithExplicitConsumerGroup History
Build Kafka Binder < 1 sec
org.springframework.cloud.stream.binder.BinderException: Exception thrown while starting consumer: 
	at org.springframework.cloud.stream.binder.AbstractMessageChannelBinder.doBindConsumer(AbstractMessageChannelBinder.java:224)
	at org.springframework.cloud.stream.binder.AbstractMessageChannelBinder.doBindConsumer(AbstractMessageChannelBinder.java:53)
	at org.springframework.cloud.stream.binder.AbstractBinder.bindConsumer(AbstractBinder.java:141)
	at org.springframework.cloud.stream.binder.AbstractTestBinder.bindConsumer(AbstractTestBinder.java:50)
	at org.springframework.cloud.stream.binder.kafka.RawModeKafka09BinderTests.testSendAndReceiveWithExplicitConsumerGroup(RawModeKafka09BinderTests.java:200)
	at sun.reflect.NativeMethodAccessorImpl.invoke0(Native Method)
	at sun.reflect.NativeMethodAccessorImpl.invoke(NativeMethodAccessorImpl.java:62)
(37 more lines...)
Collapse Failed RawModeKafka09BinderTests testDefaultAutoCommitOnErrorWithDlq History
Build Kafka Binder < 1 sec
org.springframework.cloud.stream.binder.BinderException: Exception thrown while starting consumer: 
	at org.springframework.cloud.stream.binder.AbstractMessageChannelBinder.doBindConsumer(AbstractMessageChannelBinder.java:224)
	at org.springframework.cloud.stream.binder.AbstractMessageChannelBinder.doBindConsumer(AbstractMessageChannelBinder.java:53)
	at org.springframework.cloud.stream.binder.AbstractBinder.bindConsumer(AbstractBinder.java:141)
	at org.springframework.cloud.stream.binder.AbstractTestBinder.bindConsumer(AbstractTestBinder.java:50)
	at org.springframework.cloud.stream.binder.AbstractTestBinder.bindConsumer(AbstractTestBinder.java:31)
	at org.springframework.cloud.stream.binder.kafka.KafkaBinderTests.testDefaultAutoCommitOnErrorWithDlq(KafkaBinderTests.java:209)
	at sun.reflect.NativeMethodAccessorImpl.invoke0(Native Method)
(38 more lines...)
Collapse Failed RawModeKafka09BinderTests testDlqAndRetry History
Build Kafka Binder < 1 sec
org.springframework.cloud.stream.binder.BinderException: Exception thrown while starting consumer: 
	at org.springframework.cloud.stream.binder.AbstractMessageChannelBinder.doBindConsumer(AbstractMessageChannelBinder.java:224)
	at org.springframework.cloud.stream.binder.AbstractMessageChannelBinder.doBindConsumer(AbstractMessageChannelBinder.java:53)
	at org.springframework.cloud.stream.binder.AbstractBinder.bindConsumer(AbstractBinder.java:141)
	at org.springframework.cloud.stream.binder.AbstractTestBinder.bindConsumer(AbstractTestBinder.java:50)
	at org.springframework.cloud.stream.binder.AbstractTestBinder.bindConsumer(AbstractTestBinder.java:31)
	at org.springframework.cloud.stream.binder.kafka.KafkaBinderTests.testDlqAndRetry(KafkaBinderTests.java:116)
	at sun.reflect.NativeMethodAccessorImpl.invoke0(Native Method)
(38 more lines...)
Collapse Failed RawModeKafka09BinderTests testAutoCreateTopicsDisabledOnBinderStillWorksAsLongAsBrokerCreatesTopic History
Build Kafka Binder 10 secs
java.lang.AssertionError:  Expecting actual not to be null
java.lang.AssertionError: 
Expecting actual not to be null
	at org.springframework.cloud.stream.binder.kafka.KafkaBinderTests.testAutoCreateTopicsDisabledOnBinderStillWorksAsLongAsBrokerCreatesTopic(KafkaBinderTests.java:1009)
	at sun.reflect.NativeMethodAccessorImpl.invoke0(Native Method)
	at sun.reflect.NativeMethodAccessorImpl.invoke(NativeMethodAccessorImpl.java:62)
	at sun.reflect.DelegatingMethodAccessorImpl.invoke(DelegatingMethodAccessorImpl.java:43)
	at java.lang.reflect.Method.invoke(Method.java:497)
(29 more lines...)
Collapse Failed RawModeKafka09BinderTests testResume History
Build Kafka Binder < 1 sec
org.springframework.cloud.stream.binder.BinderException: Exception thrown while starting consumer: 
	at org.springframework.cloud.stream.binder.AbstractMessageChannelBinder.doBindConsumer(AbstractMessageChannelBinder.java:224)
	at org.springframework.cloud.stream.binder.AbstractMessageChannelBinder.doBindConsumer(AbstractMessageChannelBinder.java:53)
	at org.springframework.cloud.stream.binder.AbstractBinder.bindConsumer(AbstractBinder.java:141)
	at org.springframework.cloud.stream.binder.AbstractTestBinder.bindConsumer(AbstractTestBinder.java:50)
	at org.springframework.cloud.stream.binder.AbstractTestBinder.bindConsumer(AbstractTestBinder.java:31)
	at org.springframework.cloud.stream.binder.kafka.KafkaBinderTests.testResume(KafkaBinderTests.java:557)
	at sun.reflect.NativeMethodAccessorImpl.invoke0(Native Method)
(38 more lines...)
Collapse Failed RawModeKafka09BinderTests testEarliest History
Build Kafka Binder < 1 sec
org.springframework.cloud.stream.binder.BinderException: Exception thrown while starting consumer: 
	at org.springframework.cloud.stream.binder.AbstractMessageChannelBinder.doBindConsumer(AbstractMessageChannelBinder.java:224)
	at org.springframework.cloud.stream.binder.AbstractMessageChannelBinder.doBindConsumer(AbstractMessageChannelBinder.java:53)
	at org.springframework.cloud.stream.binder.AbstractBinder.bindConsumer(AbstractBinder.java:141)
	at org.springframework.cloud.stream.binder.AbstractTestBinder.bindConsumer(AbstractTestBinder.java:50)
	at org.springframework.cloud.stream.binder.AbstractTestBinder.bindConsumer(AbstractTestBinder.java:31)
	at org.springframework.cloud.stream.binder.kafka.KafkaBinderTests.testEarliest(KafkaBinderTests.java:467)
	at sun.reflect.NativeMethodAccessorImpl.invoke0(Native Method)
(38 more lines...)
Collapse Failed RawModeKafka09BinderTests testDefaultAutoCommitOnErrorWithoutDlq History
Build Kafka Binder < 1 sec
org.springframework.cloud.stream.binder.BinderException: Exception thrown while starting consumer: 
	at org.springframework.cloud.stream.binder.AbstractMessageChannelBinder.doBindConsumer(AbstractMessageChannelBinder.java:224)
	at org.springframework.cloud.stream.binder.AbstractMessageChannelBinder.doBindConsumer(AbstractMessageChannelBinder.java:53)
	at org.springframework.cloud.stream.binder.AbstractBinder.bindConsumer(AbstractBinder.java:141)
	at org.springframework.cloud.stream.binder.AbstractTestBinder.bindConsumer(AbstractTestBinder.java:50)
	at org.springframework.cloud.stream.binder.AbstractTestBinder.bindConsumer(AbstractTestBinder.java:31)
	at org.springframework.cloud.stream.binder.kafka.KafkaBinderTests.testDefaultAutoCommitOnErrorWithoutDlq(KafkaBinderTests.java:157)
	at sun.reflect.NativeMethodAccessorImpl.invoke0(Native Method)
(38 more lines...)
Collapse Failed RawModeKafka09BinderTests testSendAndReceiveMultipleTopics History
Build Kafka Binder < 1 sec
org.springframework.cloud.stream.binder.BinderException: Exception thrown while starting consumer: 
	at org.springframework.cloud.stream.binder.AbstractMessageChannelBinder.doBindConsumer(AbstractMessageChannelBinder.java:224)
	at org.springframework.cloud.stream.binder.AbstractMessageChannelBinder.doBindConsumer(AbstractMessageChannelBinder.java:53)
	at org.springframework.cloud.stream.binder.AbstractBinder.bindConsumer(AbstractBinder.java:141)
	at org.springframework.cloud.stream.binder.AbstractTestBinder.bindConsumer(AbstractTestBinder.java:50)
	at org.springframework.cloud.stream.binder.AbstractTestBinder.bindConsumer(AbstractTestBinder.java:31)
	at org.springframework.cloud.stream.binder.kafka.KafkaBinderTests.testSendAndReceiveMultipleTopics(KafkaBinderTests.java:610)
	at sun.reflect.NativeMethodAccessorImpl.invoke0(Native Method)
(38 more lines...)
Collapse Failed RawModeKafka09BinderTests testDefaultConsumerStartsAtEarliest History
Build Kafka Binder < 1 sec
org.springframework.cloud.stream.binder.BinderException: Exception thrown while starting consumer: 
	at org.springframework.cloud.stream.binder.AbstractMessageChannelBinder.doBindConsumer(AbstractMessageChannelBinder.java:224)
	at org.springframework.cloud.stream.binder.AbstractMessageChannelBinder.doBindConsumer(AbstractMessageChannelBinder.java:53)
	at org.springframework.cloud.stream.binder.AbstractBinder.bindConsumer(AbstractBinder.java:141)
	at org.springframework.cloud.stream.binder.AbstractTestBinder.bindConsumer(AbstractTestBinder.java:50)
	at org.springframework.cloud.stream.binder.AbstractTestBinder.bindConsumer(AbstractTestBinder.java:31)
	at org.springframework.cloud.stream.binder.kafka.KafkaBinderTests.testDefaultConsumerStartsAtEarliest(KafkaBinderTests.java:434)
	at sun.reflect.NativeMethodAccessorImpl.invoke0(Native Method)
(38 more lines...)
Collapse Failed RawModeKafka09BinderTests testCompression History
Build Kafka Binder < 1 sec
org.springframework.cloud.stream.binder.BinderException: Exception thrown while starting consumer: 
	at org.springframework.cloud.stream.binder.AbstractMessageChannelBinder.doBindConsumer(AbstractMessageChannelBinder.java:224)
	at org.springframework.cloud.stream.binder.AbstractMessageChannelBinder.doBindConsumer(AbstractMessageChannelBinder.java:53)
	at org.springframework.cloud.stream.binder.AbstractBinder.bindConsumer(AbstractBinder.java:141)
	at org.springframework.cloud.stream.binder.AbstractTestBinder.bindConsumer(AbstractTestBinder.java:50)
	at org.springframework.cloud.stream.binder.AbstractTestBinder.bindConsumer(AbstractTestBinder.java:31)
	at org.springframework.cloud.stream.binder.kafka.KafkaBinderTests.testCompression(KafkaBinderTests.java:294)
	at sun.reflect.NativeMethodAccessorImpl.invoke0(Native Method)
(38 more lines...)
Skipped tests 2
Status Test Failing since View job
Skipped Kafka09BinderTests testReset History
Build Kafka Binder
Skipped RawModeKafka09BinderTests testReset History
Build Kafka Binder