Spring Cloud Stream Modules

Build: #63 failed Changes by David Turanski <dturanski@pivotal.io>

Build result summary

Details

Completed
Duration
8 minutes
Labels
None
Agent
(elastic) Elastic Agent on i-79df70db
Revision
b12eaba454a202a91668ee4dd4f7518bebed3616 b12eaba454a202a91668ee4dd4f7518bebed3616
Total tests
47
Fixed in
#67 (Manual run by Mark Pollack)

Tests

Responsible

No one has taken responsibility for this failure

Code commits

Author Commit Message Commit date
David Turanski <dturanski@pivotal.io> David Turanski <dturanski@pivotal.io> b12eaba454a202a91668ee4dd4f7518bebed3616 b12eaba454a202a91668ee4dd4f7518bebed3616 XD-3376 Gemfire Sink

Tests

New test failures 1
Status Test View job Duration
Collapse Failed GemfireSinkIntegrationTests test History
Build SCS Modules < 1 sec
org.springframework.messaging.MessageHandlingException: error occurred in message handler [org.springframework.integration.gemfire.outbound.CacheWritingMessageHandler@6df4af5]; nested exception is org.springframework.dao.DataAccessResourceFailureException: Unable to connect to any locators in the list [localhost/127.0.0.1:10334]; nested exception is com.gemstone.gemfire.cache.client.NoAvailableLocatorsException: Unable to connect to any locators in the list [localhost/127.0.0.1:10334]
	at com.gemstone.gemfire.cache.client.internal.AutoConnectionSourceImpl.findServer(AutoConnectionSourceImpl.java:131)
	at com.gemstone.gemfire.cache.client.internal.ConnectionFactoryImpl.createClientToServerConnection(ConnectionFactoryImpl.java:205)
	at com.gemstone.gemfire.cache.client.internal.pooling.ConnectionManagerImpl.borrowConnection(ConnectionManagerImpl.java:211)
	at com.gemstone.gemfire.cache.client.internal.OpExecutorImpl.execute(OpExecutorImpl.java:136)
	at com.gemstone.gemfire.cache.client.internal.OpExecutorImpl.execute(OpExecutorImpl.java:115)
	at com.gemstone.gemfire.cache.client.internal.PoolImpl.execute(PoolImpl.java:696)
	at com.gemstone.gemfire.cache.client.internal.PutAllOp.execute(PutAllOp.java:103)
(21 more lines...)

Jira issues

IssueDescriptionStatus
Unknown Issue TypeXD-3376Could not obtain issue details from Jira