Spring Cloud Stream Modules

Build: #63 failed Changes by David Turanski <dturanski@pivotal.io>

Test results

  • 47 tests in total
  • 1 test failed
  • 1 failure is new
  • 1 test was quarantined / skipped
  • 12 seconds taken in total.
New test failures 1
Status Test View job Duration
Collapse Failed GemfireSinkIntegrationTests test History
Build SCS Modules < 1 sec
org.springframework.messaging.MessageHandlingException: error occurred in message handler [org.springframework.integration.gemfire.outbound.CacheWritingMessageHandler@6df4af5]; nested exception is org.springframework.dao.DataAccessResourceFailureException: Unable to connect to any locators in the list [localhost/127.0.0.1:10334]; nested exception is com.gemstone.gemfire.cache.client.NoAvailableLocatorsException: Unable to connect to any locators in the list [localhost/127.0.0.1:10334]
	at com.gemstone.gemfire.cache.client.internal.AutoConnectionSourceImpl.findServer(AutoConnectionSourceImpl.java:131)
	at com.gemstone.gemfire.cache.client.internal.ConnectionFactoryImpl.createClientToServerConnection(ConnectionFactoryImpl.java:205)
	at com.gemstone.gemfire.cache.client.internal.pooling.ConnectionManagerImpl.borrowConnection(ConnectionManagerImpl.java:211)
	at com.gemstone.gemfire.cache.client.internal.OpExecutorImpl.execute(OpExecutorImpl.java:136)
	at com.gemstone.gemfire.cache.client.internal.OpExecutorImpl.execute(OpExecutorImpl.java:115)
	at com.gemstone.gemfire.cache.client.internal.PoolImpl.execute(PoolImpl.java:696)
	at com.gemstone.gemfire.cache.client.internal.PutAllOp.execute(PutAllOp.java:103)
(21 more lines...)
Skipped tests 1
Status Test Failing since View job
Skipped FtpSourceIntegrationTests sourceFilesAsRef History
Build SCS Modules