Spring Cloud Stream Master Build

Test results

  • 149 tests in total
  • 1 test failed
  • 1 failure is new
  • 5 tests were quarantined / skipped
  • 1 minute taken in total.
New test failures 1
Status Test View job Duration
Collapse Failed AetherModuleResolverTests testResolveMockRemote History
Build SCS < 1 sec
com.github.tomakehurst.wiremock.common.FatalStartupException: java.lang.RuntimeException: java.net.BindException: Address already in use
	at com.github.tomakehurst.wiremock.WireMockServer.start(WireMockServer.java:192)
	at com.github.tomakehurst.wiremock.junit.WireMockRule$1.evaluate(WireMockRule.java:58)
	at org.junit.rules.RunRules.evaluate(RunRules.java:20)
	at org.junit.runners.ParentRunner.runLeaf(ParentRunner.java:325)
	at org.junit.runners.BlockJUnit4ClassRunner.runChild(BlockJUnit4ClassRunner.java:78)
	at org.junit.runners.BlockJUnit4ClassRunner.runChild(BlockJUnit4ClassRunner.java:57)
	at org.junit.runners.ParentRunner$3.run(ParentRunner.java:290)
(62 more lines...)
Skipped tests 5
Status Test Failing since View job
Skipped ModuleAggregationTest org.springframework.cloud.stream.aggregation.ModuleAggregationTest History
Build SCS
Skipped KafkaBinderTests testDirectBinding History
Build SCS
Skipped RawModeKafkaBinderTests org.springframework.cloud.stream.binder.kafka.RawModeKafkaBinderTests History
Build SCS
Skipped RedisBinderTests testSendAndReceivePubSub History
Build SCS
Skipped AetherModuleResolverTests testResolveRemote History
Build SCS