Spring Cloud Stream Master Build

Build: #228 failed

Job: Build SCS failed

Stages & jobs

  1. Default Stage

Job result summary

Completed
Duration
4 minutes
Agent
(elastic) Elastic Agent on i-a427381a
Revision
ac395f84e52856f72b5fbeece4db7f1918e37027 ac395f84e52856f72b5fbeece4db7f1918e37027
Total tests
149
Fixed in
#229 (Manual run by Mark Pollack)

Tests

  • 149 tests in total
  • 1 test failed
  • 1 failure is new
  • 5 tests were quarantined / skipped
  • 1 minute taken in total.
New test failures 1
Status Test Duration
Collapse Failed AetherModuleResolverTests testResolveMockRemote History
< 1 sec
com.github.tomakehurst.wiremock.common.FatalStartupException: java.lang.RuntimeException: java.net.BindException: Address already in use
	at com.github.tomakehurst.wiremock.WireMockServer.start(WireMockServer.java:192)
	at com.github.tomakehurst.wiremock.junit.WireMockRule$1.evaluate(WireMockRule.java:58)
	at org.junit.rules.RunRules.evaluate(RunRules.java:20)
	at org.junit.runners.ParentRunner.runLeaf(ParentRunner.java:325)
	at org.junit.runners.BlockJUnit4ClassRunner.runChild(BlockJUnit4ClassRunner.java:78)
	at org.junit.runners.BlockJUnit4ClassRunner.runChild(BlockJUnit4ClassRunner.java:57)
	at org.junit.runners.ParentRunner$3.run(ParentRunner.java:290)
(62 more lines...)