Build Spring Cloud Skipper 1.1.x

Build: #32 failed Child of SCD-SCDDK8S11013X-9

Stages & jobs

  1. Default Stage

  2. Build Skipper Docker Image and upload

Logs

The following logs have been generated by the jobs in this plan.
  • Expand all
  • Collapse all
Job Logs
Collapse Build and install Skipper Default Stage Download or View
18-Mar-2019 08:32:59 [INFO] Spring Cloud Skipper :: Shell ...................... SKIPPED
18-Mar-2019 08:32:59 [INFO] Spring Cloud Skipper :: Docs ....................... SKIPPED
18-Mar-2019 08:32:59 [INFO] Spring Cloud Skipper :: Dependencies ............... SKIPPED
18-Mar-2019 08:32:59 [INFO] Spring Cloud Starter :: Skipper Server ............. SKIPPED
18-Mar-2019 08:32:59 [INFO] ------------------------------------------------------------------------
18-Mar-2019 08:32:59 [INFO] BUILD FAILURE
18-Mar-2019 08:32:59 [INFO] ------------------------------------------------------------------------
18-Mar-2019 08:32:59 [INFO] Total time: 06:02 min
18-Mar-2019 08:32:59 [INFO] Finished at: 2019-03-18T08:32:59Z
18-Mar-2019 08:32:59 [INFO] Final Memory: 86M/640M
18-Mar-2019 08:32:59 [INFO] ------------------------------------------------------------------------
18-Mar-2019 08:32:59 [ERROR] Failed to execute goal org.apache.maven.plugins:maven-surefire-plugin:2.20:test (default-test) on project spring-cloud-skipper-server-core: There are test failures.
18-Mar-2019 08:32:59 [ERROR]
18-Mar-2019 08:32:59 [ERROR] Please refer to /opt/bamboo-home/xml-data/build-dir/SCSKIP-B11X-JOB1/spring-cloud-skipper-server-core/target/surefire-reports for the individual test results.
18-Mar-2019 08:32:59 [ERROR] Please refer to dump files (if any exist) [date]-jvmRun[N].dump, [date].dumpstream and [date]-jvmRun[N].dumpstream.
18-Mar-2019 08:32:59 [ERROR] -> [Help 1]
18-Mar-2019 08:32:59 [ERROR]
18-Mar-2019 08:32:59 [ERROR] To see the full stack trace of the errors, re-run Maven with the -e switch.
18-Mar-2019 08:32:59 [ERROR] Re-run Maven using the -X switch to enable full debug logging.
18-Mar-2019 08:32:59 [ERROR]
18-Mar-2019 08:32:59 [ERROR] For more information about the errors and possible solutions, please read the following articles:
18-Mar-2019 08:32:59 [ERROR] [Help 1] http://cwiki.apache.org/confluence/display/MAVEN/MojoFailureException
18-Mar-2019 08:32:59 [ERROR]
18-Mar-2019 08:32:59 [ERROR] After correcting the problems, you can resume the build with the command
18-Mar-2019 08:32:59 [ERROR]   mvn <goals> -rf :spring-cloud-skipper-server-core