Build Spring Cloud Skipper Server - latest tag

Build: #1067 failed Changes by Janne Valkealahti

Stages & jobs

  1. Default Stage

  2. Build Skipper Docker Image and upload

Test results

  • 164 tests in total
  • 1 test failed
  • 1 failure is new
  • 1 test was quarantined / skipped
  • 8 minutes taken in total.
New test failures 1
Status Test View job Duration
Collapse Failed ReleaseServiceTests testFailedUpdate History
Build and install Skipper 17 secs
org.springframework.cloud.skipper.SkipperException: Could not install AppDeployRequest [[[email protected] commandlineArguments = list[[empty]], deploymentProperties = map['spring.cloud.deployer.appName' -> 'log', 'spring.cloud.deployer.group' -> 'logrelease'], definition = [[email protected] name = 'log-v1', properties = map['server.port' -> '8081']], resource = org.springframework.cloud.stream.app:log-sink-rabbit:jar:1.2.0.RC1]]  to platform [default].  Error Message = [Failed to resolve MavenResource: org.springframework.cloud.stream.app:log-sink-rabbit:jar:1.2.0.RC1. Configured remote repository: : [springRepo]]
Caused by: java.lang.IllegalStateException: Failed to resolve MavenResource: org.springframework.cloud.stream.app:log-sink-rabbit:jar:1.2.0.RC1. Configured remote repository: : [springRepo]
Caused by: org.eclipse.aether.resolution.ArtifactResolutionException: Could not transfer artifact org.springframework.cloud.stream.app:log-sink-rabbit:jar:1.2.0.RC1 from/to springRepo (https://repo.spring.io/libs-snapshot): Premature end of Content-Length delimited message body (expected: 26,521,162; received: 2,417,097)
Caused by: org.eclipse.aether.transfer.ArtifactTransferException: Could not transfer artifact org.springframework.cloud.stream.app:log-sink-rabbit:jar:1.2.0.RC1 from/to springRepo (https://repo.spring.io/libs-snapshot): Premature end of Content-Length delimited message body (expected: 26,521,162; received: 2,417,097)
Caused by: org.apache.http.ConnectionClosedException: Premature end of Content-Length delimited message body (expected: 26,521,162; received: 2,417,097)
Skipped tests 1
Status Test Failing since View job
Skipped StateMachineTests testUpgradeCancelWhileCheckingApps History
Build and install Skipper