Build Spring Cloud Skipper Server - latest tag

Build: #578 failed Changes by Mark Pollack

Stages & jobs

  1. Default Stage

  2. Build Skipper Docker Image and upload

Build result summary

Details

Completed
Duration
1 minute
Labels
None
Revision
b93bd62ebea9dcbad2344ebec8b7c9abfdb9e933 b93bd62ebea9dcbad2344ebec8b7c9abfdb9e933
Total tests
148
Fixed in
#580 (Manual run by Mark Pollack)

Tests

Responsible

Code commits

Author Commit Message Commit date
Mark Pollack Mark Pollack b93bd62ebea9dcbad2344ebec8b7c9abfdb9e933 b93bd62ebea9dcbad2344ebec8b7c9abfdb9e933 Update java-cfenv-boot.version to 1.0.0.BUILD-SNAPSHOT

Tests

New test failures 84
Status Test View job Duration
Collapse Failed PlatformPropertiesTests deserializationTest History
Build and install Skipper < 1 sec
java.lang.IllegalStateException: Failed to load ApplicationContext
Caused by: java.lang.IllegalArgumentException: Unable to instantiate factory class: io.pivotal.cfenv.spring.boot.CfEnvProcessor
Caused by: java.lang.ClassNotFoundException: io.pivotal.cfenv.sso.CfSingleSignOnProcessor
Collapse Failed SkipperServerPlatformConfigurationTests$AllPlatformsConfigurationTest allPlatformsConfiguredTest History
Build and install Skipper < 1 sec
java.lang.IllegalStateException: Failed to load ApplicationContext
Caused by: java.lang.IllegalArgumentException: Unable to instantiate factory class: io.pivotal.cfenv.spring.boot.CfEnvProcessor
Caused by: java.lang.ClassNotFoundException: io.pivotal.cfenv.sso.CfSingleSignOnProcessor
Collapse Failed SkipperServerPlatformConfigurationTests$ExternalPlatformsOnlyConfigurationTest localPlatformDisabledTest History
Build and install Skipper < 1 sec
java.lang.IllegalStateException: Failed to load ApplicationContext
Caused by: java.lang.IllegalArgumentException: Unable to instantiate factory class: io.pivotal.cfenv.spring.boot.CfEnvProcessor
Caused by: java.lang.ClassNotFoundException: io.pivotal.cfenv.sso.CfSingleSignOnProcessor
Collapse Failed SkipperServerPlatformConfigurationTests$SinglePlatformConfigurationTest singlePlatformsConfiguredTest History
Build and install Skipper < 1 sec
java.lang.IllegalStateException: Failed to load ApplicationContext
Caused by: java.lang.IllegalArgumentException: Unable to instantiate factory class: io.pivotal.cfenv.spring.boot.CfEnvProcessor
Caused by: java.lang.ClassNotFoundException: io.pivotal.cfenv.sso.CfSingleSignOnProcessor
Collapse Failed ReleaseControllerTests deployTickTock History
Build and install Skipper < 1 sec
java.lang.IllegalStateException: Failed to load ApplicationContext
Caused by: java.lang.IllegalArgumentException: Unable to instantiate factory class: io.pivotal.cfenv.spring.boot.CfEnvProcessor
Caused by: java.lang.ClassNotFoundException: io.pivotal.cfenv.sso.CfSingleSignOnProcessor
Collapse Failed ReleaseControllerTests releaseRollbackAndUndeploy History
Build and install Skipper < 1 sec
java.lang.IllegalStateException: Failed to load ApplicationContext
Caused by: java.lang.IllegalArgumentException: Unable to instantiate factory class: io.pivotal.cfenv.spring.boot.CfEnvProcessor
Caused by: java.lang.ClassNotFoundException: io.pivotal.cfenv.sso.CfSingleSignOnProcessor
Collapse Failed ReleaseControllerTests testMutableAttributesAppInstanceStatus History
Build and install Skipper < 1 sec
java.lang.IllegalStateException: Failed to load ApplicationContext
Caused by: java.lang.IllegalArgumentException: Unable to instantiate factory class: io.pivotal.cfenv.spring.boot.CfEnvProcessor
Caused by: java.lang.ClassNotFoundException: io.pivotal.cfenv.sso.CfSingleSignOnProcessor
Collapse Failed ReleaseControllerTests testStatusReportsErrorForMissingRelease History
Build and install Skipper < 1 sec
java.lang.IllegalStateException: Failed to load ApplicationContext
Caused by: java.lang.IllegalArgumentException: Unable to instantiate factory class: io.pivotal.cfenv.spring.boot.CfEnvProcessor
Caused by: java.lang.ClassNotFoundException: io.pivotal.cfenv.sso.CfSingleSignOnProcessor
Collapse Failed ReleaseControllerTests checkDeployStatus History
Build and install Skipper < 1 sec
java.lang.IllegalStateException: Failed to load ApplicationContext
Caused by: java.lang.IllegalArgumentException: Unable to instantiate factory class: io.pivotal.cfenv.spring.boot.CfEnvProcessor
Caused by: java.lang.ClassNotFoundException: io.pivotal.cfenv.sso.CfSingleSignOnProcessor
Collapse Failed ReleaseControllerTests packageDeployAndUpgrade History
Build and install Skipper < 1 sec
java.lang.IllegalStateException: Failed to load ApplicationContext
Caused by: java.lang.IllegalArgumentException: Unable to instantiate factory class: io.pivotal.cfenv.spring.boot.CfEnvProcessor
Caused by: java.lang.ClassNotFoundException: io.pivotal.cfenv.sso.CfSingleSignOnProcessor
Collapse Failed ReleaseControllerTests cancelNonExistingRelease History
Build and install Skipper < 1 sec
java.lang.IllegalStateException: Failed to load ApplicationContext
Caused by: java.lang.IllegalArgumentException: Unable to instantiate factory class: io.pivotal.cfenv.spring.boot.CfEnvProcessor
Caused by: java.lang.ClassNotFoundException: io.pivotal.cfenv.sso.CfSingleSignOnProcessor
Collapse Failed ReleaseControllerTests checkDeleteReleaseWithPackage History
Build and install Skipper < 1 sec
java.lang.IllegalStateException: Failed to load ApplicationContext
Caused by: java.lang.IllegalArgumentException: Unable to instantiate factory class: io.pivotal.cfenv.spring.boot.CfEnvProcessor
Caused by: java.lang.ClassNotFoundException: io.pivotal.cfenv.sso.CfSingleSignOnProcessor
Collapse Failed ReleaseControllerTests packageDeployRequest History
Build and install Skipper < 1 sec
java.lang.IllegalStateException: Failed to load ApplicationContext
Caused by: java.lang.IllegalArgumentException: Unable to instantiate factory class: io.pivotal.cfenv.spring.boot.CfEnvProcessor
Caused by: java.lang.ClassNotFoundException: io.pivotal.cfenv.sso.CfSingleSignOnProcessor
Collapse Failed ReleaseControllerTests packageDeployAndUpgradeAndCancel History
Build and install Skipper < 1 sec
java.lang.IllegalStateException: Failed to load ApplicationContext
Caused by: java.lang.IllegalArgumentException: Unable to instantiate factory class: io.pivotal.cfenv.spring.boot.CfEnvProcessor
Caused by: java.lang.ClassNotFoundException: io.pivotal.cfenv.sso.CfSingleSignOnProcessor
Collapse Failed RootControllerTests indexUrlShouldRedirect History
Build and install Skipper < 1 sec
java.lang.IllegalStateException: Failed to load ApplicationContext
Caused by: java.lang.IllegalArgumentException: Unable to instantiate factory class: io.pivotal.cfenv.spring.boot.CfEnvProcessor
Caused by: java.lang.ClassNotFoundException: io.pivotal.cfenv.sso.CfSingleSignOnProcessor
Collapse Failed AboutDocumentation getMetaInformation History
Build and install Skipper < 1 sec
java.lang.IllegalStateException: Failed to load ApplicationContext
Caused by: java.lang.IllegalArgumentException: Unable to instantiate factory class: io.pivotal.cfenv.spring.boot.CfEnvProcessor
Caused by: java.lang.ClassNotFoundException: io.pivotal.cfenv.sso.CfSingleSignOnProcessor
Collapse Failed ApiDocumentation headers History
Build and install Skipper < 1 sec
java.lang.IllegalStateException: Failed to load ApplicationContext
Caused by: java.lang.IllegalArgumentException: Unable to instantiate factory class: io.pivotal.cfenv.spring.boot.CfEnvProcessor
Caused by: java.lang.ClassNotFoundException: io.pivotal.cfenv.sso.CfSingleSignOnProcessor
Collapse Failed ApiDocumentation index History
Build and install Skipper < 1 sec
java.lang.IllegalStateException: Failed to load ApplicationContext
Caused by: java.lang.IllegalArgumentException: Unable to instantiate factory class: io.pivotal.cfenv.spring.boot.CfEnvProcessor
Caused by: java.lang.ClassNotFoundException: io.pivotal.cfenv.sso.CfSingleSignOnProcessor
Collapse Failed ApiDocumentation errors History
Build and install Skipper < 1 sec
java.lang.IllegalStateException: Failed to load ApplicationContext
Caused by: java.lang.IllegalArgumentException: Unable to instantiate factory class: io.pivotal.cfenv.spring.boot.CfEnvProcessor
Caused by: java.lang.ClassNotFoundException: io.pivotal.cfenv.sso.CfSingleSignOnProcessor
Collapse Failed CancelDocumentation cancelRelease History
Build and install Skipper < 1 sec
java.lang.IllegalStateException: Failed to load ApplicationContext
Caused by: java.lang.IllegalArgumentException: Unable to instantiate factory class: io.pivotal.cfenv.spring.boot.CfEnvProcessor
Caused by: java.lang.ClassNotFoundException: io.pivotal.cfenv.sso.CfSingleSignOnProcessor
Collapse Failed DeleteDocumentation deleteReleaseDefault History
Build and install Skipper < 1 sec
java.lang.IllegalStateException: Failed to load ApplicationContext
Caused by: java.lang.IllegalArgumentException: Unable to instantiate factory class: io.pivotal.cfenv.spring.boot.CfEnvProcessor
Caused by: java.lang.ClassNotFoundException: io.pivotal.cfenv.sso.CfSingleSignOnProcessor
Collapse Failed DeleteDocumentation deleteRelease History
Build and install Skipper < 1 sec
java.lang.IllegalStateException: Failed to load ApplicationContext
Caused by: java.lang.IllegalArgumentException: Unable to instantiate factory class: io.pivotal.cfenv.spring.boot.CfEnvProcessor
Caused by: java.lang.ClassNotFoundException: io.pivotal.cfenv.sso.CfSingleSignOnProcessor
Collapse Failed DeployersDocumentation getAllDeployers History
Build and install Skipper < 1 sec
java.lang.IllegalStateException: Failed to load ApplicationContext
Caused by: java.lang.IllegalArgumentException: Unable to instantiate factory class: io.pivotal.cfenv.spring.boot.CfEnvProcessor
Caused by: java.lang.ClassNotFoundException: io.pivotal.cfenv.sso.CfSingleSignOnProcessor
Collapse Failed HistoryDocumentation showVersionHistoryForRelease History
Build and install Skipper < 1 sec
java.lang.IllegalStateException: Failed to load ApplicationContext
Caused by: java.lang.IllegalArgumentException: Unable to instantiate factory class: io.pivotal.cfenv.spring.boot.CfEnvProcessor
Caused by: java.lang.ClassNotFoundException: io.pivotal.cfenv.sso.CfSingleSignOnProcessor
Collapse Failed InstallDocumentation installPackage History
Build and install Skipper < 1 sec
java.lang.IllegalStateException: Failed to load ApplicationContext
Caused by: java.lang.IllegalArgumentException: Unable to instantiate factory class: io.pivotal.cfenv.spring.boot.CfEnvProcessor
Caused by: java.lang.ClassNotFoundException: io.pivotal.cfenv.sso.CfSingleSignOnProcessor
Collapse Failed InstallDocumentation installPackageWithId History
Build and install Skipper < 1 sec
java.lang.IllegalStateException: Failed to load ApplicationContext
Caused by: java.lang.IllegalArgumentException: Unable to instantiate factory class: io.pivotal.cfenv.spring.boot.CfEnvProcessor
Caused by: java.lang.ClassNotFoundException: io.pivotal.cfenv.sso.CfSingleSignOnProcessor
Collapse Failed ListDocumentation listRelease History
Build and install Skipper < 1 sec
java.lang.IllegalStateException: Failed to load ApplicationContext
Caused by: java.lang.IllegalArgumentException: Unable to instantiate factory class: io.pivotal.cfenv.spring.boot.CfEnvProcessor
Caused by: java.lang.ClassNotFoundException: io.pivotal.cfenv.sso.CfSingleSignOnProcessor
Collapse Failed ListDocumentation listReleasesByReleaseName History
Build and install Skipper < 1 sec
java.lang.IllegalStateException: Failed to load ApplicationContext
Caused by: java.lang.IllegalArgumentException: Unable to instantiate factory class: io.pivotal.cfenv.spring.boot.CfEnvProcessor
Caused by: java.lang.ClassNotFoundException: io.pivotal.cfenv.sso.CfSingleSignOnProcessor
Collapse Failed ManifestDocumentation getManifestOfReleaseForVersion History
Build and install Skipper < 1 sec
java.lang.IllegalStateException: Failed to load ApplicationContext
Caused by: java.lang.IllegalArgumentException: Unable to instantiate factory class: io.pivotal.cfenv.spring.boot.CfEnvProcessor
Caused by: java.lang.ClassNotFoundException: io.pivotal.cfenv.sso.CfSingleSignOnProcessor
Collapse Failed ManifestDocumentation getManifestOfRelease History
Build and install Skipper < 1 sec
java.lang.IllegalStateException: Failed to load ApplicationContext
Caused by: java.lang.IllegalArgumentException: Unable to instantiate factory class: io.pivotal.cfenv.spring.boot.CfEnvProcessor
Caused by: java.lang.ClassNotFoundException: io.pivotal.cfenv.sso.CfSingleSignOnProcessor
Collapse Failed PackageMetadataDocumentation getAllPackageMetadata History
Build and install Skipper < 1 sec
java.lang.IllegalStateException: Failed to load ApplicationContext
Caused by: java.lang.IllegalArgumentException: Unable to instantiate factory class: io.pivotal.cfenv.spring.boot.CfEnvProcessor
Caused by: java.lang.ClassNotFoundException: io.pivotal.cfenv.sso.CfSingleSignOnProcessor
Collapse Failed PackageMetadataDocumentation getPackageMetadataSearchFindByName History
Build and install Skipper < 1 sec
java.lang.IllegalStateException: Failed to load ApplicationContext
Caused by: java.lang.IllegalArgumentException: Unable to instantiate factory class: io.pivotal.cfenv.spring.boot.CfEnvProcessor
Caused by: java.lang.ClassNotFoundException: io.pivotal.cfenv.sso.CfSingleSignOnProcessor
Collapse Failed PackageMetadataDocumentation getPackageMetadataSearchFindByNameContainingIgnoreCase History
Build and install Skipper < 1 sec
java.lang.IllegalStateException: Failed to load ApplicationContext
Caused by: java.lang.IllegalArgumentException: Unable to instantiate factory class: io.pivotal.cfenv.spring.boot.CfEnvProcessor
Caused by: java.lang.ClassNotFoundException: io.pivotal.cfenv.sso.CfSingleSignOnProcessor
Collapse Failed PackageMetadataDocumentation getPackageMetadataSummary History
Build and install Skipper < 1 sec
java.lang.IllegalStateException: Failed to load ApplicationContext
Caused by: java.lang.IllegalArgumentException: Unable to instantiate factory class: io.pivotal.cfenv.spring.boot.CfEnvProcessor
Caused by: java.lang.ClassNotFoundException: io.pivotal.cfenv.sso.CfSingleSignOnProcessor
Collapse Failed PackageMetadataDocumentation getPackageMetadataDetails History
Build and install Skipper < 1 sec
java.lang.IllegalStateException: Failed to load ApplicationContext
Caused by: java.lang.IllegalArgumentException: Unable to instantiate factory class: io.pivotal.cfenv.spring.boot.CfEnvProcessor
Caused by: java.lang.ClassNotFoundException: io.pivotal.cfenv.sso.CfSingleSignOnProcessor
Collapse Failed ReleasesDocumentation getAllReleases History
Build and install Skipper < 1 sec
java.lang.IllegalStateException: Failed to load ApplicationContext
Caused by: java.lang.IllegalArgumentException: Unable to instantiate factory class: io.pivotal.cfenv.spring.boot.CfEnvProcessor
Caused by: java.lang.ClassNotFoundException: io.pivotal.cfenv.sso.CfSingleSignOnProcessor
Collapse Failed RepositoriesDocumentation getSingleRepository History
Build and install Skipper < 1 sec
java.lang.IllegalStateException: Failed to load ApplicationContext
Caused by: java.lang.IllegalArgumentException: Unable to instantiate factory class: io.pivotal.cfenv.spring.boot.CfEnvProcessor
Caused by: java.lang.ClassNotFoundException: io.pivotal.cfenv.sso.CfSingleSignOnProcessor
Collapse Failed RepositoriesDocumentation getAllRepositories History
Build and install Skipper < 1 sec
java.lang.IllegalStateException: Failed to load ApplicationContext
Caused by: java.lang.IllegalArgumentException: Unable to instantiate factory class: io.pivotal.cfenv.spring.boot.CfEnvProcessor
Caused by: java.lang.ClassNotFoundException: io.pivotal.cfenv.sso.CfSingleSignOnProcessor
Collapse Failed RollbackDocumentation rollbackReleaseRequest History
Build and install Skipper < 1 sec
java.lang.IllegalStateException: Failed to load ApplicationContext
Caused by: java.lang.IllegalArgumentException: Unable to instantiate factory class: io.pivotal.cfenv.spring.boot.CfEnvProcessor
Caused by: java.lang.ClassNotFoundException: io.pivotal.cfenv.sso.CfSingleSignOnProcessor
Collapse Failed RollbackDocumentation rollbackRelease History
Build and install Skipper < 1 sec
java.lang.IllegalStateException: Failed to load ApplicationContext
Caused by: java.lang.IllegalArgumentException: Unable to instantiate factory class: io.pivotal.cfenv.spring.boot.CfEnvProcessor
Caused by: java.lang.ClassNotFoundException: io.pivotal.cfenv.sso.CfSingleSignOnProcessor
Collapse Failed StatusDocumentation getStatusOfReleaseForVersion History
Build and install Skipper < 1 sec
java.lang.IllegalStateException: Failed to load ApplicationContext
Caused by: java.lang.IllegalArgumentException: Unable to instantiate factory class: io.pivotal.cfenv.spring.boot.CfEnvProcessor
Caused by: java.lang.ClassNotFoundException: io.pivotal.cfenv.sso.CfSingleSignOnProcessor
Collapse Failed StatusDocumentation getStatusOfRelease History
Build and install Skipper < 1 sec
java.lang.IllegalStateException: Failed to load ApplicationContext
Caused by: java.lang.IllegalArgumentException: Unable to instantiate factory class: io.pivotal.cfenv.spring.boot.CfEnvProcessor
Caused by: java.lang.ClassNotFoundException: io.pivotal.cfenv.sso.CfSingleSignOnProcessor
Collapse Failed UpgradeDocumentation upgradeRelease History
Build and install Skipper < 1 sec
java.lang.IllegalStateException: Failed to load ApplicationContext
Caused by: java.lang.IllegalArgumentException: Unable to instantiate factory class: io.pivotal.cfenv.spring.boot.CfEnvProcessor
Caused by: java.lang.ClassNotFoundException: io.pivotal.cfenv.sso.CfSingleSignOnProcessor
Collapse Failed UploadDocumentation uploadRelease History
Build and install Skipper < 1 sec
java.lang.IllegalStateException: Failed to load ApplicationContext
Caused by: java.lang.IllegalArgumentException: Unable to instantiate factory class: io.pivotal.cfenv.spring.boot.CfEnvProcessor
Caused by: java.lang.ClassNotFoundException: io.pivotal.cfenv.sso.CfSingleSignOnProcessor
Collapse Failed DeployerRepositoryTests basicCrud History
Build and install Skipper < 1 sec
java.lang.IllegalStateException: Failed to load ApplicationContext
Caused by: java.lang.IllegalArgumentException: Unable to instantiate factory class: io.pivotal.cfenv.spring.boot.CfEnvProcessor
Caused by: java.lang.ClassNotFoundException: io.pivotal.cfenv.sso.CfSingleSignOnProcessor
Collapse Failed PackageMetadataMvcTests testProjection History
Build and install Skipper < 1 sec
java.lang.IllegalStateException: Failed to load ApplicationContext
Caused by: java.lang.IllegalArgumentException: Unable to instantiate factory class: io.pivotal.cfenv.spring.boot.CfEnvProcessor
Caused by: java.lang.ClassNotFoundException: io.pivotal.cfenv.sso.CfSingleSignOnProcessor
Collapse Failed PackageMetadataMvcTests shouldReturnRepositoryIndex History
Build and install Skipper < 1 sec
java.lang.IllegalStateException: Failed to load ApplicationContext
Caused by: java.lang.IllegalArgumentException: Unable to instantiate factory class: io.pivotal.cfenv.spring.boot.CfEnvProcessor
Caused by: java.lang.ClassNotFoundException: io.pivotal.cfenv.sso.CfSingleSignOnProcessor
Collapse Failed PackageMetadataRepositoryTests basicCrud History
Build and install Skipper < 1 sec
java.lang.IllegalStateException: Failed to load ApplicationContext
Caused by: java.lang.IllegalArgumentException: Unable to instantiate factory class: io.pivotal.cfenv.spring.boot.CfEnvProcessor
Caused by: java.lang.ClassNotFoundException: io.pivotal.cfenv.sso.CfSingleSignOnProcessor
Collapse Failed PackageMetadataRepositoryTests findByNameAndVersionWithMultipleRepos History
Build and install Skipper < 1 sec
java.lang.IllegalStateException: Failed to load ApplicationContext
Caused by: java.lang.IllegalArgumentException: Unable to instantiate factory class: io.pivotal.cfenv.spring.boot.CfEnvProcessor
Caused by: java.lang.ClassNotFoundException: io.pivotal.cfenv.sso.CfSingleSignOnProcessor
Collapse Failed PackageMetadataRepositoryTests findByNameQueries History
Build and install Skipper < 1 sec
java.lang.IllegalStateException: Failed to load ApplicationContext
Caused by: java.lang.IllegalArgumentException: Unable to instantiate factory class: io.pivotal.cfenv.spring.boot.CfEnvProcessor
Caused by: java.lang.ClassNotFoundException: io.pivotal.cfenv.sso.CfSingleSignOnProcessor