Build Spring Cloud Skipper Server - latest tag

Build: #707 failed Changes by Janne Valkealahti

Stages & jobs

  1. Default Stage

  2. Build Skipper Docker Image and upload

Logs

The following logs have been generated by the jobs in this plan.
  • Expand all
  • Collapse all
Job Logs
Collapse Build and install Skipper Default Stage Download or View
21-Aug-2019 13:52:48 [INFO] Downloading from spring-plugins: https://repo.spring.io/plugins-release/org/springframework/integration/spring-integration-bom/5.2.0.BUILD-SNAPSHOT/maven-metadata.xml
21-Aug-2019 13:52:48 [INFO] Downloading from spring-snapshots: https://repo.spring.io/libs-snapshot/org/springframework/integration/spring-integration-bom/5.2.0.BUILD-SNAPSHOT/maven-metadata.xml
21-Aug-2019 13:52:48 [INFO] Downloaded from spring-snapshots: https://repo.spring.io/libs-snapshot/org/springframework/integration/spring-integration-bom/5.2.0.BUILD-SNAPSHOT/maven-metadata.xml (827 B at 4.6 kB/s)
21-Aug-2019 13:52:48 [INFO] Downloading from spring-snapshots: https://repo.spring.io/libs-snapshot/org/springframework/security/spring-security-bom/5.2.0.BUILD-SNAPSHOT/maven-metadata.xml
21-Aug-2019 13:52:48 [INFO] Downloading from spring-plugins: https://repo.spring.io/plugins-release/org/springframework/security/spring-security-bom/5.2.0.BUILD-SNAPSHOT/maven-metadata.xml
21-Aug-2019 13:52:48 [INFO] Downloaded from spring-snapshots: https://repo.spring.io/libs-snapshot/org/springframework/security/spring-security-bom/5.2.0.BUILD-SNAPSHOT/maven-metadata.xml (1.4 kB at 8.8 kB/s)
21-Aug-2019 13:52:48 [ERROR] [ERROR] Some problems were encountered while processing the POMs:
21-Aug-2019 13:52:48 [ERROR] 'dependencies.dependency.version' for org.junit.jupiter:junit-jupiter-api:jar is missing. @ org.springframework:spring-framework-bom:5.2.0.BUILD-SNAPSHOT, /home/bamboo/.m2/repository/org/springframework/spring-framework-bom/5.2.0.BUILD-SNAPSHOT/spring-framework-bom-5.2.0.BUILD-SNAPSHOT.pom, line 9, column 17
21-Aug-2019 13:52:48 [ERROR] 'dependencies.dependency.version' for org.junit.jupiter:junit-jupiter-params:jar is missing. @ org.springframework:spring-framework-bom:5.2.0.BUILD-SNAPSHOT, /home/bamboo/.m2/repository/org/springframework/spring-framework-bom/5.2.0.BUILD-SNAPSHOT/spring-framework-bom-5.2.0.BUILD-SNAPSHOT.pom, line 14, column 17
21-Aug-2019 13:52:48 [ERROR] 'dependencies.dependency.version' for org.junit.platform:junit-platform-launcher:jar is missing. @ org.springframework:spring-framework-bom:5.2.0.BUILD-SNAPSHOT, /home/bamboo/.m2/repository/org/springframework/spring-framework-bom/5.2.0.BUILD-SNAPSHOT/spring-framework-bom-5.2.0.BUILD-SNAPSHOT.pom, line 55, column 17
21-Aug-2019 13:52:48 [ERROR] 'dependencies.dependency.version' for org.junit.jupiter:junit-jupiter-engine:jar is missing. @ org.springframework:spring-framework-bom:5.2.0.BUILD-SNAPSHOT, /home/bamboo/.m2/repository/org/springframework/spring-framework-bom/5.2.0.BUILD-SNAPSHOT/spring-framework-bom-5.2.0.BUILD-SNAPSHOT.pom, line 60, column 17
21-Aug-2019 13:52:48 @
21-Aug-2019 13:52:48 [ERROR] The build could not read 1 project -> [Help 1]
21-Aug-2019 13:52:48 [ERROR]   
21-Aug-2019 13:52:48 [ERROR]   The project org.springframework.cloud:spring-cloud-skipper-parent:2.2.0.BUILD-SNAPSHOT (/opt/bamboo-home/xml-data/build-dir/SCSKIP-BMASTER-JOB1/pom.xml) has 4 errors
21-Aug-2019 13:52:48 [ERROR]     'dependencies.dependency.version' for org.junit.jupiter:junit-jupiter-api:jar is missing. @ org.springframework:spring-framework-bom:5.2.0.BUILD-SNAPSHOT, /home/bamboo/.m2/repository/org/springframework/spring-framework-bom/5.2.0.BUILD-SNAPSHOT/spring-framework-bom-5.2.0.BUILD-SNAPSHOT.pom, line 9, column 17
21-Aug-2019 13:52:48 [ERROR]     'dependencies.dependency.version' for org.junit.jupiter:junit-jupiter-params:jar is missing. @ org.springframework:spring-framework-bom:5.2.0.BUILD-SNAPSHOT, /home/bamboo/.m2/repository/org/springframework/spring-framework-bom/5.2.0.BUILD-SNAPSHOT/spring-framework-bom-5.2.0.BUILD-SNAPSHOT.pom, line 14, column 17
21-Aug-2019 13:52:48 [ERROR]     'dependencies.dependency.version' for org.junit.platform:junit-platform-launcher:jar is missing. @ org.springframework:spring-framework-bom:5.2.0.BUILD-SNAPSHOT, /home/bamboo/.m2/repository/org/springframework/spring-framework-bom/5.2.0.BUILD-SNAPSHOT/spring-framework-bom-5.2.0.BUILD-SNAPSHOT.pom, line 55, column 17
21-Aug-2019 13:52:48 [ERROR]     'dependencies.dependency.version' for org.junit.jupiter:junit-jupiter-engine:jar is missing. @ org.springframework:spring-framework-bom:5.2.0.BUILD-SNAPSHOT, /home/bamboo/.m2/repository/org/springframework/spring-framework-bom/5.2.0.BUILD-SNAPSHOT/spring-framework-bom-5.2.0.BUILD-SNAPSHOT.pom, line 60, column 17
21-Aug-2019 13:52:48 [ERROR]
21-Aug-2019 13:52:48 [ERROR] To see the full stack trace of the errors, re-run Maven with the -e switch.
21-Aug-2019 13:52:48 [ERROR] Re-run Maven using the -X switch to enable full debug logging.
21-Aug-2019 13:52:48 [ERROR]
21-Aug-2019 13:52:48 [ERROR] For more information about the errors and possible solutions, please read the following articles:
21-Aug-2019 13:52:48 [ERROR] [Help 1] http://cwiki.apache.org/confluence/display/MAVEN/ProjectBuildingException