Build Spring Cloud Skipper Server - latest tag

Build: #736 failed Child of SCD-DK8S18-146

Stages & jobs

  1. Default Stage

  2. Build Skipper Docker Image and upload

Build result summary

Details

Completed
Duration
7 minutes
Labels
None
Agent
bamboo-22.af.pivotal.io
Revision
842dd97f6e5fb5fe6486681530f0ae6645143e13 842dd97f6e5fb5fe6486681530f0ae6645143e13
Total tests
157
Fixed in
#737 (Changes by Janne Valkealahti)

Tests

Responsible

No one has taken responsibility for this failure

Tests

New test failures 1
Status Test View job Duration
Collapse Failed StateMachineTests testUpgradeCancelWhileCheckingApps History
Build and install Skipper 1 sec
java.lang.AssertionError: StateChanged count not matched for machine ERROR INSTALL INSTALL_INSTALL INSTALL_EXIT UPGRADE UPGRADE_DEPLOY_TARGET_APPS_FAILED UPGRADE_DEPLOY_TARGET_APPS UPGRADE_START UPGRADE_CANCEL UPGRADE_DEPLOY_TARGET_APPS_SUCCEED UPGRADE_CHECK_TARGET_APPS UPGRADE_WAIT_TARGET_APPS UPGRADE_DELETE_SOURCE_APPS UPGRADE_CHECK_CHOICE UPGRADE_EXIT INITIAL ROLLBACK ROLLBACK_START ROLLBACK_EXIT_INSTALL ROLLBACK_CHOICE ROLLBACK_EXIT ROLLBACK_EXIT_UPGRADE DELETE DELETE_DELETE DELETE_EXIT ERROR_JUNCTION  / UPGRADE,UPGRADE_WAIT_TARGET_APPS / uuid=a6f623dc-d11f-450b-a22d-2041fd9cba5c / id=testUpgradeCancelWhileCheckingApps
Expected: is <4>
     but: was <6>
java.lang.AssertionError: 
StateChanged count not matched for machine ERROR INSTALL INSTALL_INSTALL INSTALL_EXIT UPGRADE UPGRADE_DEPLOY_TARGET_APPS_FAILED UPGRADE_DEPLOY_TARGET_APPS UPGRADE_START UPGRADE_CANCEL UPGRADE_DEPLOY_TARGET_APPS_SUCCEED UPGRADE_CHECK_TARGET_APPS UPGRADE_WAIT_TARGET_APPS UPGRADE_DELETE_SOURCE_APPS UPGRADE_CHECK_CHOICE UPGRADE_EXIT INITIAL ROLLBACK ROLLBACK_START ROLLBACK_EXIT_INSTALL ROLLBACK_CHOICE ROLLBACK_EXIT ROLLBACK_EXIT_UPGRADE DELETE DELETE_DELETE DELETE_EXIT ERROR_JUNCTION  / UPGRADE,UPGRADE_WAIT_TARGET_APPS / uuid=a6f623dc-d11f-450b-a22d-2041fd9cba5c / id=testUpgradeCancelWhileCheckingApps
Expected: is <4>
     but: was <6>
	at org.springframework.cloud.skipper.server.statemachine.StateMachineTests.testUpgradeCancelWhileCheckingApps(StateMachineTests.java:428)