Build Spring Cloud Skipper Server - latest tag

Build: #794 failed Child of SCD-DK8S18-171

Stages & jobs

  1. Default Stage

  2. Build Skipper Docker Image and upload

Build result summary

Details

Completed
Duration
7 minutes
Labels
None
Agent
bamboo-21.af.pivotal.io
Revision
5cf27525a2228cb92aae915bf8331dee742678ed 5cf27525a2228cb92aae915bf8331dee742678ed
Total tests
160
Fixed in
#795 (Manual run by Janne Valkealahti)

Tests

Responsible

No one has taken responsibility for this failure

Tests

New test failures 1
Status Test View job Duration
Collapse Failed ReleaseServiceTests testDeletedReleaseWithPackageNonLocalRepo History
Build and install Skipper 5 secs
org.springframework.orm.jpa.JpaSystemException: could not extract ResultSet; nested exception is org.hibernate.exception.GenericJDBCException: could not extract ResultSet
	at org.springframework.cloud.skipper.server.service.ReleaseServiceTests.assertReleaseStatus(ReleaseServiceTests.java:475)
	at org.springframework.cloud.skipper.server.service.ReleaseServiceTests.testDeletedReleaseWithPackageNonLocalRepo(ReleaseServiceTests.java:364)
Caused by: org.hibernate.exception.GenericJDBCException: could not extract ResultSet
	at org.springframework.cloud.skipper.server.service.ReleaseServiceTests.assertReleaseStatus(ReleaseServiceTests.java:475)
	at org.springframework.cloud.skipper.server.service.ReleaseServiceTests.testDeletedReleaseWithPackageNonLocalRepo(ReleaseServiceTests.java:364)
Caused by: org.h2.jdbc.JdbcSQLNonTransientException: 
General error: "java.lang.NullPointerException"; SQL statement:
(6 more lines...)