Build Spring Cloud Skipper Server - latest tag

Build: #578 failed

Job: Build and install Skipper failed

Stages & jobs

  1. Default Stage

  2. Build Skipper Docker Image and upload

Build log

The build generated 16,140 lines of output.The output is too long and has been truncated to the last 1,000 lines. Download or view full build log

26-Feb-2019 00:00:51         at org.springframework.test.context.junit4.statements.RunAfterTestClassCallbacks.evaluate(RunAfterTestClassCallbacks.java:70)
26-Feb-2019 00:00:51         at org.junit.runners.ParentRunner.run(ParentRunner.java:363)
26-Feb-2019 00:00:51         at org.springframework.test.context.junit4.SpringJUnit4ClassRunner.run(SpringJUnit4ClassRunner.java:190)
26-Feb-2019 00:00:51         at org.apache.maven.surefire.junit4.JUnit4Provider.execute(JUnit4Provider.java:365)
26-Feb-2019 00:00:51         at org.apache.maven.surefire.junit4.JUnit4Provider.executeWithRerun(JUnit4Provider.java:272)
26-Feb-2019 00:00:51         at org.apache.maven.surefire.junit4.JUnit4Provider.executeTestSet(JUnit4Provider.java:236)
26-Feb-2019 00:00:51         at org.apache.maven.surefire.junit4.JUnit4Provider.invoke(JUnit4Provider.java:159)
26-Feb-2019 00:00:51         at org.apache.maven.surefire.booter.ForkedBooter.invokeProviderInSameClassLoader(ForkedBooter.java:386)
26-Feb-2019 00:00:51         at org.apache.maven.surefire.booter.ForkedBooter.runSuitesInProcess(ForkedBooter.java:323)
26-Feb-2019 00:00:51         at org.apache.maven.surefire.booter.ForkedBooter.main(ForkedBooter.java:143)
26-Feb-2019 00:00:51 Caused by: java.lang.IllegalArgumentException: Unable to instantiate factory class: io.pivotal.cfenv.spring.boot.CfEnvProcessor
26-Feb-2019 00:00:51         at org.springframework.core.io.support.SpringFactoriesLoader.instantiateFactory(SpringFactoriesLoader.java:167)
26-Feb-2019 00:00:51         at org.springframework.core.io.support.SpringFactoriesLoader.loadFactories(SpringFactoriesLoader.java:104)
26-Feb-2019 00:00:51         at io.pivotal.cfenv.spring.boot.CfEnvironmentPostProcessor.loadCfEnvProcessors(CfEnvironmentPostProcessor.java:144)
26-Feb-2019 00:00:51         at io.pivotal.cfenv.spring.boot.CfEnvironmentPostProcessor.onApplicationEvent(CfEnvironmentPostProcessor.java:134)
26-Feb-2019 00:00:51         at org.springframework.context.event.SimpleApplicationEventMulticaster.doInvokeListener(SimpleApplicationEventMulticaster.java:172)
26-Feb-2019 00:00:51         at org.springframework.context.event.SimpleApplicationEventMulticaster.invokeListener(SimpleApplicationEventMulticaster.java:165)
26-Feb-2019 00:00:51         at org.springframework.context.event.SimpleApplicationEventMulticaster.multicastEvent(SimpleApplicationEventMulticaster.java:139)
26-Feb-2019 00:00:51         at org.springframework.context.event.SimpleApplicationEventMulticaster.multicastEvent(SimpleApplicationEventMulticaster.java:127)
26-Feb-2019 00:00:51         at org.springframework.boot.context.event.EventPublishingRunListener.environmentPrepared(EventPublishingRunListener.java:75)
26-Feb-2019 00:00:51         at org.springframework.boot.SpringApplicationRunListeners.environmentPrepared(SpringApplicationRunListeners.java:54)
26-Feb-2019 00:00:51         at org.springframework.boot.SpringApplication.prepareEnvironment(SpringApplication.java:347)
26-Feb-2019 00:00:51         at org.springframework.boot.SpringApplication.run(SpringApplication.java:306)
26-Feb-2019 00:00:51         at org.springframework.boot.builder.SpringApplicationBuilder.run(SpringApplicationBuilder.java:139)
26-Feb-2019 00:00:51         at org.springframework.cloud.bootstrap.BootstrapApplicationListener.bootstrapServiceContext(BootstrapApplicationListener.java:191)
26-Feb-2019 00:00:51         at org.springframework.cloud.bootstrap.BootstrapApplicationListener.onApplicationEvent(BootstrapApplicationListener.java:105)
26-Feb-2019 00:00:51         at org.springframework.cloud.bootstrap.BootstrapApplicationListener.onApplicationEvent(BootstrapApplicationListener.java:71)
26-Feb-2019 00:00:51         at org.springframework.context.event.SimpleApplicationEventMulticaster.doInvokeListener(SimpleApplicationEventMulticaster.java:172)
26-Feb-2019 00:00:51         at org.springframework.context.event.SimpleApplicationEventMulticaster.invokeListener(SimpleApplicationEventMulticaster.java:165)
26-Feb-2019 00:00:51         at org.springframework.context.event.SimpleApplicationEventMulticaster.multicastEvent(SimpleApplicationEventMulticaster.java:139)
26-Feb-2019 00:00:51         at org.springframework.context.event.SimpleApplicationEventMulticaster.multicastEvent(SimpleApplicationEventMulticaster.java:127)
26-Feb-2019 00:00:51         at org.springframework.boot.context.event.EventPublishingRunListener.environmentPrepared(EventPublishingRunListener.java:75)
26-Feb-2019 00:00:51         at org.springframework.boot.SpringApplicationRunListeners.environmentPrepared(SpringApplicationRunListeners.java:54)
26-Feb-2019 00:00:51         at org.springframework.boot.SpringApplication.prepareEnvironment(SpringApplication.java:347)
26-Feb-2019 00:00:51         at org.springframework.boot.SpringApplication.run(SpringApplication.java:306)
26-Feb-2019 00:00:51         at org.springframework.boot.test.context.SpringBootContextLoader.loadContext(SpringBootContextLoader.java:127)
26-Feb-2019 00:00:51         at org.springframework.test.context.cache.DefaultCacheAwareContextLoaderDelegate.loadContextInternal(DefaultCacheAwareContextLoaderDelegate.java:99)
26-Feb-2019 00:00:51         at org.springframework.test.context.cache.DefaultCacheAwareContextLoaderDelegate.loadContext(DefaultCacheAwareContextLoaderDelegate.java:117)
26-Feb-2019 00:00:51         ... 26 common frames omitted
26-Feb-2019 00:00:51 Caused by: java.lang.ClassNotFoundException: io.pivotal.cfenv.sso.CfSingleSignOnProcessor
26-Feb-2019 00:00:51         at java.net.URLClassLoader.findClass(URLClassLoader.java:381)
26-Feb-2019 00:00:51         at java.lang.ClassLoader.loadClass(ClassLoader.java:424)
26-Feb-2019 00:00:51         at sun.misc.Launcher$AppClassLoader.loadClass(Launcher.java:335)
26-Feb-2019 00:00:51         at java.lang.ClassLoader.loadClass(ClassLoader.java:357)
26-Feb-2019 00:00:51         at java.lang.Class.forName0(Native Method)
26-Feb-2019 00:00:51         at java.lang.Class.forName(Class.java:348)
26-Feb-2019 00:00:51         at org.springframework.util.ClassUtils.forName(ClassUtils.java:275)
26-Feb-2019 00:00:51         at org.springframework.core.io.support.SpringFactoriesLoader.instantiateFactory(SpringFactoriesLoader.java:159)
26-Feb-2019 00:00:51         ... 52 common frames omitted
26-Feb-2019 00:00:51 00:00:51.677 [main] DEBUG org.springframework.test.annotation.ProfileValueUtils - Retrieved @ProfileValueSourceConfiguration [null] for test class [org.springframework.cloud.skipper.server.repository.PackageMetadataRepositoryTests]
26-Feb-2019 00:00:51 00:00:51.678 [main] DEBUG org.springframework.test.annotation.ProfileValueUtils - Retrieved ProfileValueSource type [class org.springframework.test.annotation.SystemProfileValueSource] for class [org.springframework.cloud.skipper.server.repository.PackageMetadataRepositoryTests]
26-Feb-2019 00:00:51 00:00:51.678 [main] DEBUG org.springframework.test.context.support.TestPropertySourceUtils - Adding inlined properties to environment: {spring.jmx.enabled=false, spring.main.allow-bean-definition-overriding=true, org.springframework.boot.test.context.SpringBootTestContextBootstrapper=true, server.port=-1}
26-Feb-2019 00:00:51 00:00:51.684 [main] DEBUG org.springframework.boot.context.logging.ClasspathLoggingApplicationListener - Application failed to start with classpath: [file:/opt/bamboo-home/xml-data/build-dir/SCSKIP-BMASTER-JOB1/spring-cloud-skipper-server-core/target/surefire/surefirebooter3109259931034045945.jar, file:/opt/users/bamboo/.m2/repository/org/jacoco/org.jacoco.agent/0.7.9/org.jacoco.agent-0.7.9-runtime.jar]
26-Feb-2019 00:00:51 00:00:51.684 [main] ERROR org.springframework.boot.SpringApplication - Application run failed
26-Feb-2019 00:00:51 java.lang.IllegalArgumentException: Unable to instantiate factory class: io.pivotal.cfenv.spring.boot.CfEnvProcessor
26-Feb-2019 00:00:51         at org.springframework.core.io.support.SpringFactoriesLoader.instantiateFactory(SpringFactoriesLoader.java:167)
26-Feb-2019 00:00:51         at org.springframework.core.io.support.SpringFactoriesLoader.loadFactories(SpringFactoriesLoader.java:104)
26-Feb-2019 00:00:51         at io.pivotal.cfenv.spring.boot.CfEnvironmentPostProcessor.loadCfEnvProcessors(CfEnvironmentPostProcessor.java:144)
26-Feb-2019 00:00:51         at io.pivotal.cfenv.spring.boot.CfEnvironmentPostProcessor.onApplicationEvent(CfEnvironmentPostProcessor.java:134)
26-Feb-2019 00:00:51         at org.springframework.context.event.SimpleApplicationEventMulticaster.doInvokeListener(SimpleApplicationEventMulticaster.java:172)
26-Feb-2019 00:00:51         at org.springframework.context.event.SimpleApplicationEventMulticaster.invokeListener(SimpleApplicationEventMulticaster.java:165)
26-Feb-2019 00:00:51         at org.springframework.context.event.SimpleApplicationEventMulticaster.multicastEvent(SimpleApplicationEventMulticaster.java:139)
26-Feb-2019 00:00:51         at org.springframework.context.event.SimpleApplicationEventMulticaster.multicastEvent(SimpleApplicationEventMulticaster.java:127)
26-Feb-2019 00:00:51         at org.springframework.boot.context.event.EventPublishingRunListener.environmentPrepared(EventPublishingRunListener.java:75)
26-Feb-2019 00:00:51         at org.springframework.boot.SpringApplicationRunListeners.environmentPrepared(SpringApplicationRunListeners.java:54)
26-Feb-2019 00:00:51         at org.springframework.boot.SpringApplication.prepareEnvironment(SpringApplication.java:347)
26-Feb-2019 00:00:51         at org.springframework.boot.SpringApplication.run(SpringApplication.java:306)
26-Feb-2019 00:00:51         at org.springframework.boot.builder.SpringApplicationBuilder.run(SpringApplicationBuilder.java:139)
26-Feb-2019 00:00:51         at org.springframework.cloud.bootstrap.BootstrapApplicationListener.bootstrapServiceContext(BootstrapApplicationListener.java:191)
26-Feb-2019 00:00:51         at org.springframework.cloud.bootstrap.BootstrapApplicationListener.onApplicationEvent(BootstrapApplicationListener.java:105)
26-Feb-2019 00:00:51         at org.springframework.cloud.bootstrap.BootstrapApplicationListener.onApplicationEvent(BootstrapApplicationListener.java:71)
26-Feb-2019 00:00:51         at org.springframework.context.event.SimpleApplicationEventMulticaster.doInvokeListener(SimpleApplicationEventMulticaster.java:172)
26-Feb-2019 00:00:51         at org.springframework.context.event.SimpleApplicationEventMulticaster.invokeListener(SimpleApplicationEventMulticaster.java:165)
26-Feb-2019 00:00:51         at org.springframework.context.event.SimpleApplicationEventMulticaster.multicastEvent(SimpleApplicationEventMulticaster.java:139)
26-Feb-2019 00:00:51         at org.springframework.context.event.SimpleApplicationEventMulticaster.multicastEvent(SimpleApplicationEventMulticaster.java:127)
26-Feb-2019 00:00:51         at org.springframework.boot.context.event.EventPublishingRunListener.environmentPrepared(EventPublishingRunListener.java:75)
26-Feb-2019 00:00:51         at org.springframework.boot.SpringApplicationRunListeners.environmentPrepared(SpringApplicationRunListeners.java:54)
26-Feb-2019 00:00:51         at org.springframework.boot.SpringApplication.prepareEnvironment(SpringApplication.java:347)
26-Feb-2019 00:00:51         at org.springframework.boot.SpringApplication.run(SpringApplication.java:306)
26-Feb-2019 00:00:51         at org.springframework.boot.test.context.SpringBootContextLoader.loadContext(SpringBootContextLoader.java:127)
26-Feb-2019 00:00:51         at org.springframework.test.context.cache.DefaultCacheAwareContextLoaderDelegate.loadContextInternal(DefaultCacheAwareContextLoaderDelegate.java:99)
26-Feb-2019 00:00:51         at org.springframework.test.context.cache.DefaultCacheAwareContextLoaderDelegate.loadContext(DefaultCacheAwareContextLoaderDelegate.java:117)
26-Feb-2019 00:00:51         at org.springframework.test.context.support.DefaultTestContext.getApplicationContext(DefaultTestContext.java:108)
26-Feb-2019 00:00:51         at org.springframework.test.context.web.ServletTestExecutionListener.setUpRequestContextIfNecessary(ServletTestExecutionListener.java:190)
26-Feb-2019 00:00:51         at org.springframework.test.context.web.ServletTestExecutionListener.prepareTestInstance(ServletTestExecutionListener.java:132)
26-Feb-2019 00:00:51         at org.springframework.test.context.TestContextManager.prepareTestInstance(TestContextManager.java:246)
26-Feb-2019 00:00:51         at org.springframework.test.context.junit4.SpringJUnit4ClassRunner.createTest(SpringJUnit4ClassRunner.java:227)
26-Feb-2019 00:00:51         at org.springframework.test.context.junit4.SpringJUnit4ClassRunner$1.runReflectiveCall(SpringJUnit4ClassRunner.java:289)
26-Feb-2019 00:00:51         at org.junit.internal.runners.model.ReflectiveCallable.run(ReflectiveCallable.java:12)
26-Feb-2019 00:00:51         at org.springframework.test.context.junit4.SpringJUnit4ClassRunner.methodBlock(SpringJUnit4ClassRunner.java:291)
26-Feb-2019 00:00:51         at org.springframework.test.context.junit4.SpringJUnit4ClassRunner.runChild(SpringJUnit4ClassRunner.java:246)
26-Feb-2019 00:00:51         at org.springframework.test.context.junit4.SpringJUnit4ClassRunner.runChild(SpringJUnit4ClassRunner.java:97)
26-Feb-2019 00:00:51         at org.junit.runners.ParentRunner$3.run(ParentRunner.java:290)
26-Feb-2019 00:00:51         at org.junit.runners.ParentRunner$1.schedule(ParentRunner.java:71)
26-Feb-2019 00:00:51         at org.junit.runners.ParentRunner.runChildren(ParentRunner.java:288)
26-Feb-2019 00:00:51         at org.junit.runners.ParentRunner.access$000(ParentRunner.java:58)
26-Feb-2019 00:00:51         at org.junit.runners.ParentRunner$2.evaluate(ParentRunner.java:268)
26-Feb-2019 00:00:51         at org.springframework.test.context.junit4.statements.RunBeforeTestClassCallbacks.evaluate(RunBeforeTestClassCallbacks.java:61)
26-Feb-2019 00:00:51         at org.springframework.test.context.junit4.statements.RunAfterTestClassCallbacks.evaluate(RunAfterTestClassCallbacks.java:70)
26-Feb-2019 00:00:51         at org.junit.runners.ParentRunner.run(ParentRunner.java:363)
26-Feb-2019 00:00:51         at org.springframework.test.context.junit4.SpringJUnit4ClassRunner.run(SpringJUnit4ClassRunner.java:190)
26-Feb-2019 00:00:51         at org.apache.maven.surefire.junit4.JUnit4Provider.execute(JUnit4Provider.java:365)
26-Feb-2019 00:00:51         at org.apache.maven.surefire.junit4.JUnit4Provider.executeWithRerun(JUnit4Provider.java:272)
26-Feb-2019 00:00:51         at org.apache.maven.surefire.junit4.JUnit4Provider.executeTestSet(JUnit4Provider.java:236)
26-Feb-2019 00:00:51         at org.apache.maven.surefire.junit4.JUnit4Provider.invoke(JUnit4Provider.java:159)
26-Feb-2019 00:00:51         at org.apache.maven.surefire.booter.ForkedBooter.invokeProviderInSameClassLoader(ForkedBooter.java:386)
26-Feb-2019 00:00:51         at org.apache.maven.surefire.booter.ForkedBooter.runSuitesInProcess(ForkedBooter.java:323)
26-Feb-2019 00:00:51         at org.apache.maven.surefire.booter.ForkedBooter.main(ForkedBooter.java:143)
26-Feb-2019 00:00:51 Caused by: java.lang.ClassNotFoundException: io.pivotal.cfenv.sso.CfSingleSignOnProcessor
26-Feb-2019 00:00:51         at java.net.URLClassLoader.findClass(URLClassLoader.java:381)
26-Feb-2019 00:00:51         at java.lang.ClassLoader.loadClass(ClassLoader.java:424)
26-Feb-2019 00:00:51         at sun.misc.Launcher$AppClassLoader.loadClass(Launcher.java:335)
26-Feb-2019 00:00:51         at java.lang.ClassLoader.loadClass(ClassLoader.java:357)
26-Feb-2019 00:00:51         at java.lang.Class.forName0(Native Method)
26-Feb-2019 00:00:51         at java.lang.Class.forName(Class.java:348)
26-Feb-2019 00:00:51         at org.springframework.util.ClassUtils.forName(ClassUtils.java:275)
26-Feb-2019 00:00:51         at org.springframework.core.io.support.SpringFactoriesLoader.instantiateFactory(SpringFactoriesLoader.java:159)
26-Feb-2019 00:00:51         ... 52 common frames omitted
26-Feb-2019 00:00:51 00:00:51.684 [main] ERROR org.springframework.test.context.TestContextManager - Caught exception while allowing TestExecutionListener [org.springframework.test.context.web.ServletTestExecutionListener@7d538a7a] to prepare test instance [org.springframework.cloud.skipper.server.repository.PackageMetadataRepositoryTests@5b0c28d0]
26-Feb-2019 00:00:51 java.lang.IllegalStateException: Failed to load ApplicationContext
26-Feb-2019 00:00:51         at org.springframework.test.context.cache.DefaultCacheAwareContextLoaderDelegate.loadContext(DefaultCacheAwareContextLoaderDelegate.java:125)
26-Feb-2019 00:00:51         at org.springframework.test.context.support.DefaultTestContext.getApplicationContext(DefaultTestContext.java:108)
26-Feb-2019 00:00:51         at org.springframework.test.context.web.ServletTestExecutionListener.setUpRequestContextIfNecessary(ServletTestExecutionListener.java:190)
26-Feb-2019 00:00:51         at org.springframework.test.context.web.ServletTestExecutionListener.prepareTestInstance(ServletTestExecutionListener.java:132)
26-Feb-2019 00:00:51         at org.springframework.test.context.TestContextManager.prepareTestInstance(TestContextManager.java:246)
26-Feb-2019 00:00:51         at org.springframework.test.context.junit4.SpringJUnit4ClassRunner.createTest(SpringJUnit4ClassRunner.java:227)
26-Feb-2019 00:00:51         at org.springframework.test.context.junit4.SpringJUnit4ClassRunner$1.runReflectiveCall(SpringJUnit4ClassRunner.java:289)
26-Feb-2019 00:00:51         at org.junit.internal.runners.model.ReflectiveCallable.run(ReflectiveCallable.java:12)
26-Feb-2019 00:00:51         at org.springframework.test.context.junit4.SpringJUnit4ClassRunner.methodBlock(SpringJUnit4ClassRunner.java:291)
26-Feb-2019 00:00:51         at org.springframework.test.context.junit4.SpringJUnit4ClassRunner.runChild(SpringJUnit4ClassRunner.java:246)
26-Feb-2019 00:00:51         at org.springframework.test.context.junit4.SpringJUnit4ClassRunner.runChild(SpringJUnit4ClassRunner.java:97)
26-Feb-2019 00:00:51         at org.junit.runners.ParentRunner$3.run(ParentRunner.java:290)
26-Feb-2019 00:00:51         at org.junit.runners.ParentRunner$1.schedule(ParentRunner.java:71)
26-Feb-2019 00:00:51         at org.junit.runners.ParentRunner.runChildren(ParentRunner.java:288)
26-Feb-2019 00:00:51         at org.junit.runners.ParentRunner.access$000(ParentRunner.java:58)
26-Feb-2019 00:00:51         at org.junit.runners.ParentRunner$2.evaluate(ParentRunner.java:268)
26-Feb-2019 00:00:51         at org.springframework.test.context.junit4.statements.RunBeforeTestClassCallbacks.evaluate(RunBeforeTestClassCallbacks.java:61)
26-Feb-2019 00:00:51         at org.springframework.test.context.junit4.statements.RunAfterTestClassCallbacks.evaluate(RunAfterTestClassCallbacks.java:70)
26-Feb-2019 00:00:51         at org.junit.runners.ParentRunner.run(ParentRunner.java:363)
26-Feb-2019 00:00:51         at org.springframework.test.context.junit4.SpringJUnit4ClassRunner.run(SpringJUnit4ClassRunner.java:190)
26-Feb-2019 00:00:51         at org.apache.maven.surefire.junit4.JUnit4Provider.execute(JUnit4Provider.java:365)
26-Feb-2019 00:00:51         at org.apache.maven.surefire.junit4.JUnit4Provider.executeWithRerun(JUnit4Provider.java:272)
26-Feb-2019 00:00:51         at org.apache.maven.surefire.junit4.JUnit4Provider.executeTestSet(JUnit4Provider.java:236)
26-Feb-2019 00:00:51         at org.apache.maven.surefire.junit4.JUnit4Provider.invoke(JUnit4Provider.java:159)
26-Feb-2019 00:00:51         at org.apache.maven.surefire.booter.ForkedBooter.invokeProviderInSameClassLoader(ForkedBooter.java:386)
26-Feb-2019 00:00:51         at org.apache.maven.surefire.booter.ForkedBooter.runSuitesInProcess(ForkedBooter.java:323)
26-Feb-2019 00:00:51         at org.apache.maven.surefire.booter.ForkedBooter.main(ForkedBooter.java:143)
26-Feb-2019 00:00:51 Caused by: java.lang.IllegalArgumentException: Unable to instantiate factory class: io.pivotal.cfenv.spring.boot.CfEnvProcessor
26-Feb-2019 00:00:51         at org.springframework.core.io.support.SpringFactoriesLoader.instantiateFactory(SpringFactoriesLoader.java:167)
26-Feb-2019 00:00:51         at org.springframework.core.io.support.SpringFactoriesLoader.loadFactories(SpringFactoriesLoader.java:104)
26-Feb-2019 00:00:51         at io.pivotal.cfenv.spring.boot.CfEnvironmentPostProcessor.loadCfEnvProcessors(CfEnvironmentPostProcessor.java:144)
26-Feb-2019 00:00:51         at io.pivotal.cfenv.spring.boot.CfEnvironmentPostProcessor.onApplicationEvent(CfEnvironmentPostProcessor.java:134)
26-Feb-2019 00:00:51         at org.springframework.context.event.SimpleApplicationEventMulticaster.doInvokeListener(SimpleApplicationEventMulticaster.java:172)
26-Feb-2019 00:00:51         at org.springframework.context.event.SimpleApplicationEventMulticaster.invokeListener(SimpleApplicationEventMulticaster.java:165)
26-Feb-2019 00:00:51         at org.springframework.context.event.SimpleApplicationEventMulticaster.multicastEvent(SimpleApplicationEventMulticaster.java:139)
26-Feb-2019 00:00:51         at org.springframework.context.event.SimpleApplicationEventMulticaster.multicastEvent(SimpleApplicationEventMulticaster.java:127)
26-Feb-2019 00:00:51         at org.springframework.boot.context.event.EventPublishingRunListener.environmentPrepared(EventPublishingRunListener.java:75)
26-Feb-2019 00:00:51         at org.springframework.boot.SpringApplicationRunListeners.environmentPrepared(SpringApplicationRunListeners.java:54)
26-Feb-2019 00:00:51         at org.springframework.boot.SpringApplication.prepareEnvironment(SpringApplication.java:347)
26-Feb-2019 00:00:51         at org.springframework.boot.SpringApplication.run(SpringApplication.java:306)
26-Feb-2019 00:00:51         at org.springframework.boot.builder.SpringApplicationBuilder.run(SpringApplicationBuilder.java:139)
26-Feb-2019 00:00:51         at org.springframework.cloud.bootstrap.BootstrapApplicationListener.bootstrapServiceContext(BootstrapApplicationListener.java:191)
26-Feb-2019 00:00:51         at org.springframework.cloud.bootstrap.BootstrapApplicationListener.onApplicationEvent(BootstrapApplicationListener.java:105)
26-Feb-2019 00:00:51         at org.springframework.cloud.bootstrap.BootstrapApplicationListener.onApplicationEvent(BootstrapApplicationListener.java:71)
26-Feb-2019 00:00:51         at org.springframework.context.event.SimpleApplicationEventMulticaster.doInvokeListener(SimpleApplicationEventMulticaster.java:172)
26-Feb-2019 00:00:51         at org.springframework.context.event.SimpleApplicationEventMulticaster.invokeListener(SimpleApplicationEventMulticaster.java:165)
26-Feb-2019 00:00:51         at org.springframework.context.event.SimpleApplicationEventMulticaster.multicastEvent(SimpleApplicationEventMulticaster.java:139)
26-Feb-2019 00:00:51         at org.springframework.context.event.SimpleApplicationEventMulticaster.multicastEvent(SimpleApplicationEventMulticaster.java:127)
26-Feb-2019 00:00:51         at org.springframework.boot.context.event.EventPublishingRunListener.environmentPrepared(EventPublishingRunListener.java:75)
26-Feb-2019 00:00:51         at org.springframework.boot.SpringApplicationRunListeners.environmentPrepared(SpringApplicationRunListeners.java:54)
26-Feb-2019 00:00:51         at org.springframework.boot.SpringApplication.prepareEnvironment(SpringApplication.java:347)
26-Feb-2019 00:00:51         at org.springframework.boot.SpringApplication.run(SpringApplication.java:306)
26-Feb-2019 00:00:51         at org.springframework.boot.test.context.SpringBootContextLoader.loadContext(SpringBootContextLoader.java:127)
26-Feb-2019 00:00:51         at org.springframework.test.context.cache.DefaultCacheAwareContextLoaderDelegate.loadContextInternal(DefaultCacheAwareContextLoaderDelegate.java:99)
26-Feb-2019 00:00:51         at org.springframework.test.context.cache.DefaultCacheAwareContextLoaderDelegate.loadContext(DefaultCacheAwareContextLoaderDelegate.java:117)
26-Feb-2019 00:00:51         ... 26 common frames omitted
26-Feb-2019 00:00:51 Caused by: java.lang.ClassNotFoundException: io.pivotal.cfenv.sso.CfSingleSignOnProcessor
26-Feb-2019 00:00:51         at java.net.URLClassLoader.findClass(URLClassLoader.java:381)
26-Feb-2019 00:00:51         at java.lang.ClassLoader.loadClass(ClassLoader.java:424)
26-Feb-2019 00:00:51         at sun.misc.Launcher$AppClassLoader.loadClass(Launcher.java:335)
26-Feb-2019 00:00:51         at java.lang.ClassLoader.loadClass(ClassLoader.java:357)
26-Feb-2019 00:00:51         at java.lang.Class.forName0(Native Method)
26-Feb-2019 00:00:51         at java.lang.Class.forName(Class.java:348)
26-Feb-2019 00:00:51         at org.springframework.util.ClassUtils.forName(ClassUtils.java:275)
26-Feb-2019 00:00:51         at org.springframework.core.io.support.SpringFactoriesLoader.instantiateFactory(SpringFactoriesLoader.java:159)
26-Feb-2019 00:00:51         ... 52 common frames omitted
26-Feb-2019 00:00:51 00:00:51.685 [main] DEBUG org.springframework.test.context.support.AbstractDirtiesContextTestExecutionListener - After test class: context [DefaultTestContext@6062ad94 testClass = PackageMetadataRepositoryTests, testInstance = [null], testMethod = [null], testException = [null], mergedContextConfiguration = [WebMergedContextConfiguration@449f319e testClass = PackageMetadataRepositoryTests, locations = '{}', classes = '{class org.springframework.cloud.skipper.server.AbstractIntegrationTest$TestConfig, class org.springframework.cloud.skipper.server.AbstractIntegrationTest$TestConfig}', contextInitializerClasses = '[]', activeProfiles = '{}', propertySourceLocations = '{}', propertySourceProperties = '{spring.main.allow-bean-definition-overriding=true, org.springframework.boot.test.context.SpringBootTestContextBootstrapper=true}', contextCustomizers = set[org.springframework.boot.test.context.filter.ExcludeFilterContextCustomizer@55d58825, org.springframework.boot.test.json.DuplicateJsonObjectContextCustomizerFactory$DuplicateJsonObjectContextCustomizer@663bb8ef, org.springframework.boot.test.mock.mockito.MockitoContextCustomizer@0, org.springframework.boot.test.web.client.TestRestTemplateContextCustomizer@2c88a3e8, org.springframework.boot.test.autoconfigure.properties.PropertyMappingContextCustomizer@0, org.springframework.boot.test.autoconfigure.web.servlet.WebDriverContextCustomizerFactory$Customizer@22a10ac6], resourceBasePath = 'src/main/webapp', contextLoader = 'org.springframework.boot.test.context.SpringBootContextLoader', parent = [null]], attributes = map['org.springframework.test.context.web.ServletTestExecutionListener.activateListener' -> true, 'org.springframework.test.context.support.DependencyInjectionTestExecutionListener.reinjectDependencies' -> true]], class annotated with @DirtiesContext [true] with mode [BEFORE_CLASS].
26-Feb-2019 00:00:51 [ERROR] Tests run: 4, Failures: 0, Errors: 4, Skipped: 0, Time elapsed: 0.005 s <<< FAILURE! - in org.springframework.cloud.skipper.server.repository.PackageMetadataRepositoryTests
26-Feb-2019 00:00:51 [ERROR] basicCrud(org.springframework.cloud.skipper.server.repository.PackageMetadataRepositoryTests)  Time elapsed: 0 s  <<< ERROR!
26-Feb-2019 00:00:51 java.lang.IllegalStateException: Failed to load ApplicationContext
26-Feb-2019 00:00:51 Caused by: java.lang.IllegalArgumentException: Unable to instantiate factory class: io.pivotal.cfenv.spring.boot.CfEnvProcessor
26-Feb-2019 00:00:51 Caused by: java.lang.ClassNotFoundException: io.pivotal.cfenv.sso.CfSingleSignOnProcessor
26-Feb-2019 00:00:51
26-Feb-2019 00:00:51 [ERROR] verifyMultipleVersions(org.springframework.cloud.skipper.server.repository.PackageMetadataRepositoryTests)  Time elapsed: 0.001 s  <<< ERROR!
26-Feb-2019 00:00:51 java.lang.IllegalStateException: Failed to load ApplicationContext
26-Feb-2019 00:00:51 Caused by: java.lang.IllegalArgumentException: Unable to instantiate factory class: io.pivotal.cfenv.spring.boot.CfEnvProcessor
26-Feb-2019 00:00:51 Caused by: java.lang.ClassNotFoundException: io.pivotal.cfenv.sso.CfSingleSignOnProcessor
26-Feb-2019 00:00:51
26-Feb-2019 00:00:51 [ERROR] findByNameAndVersionWithMultipleRepos(org.springframework.cloud.skipper.server.repository.PackageMetadataRepositoryTests)  Time elapsed: 0 s  <<< ERROR!
26-Feb-2019 00:00:51 java.lang.IllegalStateException: Failed to load ApplicationContext
26-Feb-2019 00:00:51 Caused by: java.lang.IllegalArgumentException: Unable to instantiate factory class: io.pivotal.cfenv.spring.boot.CfEnvProcessor
26-Feb-2019 00:00:51 Caused by: java.lang.ClassNotFoundException: io.pivotal.cfenv.sso.CfSingleSignOnProcessor
26-Feb-2019 00:00:51
26-Feb-2019 00:00:51 [ERROR] findByNameQueries(org.springframework.cloud.skipper.server.repository.PackageMetadataRepositoryTests)  Time elapsed: 0 s  <<< ERROR!
26-Feb-2019 00:00:51 java.lang.IllegalStateException: Failed to load ApplicationContext
26-Feb-2019 00:00:51 Caused by: java.lang.IllegalArgumentException: Unable to instantiate factory class: io.pivotal.cfenv.spring.boot.CfEnvProcessor
26-Feb-2019 00:00:51 Caused by: java.lang.ClassNotFoundException: io.pivotal.cfenv.sso.CfSingleSignOnProcessor
26-Feb-2019 00:00:51
26-Feb-2019 00:00:51 [INFO] Running org.springframework.cloud.skipper.server.repository.SchemaGenerationTests
26-Feb-2019 00:00:51 00:00:51.688 [main] DEBUG org.springframework.test.context.junit4.SpringJUnit4ClassRunner - SpringJUnit4ClassRunner constructor called with [class org.springframework.cloud.skipper.server.repository.SchemaGenerationTests]
26-Feb-2019 00:00:51 00:00:51.689 [main] DEBUG org.springframework.test.context.BootstrapUtils - Instantiating CacheAwareContextLoaderDelegate from class [org.springframework.test.context.cache.DefaultCacheAwareContextLoaderDelegate]
26-Feb-2019 00:00:51 00:00:51.689 [main] DEBUG org.springframework.test.context.BootstrapUtils - Instantiating BootstrapContext using constructor [public org.springframework.test.context.support.DefaultBootstrapContext(java.lang.Class,org.springframework.test.context.CacheAwareContextLoaderDelegate)]
26-Feb-2019 00:00:51 00:00:51.689 [main] DEBUG org.springframework.test.context.BootstrapUtils - Instantiating TestContextBootstrapper for test class [org.springframework.cloud.skipper.server.repository.SchemaGenerationTests] from class [org.springframework.boot.test.context.SpringBootTestContextBootstrapper]
26-Feb-2019 00:00:51 00:00:51.689 [main] INFO org.springframework.boot.test.context.SpringBootTestContextBootstrapper - Neither @ContextConfiguration nor @ContextHierarchy found for test class [org.springframework.cloud.skipper.server.repository.SchemaGenerationTests], using SpringBootContextLoader
26-Feb-2019 00:00:51 00:00:51.689 [main] DEBUG org.springframework.test.context.support.AbstractContextLoader - Did not detect default resource location for test class [org.springframework.cloud.skipper.server.repository.SchemaGenerationTests]: class path resource [org/springframework/cloud/skipper/server/repository/SchemaGenerationTests-context.xml] does not exist
26-Feb-2019 00:00:51 00:00:51.689 [main] DEBUG org.springframework.test.context.support.AbstractContextLoader - Did not detect default resource location for test class [org.springframework.cloud.skipper.server.repository.SchemaGenerationTests]: class path resource [org/springframework/cloud/skipper/server/repository/SchemaGenerationTestsContext.groovy] does not exist
26-Feb-2019 00:00:51 00:00:51.690 [main] INFO org.springframework.test.context.support.AbstractContextLoader - Could not detect default resource locations for test class [org.springframework.cloud.skipper.server.repository.SchemaGenerationTests]: no resource found for suffixes {-context.xml, Context.groovy}.
26-Feb-2019 00:00:51 00:00:51.691 [main] DEBUG org.springframework.boot.test.context.SpringBootTestContextBootstrapper - @TestExecutionListeners is not present for class [org.springframework.cloud.skipper.server.repository.SchemaGenerationTests]: using defaults.
26-Feb-2019 00:00:51 00:00:51.692 [main] INFO org.springframework.boot.test.context.SpringBootTestContextBootstrapper - Loaded default TestExecutionListener class names from location [META-INF/spring.factories]: [org.springframework.test.context.web.ServletTestExecutionListener, org.springframework.test.context.support.DirtiesContextBeforeModesTestExecutionListener, org.springframework.test.context.support.DependencyInjectionTestExecutionListener, org.springframework.test.context.support.DirtiesContextTestExecutionListener, org.springframework.test.context.transaction.TransactionalTestExecutionListener, org.springframework.test.context.jdbc.SqlScriptsTestExecutionListener, org.springframework.boot.test.mock.mockito.MockitoTestExecutionListener, org.springframework.boot.test.mock.mockito.ResetMocksTestExecutionListener, org.springframework.boot.test.autoconfigure.restdocs.RestDocsTestExecutionListener, org.springframework.boot.test.autoconfigure.web.client.MockRestServiceServerResetTestExecutionListener, org.springframework.boot.test.autoconfigure.web.servlet.MockMvcPrintOnlyOnFailureTestExecutionListener, org.springframework.boot.test.autoconfigure.web.servlet.WebDriverTestExecutionListener]
26-Feb-2019 00:00:51 00:00:51.692 [main] INFO org.springframework.boot.test.context.SpringBootTestContextBootstrapper - Using TestExecutionListeners: [org.springframework.test.context.web.ServletTestExecutionListener@3368136a, org.springframework.test.context.support.DirtiesContextBeforeModesTestExecutionListener@21dcd0b5, org.springframework.boot.test.mock.mockito.MockitoTestExecutionListener@ff8fe1f, org.springframework.boot.test.autoconfigure.SpringBootDependencyInjectionTestExecutionListener@730fcd33, org.springframework.test.context.support.DirtiesContextTestExecutionListener@f737b, org.springframework.test.context.transaction.TransactionalTestExecutionListener@471142b7, org.springframework.test.context.jdbc.SqlScriptsTestExecutionListener@fd1544c, org.springframework.boot.test.mock.mockito.ResetMocksTestExecutionListener@2ba66d0, org.springframework.boot.test.autoconfigure.restdocs.RestDocsTestExecutionListener@79d55957, org.springframework.boot.test.autoconfigure.web.client.MockRestServiceServerResetTestExecutionListener@349cb820, org.springframework.boot.test.autoconfigure.web.servlet.MockMvcPrintOnlyOnFailureTestExecutionListener@316ae9cb, org.springframework.boot.test.autoconfigure.web.servlet.WebDriverTestExecutionListener@603785d0]
26-Feb-2019 00:00:51 00:00:51.692 [main] DEBUG org.springframework.test.annotation.ProfileValueUtils - Retrieved @ProfileValueSourceConfiguration [null] for test class [org.springframework.cloud.skipper.server.repository.SchemaGenerationTests]
26-Feb-2019 00:00:51 00:00:51.692 [main] DEBUG org.springframework.test.annotation.ProfileValueUtils - Retrieved ProfileValueSource type [class org.springframework.test.annotation.SystemProfileValueSource] for class [org.springframework.cloud.skipper.server.repository.SchemaGenerationTests]
26-Feb-2019 00:00:51 00:00:51.692 [main] DEBUG org.springframework.test.annotation.ProfileValueUtils - Retrieved @ProfileValueSourceConfiguration [null] for test class [org.springframework.cloud.skipper.server.repository.SchemaGenerationTests]
26-Feb-2019 00:00:51 00:00:51.692 [main] DEBUG org.springframework.test.annotation.ProfileValueUtils - Retrieved ProfileValueSource type [class org.springframework.test.annotation.SystemProfileValueSource] for class [org.springframework.cloud.skipper.server.repository.SchemaGenerationTests]
26-Feb-2019 00:00:51 00:00:51.692 [main] DEBUG org.springframework.test.annotation.ProfileValueUtils - Retrieved @ProfileValueSourceConfiguration [null] for test class [org.springframework.cloud.skipper.server.repository.SchemaGenerationTests]
26-Feb-2019 00:00:51 00:00:51.692 [main] DEBUG org.springframework.test.annotation.ProfileValueUtils - Retrieved ProfileValueSource type [class org.springframework.test.annotation.SystemProfileValueSource] for class [org.springframework.cloud.skipper.server.repository.SchemaGenerationTests]
26-Feb-2019 00:00:51 00:00:51.692 [main] DEBUG org.springframework.test.context.support.AbstractDirtiesContextTestExecutionListener - Before test class: context [DefaultTestContext@337b6760 testClass = SchemaGenerationTests, testInstance = [null], testMethod = [null], testException = [null], mergedContextConfiguration = [WebMergedContextConfiguration@62779497 testClass = SchemaGenerationTests, locations = '{}', classes = '{class org.springframework.cloud.skipper.server.AbstractIntegrationTest$TestConfig, class org.springframework.cloud.skipper.server.AbstractIntegrationTest$TestConfig}', contextInitializerClasses = '[]', activeProfiles = '{repo-test}', propertySourceLocations = '{}', propertySourceProperties = '{spring.main.allow-bean-definition-overriding=true, org.springframework.boot.test.context.SpringBootTestContextBootstrapper=true}', contextCustomizers = set[org.springframework.boot.test.context.filter.ExcludeFilterContextCustomizer@55d58825, org.springframework.boot.test.json.DuplicateJsonObjectContextCustomizerFactory$DuplicateJsonObjectContextCustomizer@663bb8ef, org.springframework.boot.test.mock.mockito.MockitoContextCustomizer@0, org.springframework.boot.test.web.client.TestRestTemplateContextCustomizer@2c88a3e8, org.springframework.boot.test.autoconfigure.properties.PropertyMappingContextCustomizer@0, org.springframework.boot.test.autoconfigure.web.servlet.WebDriverContextCustomizerFactory$Customizer@22a10ac6], resourceBasePath = 'src/main/webapp', contextLoader = 'org.springframework.boot.test.context.SpringBootContextLoader', parent = [null]], attributes = map['org.springframework.test.context.web.ServletTestExecutionListener.activateListener' -> true]], class annotated with @DirtiesContext [true] with mode [BEFORE_CLASS].
26-Feb-2019 00:00:51 00:00:51.692 [main] DEBUG org.springframework.test.annotation.ProfileValueUtils - Retrieved @ProfileValueSourceConfiguration [null] for test class [org.springframework.cloud.skipper.server.repository.SchemaGenerationTests]
26-Feb-2019 00:00:51 00:00:51.692 [main] DEBUG org.springframework.test.annotation.ProfileValueUtils - Retrieved ProfileValueSource type [class org.springframework.test.annotation.SystemProfileValueSource] for class [org.springframework.cloud.skipper.server.repository.SchemaGenerationTests]
26-Feb-2019 00:00:51 00:00:51.693 [main] DEBUG org.springframework.test.context.support.TestPropertySourceUtils - Adding inlined properties to environment: {spring.jmx.enabled=false, spring.main.allow-bean-definition-overriding=true, org.springframework.boot.test.context.SpringBootTestContextBootstrapper=true, server.port=-1}
26-Feb-2019 00:00:51 00:00:51.701 [main] DEBUG org.springframework.boot.context.logging.ClasspathLoggingApplicationListener - Application failed to start with classpath: [file:/opt/bamboo-home/xml-data/build-dir/SCSKIP-BMASTER-JOB1/spring-cloud-skipper-server-core/target/surefire/surefirebooter3109259931034045945.jar, file:/opt/users/bamboo/.m2/repository/org/jacoco/org.jacoco.agent/0.7.9/org.jacoco.agent-0.7.9-runtime.jar]
26-Feb-2019 00:00:51 00:00:51.701 [main] ERROR org.springframework.boot.SpringApplication - Application run failed
26-Feb-2019 00:00:51 java.lang.IllegalArgumentException: Unable to instantiate factory class: io.pivotal.cfenv.spring.boot.CfEnvProcessor
26-Feb-2019 00:00:51         at org.springframework.core.io.support.SpringFactoriesLoader.instantiateFactory(SpringFactoriesLoader.java:167)
26-Feb-2019 00:00:51         at org.springframework.core.io.support.SpringFactoriesLoader.loadFactories(SpringFactoriesLoader.java:104)
26-Feb-2019 00:00:51         at io.pivotal.cfenv.spring.boot.CfEnvironmentPostProcessor.loadCfEnvProcessors(CfEnvironmentPostProcessor.java:144)
26-Feb-2019 00:00:51         at io.pivotal.cfenv.spring.boot.CfEnvironmentPostProcessor.onApplicationEvent(CfEnvironmentPostProcessor.java:134)
26-Feb-2019 00:00:51         at org.springframework.context.event.SimpleApplicationEventMulticaster.doInvokeListener(SimpleApplicationEventMulticaster.java:172)
26-Feb-2019 00:00:51         at org.springframework.context.event.SimpleApplicationEventMulticaster.invokeListener(SimpleApplicationEventMulticaster.java:165)
26-Feb-2019 00:00:51         at org.springframework.context.event.SimpleApplicationEventMulticaster.multicastEvent(SimpleApplicationEventMulticaster.java:139)
26-Feb-2019 00:00:51         at org.springframework.context.event.SimpleApplicationEventMulticaster.multicastEvent(SimpleApplicationEventMulticaster.java:127)
26-Feb-2019 00:00:51         at org.springframework.boot.context.event.EventPublishingRunListener.environmentPrepared(EventPublishingRunListener.java:75)
26-Feb-2019 00:00:51         at org.springframework.boot.SpringApplicationRunListeners.environmentPrepared(SpringApplicationRunListeners.java:54)
26-Feb-2019 00:00:51         at org.springframework.boot.SpringApplication.prepareEnvironment(SpringApplication.java:347)
26-Feb-2019 00:00:51         at org.springframework.boot.SpringApplication.run(SpringApplication.java:306)
26-Feb-2019 00:00:51         at org.springframework.boot.builder.SpringApplicationBuilder.run(SpringApplicationBuilder.java:139)
26-Feb-2019 00:00:51         at org.springframework.cloud.bootstrap.BootstrapApplicationListener.bootstrapServiceContext(BootstrapApplicationListener.java:191)
26-Feb-2019 00:00:51         at org.springframework.cloud.bootstrap.BootstrapApplicationListener.onApplicationEvent(BootstrapApplicationListener.java:105)
26-Feb-2019 00:00:51         at org.springframework.cloud.bootstrap.BootstrapApplicationListener.onApplicationEvent(BootstrapApplicationListener.java:71)
26-Feb-2019 00:00:51         at org.springframework.context.event.SimpleApplicationEventMulticaster.doInvokeListener(SimpleApplicationEventMulticaster.java:172)
26-Feb-2019 00:00:51         at org.springframework.context.event.SimpleApplicationEventMulticaster.invokeListener(SimpleApplicationEventMulticaster.java:165)
26-Feb-2019 00:00:51         at org.springframework.context.event.SimpleApplicationEventMulticaster.multicastEvent(SimpleApplicationEventMulticaster.java:139)
26-Feb-2019 00:00:51         at org.springframework.context.event.SimpleApplicationEventMulticaster.multicastEvent(SimpleApplicationEventMulticaster.java:127)
26-Feb-2019 00:00:51         at org.springframework.boot.context.event.EventPublishingRunListener.environmentPrepared(EventPublishingRunListener.java:75)
26-Feb-2019 00:00:51         at org.springframework.boot.SpringApplicationRunListeners.environmentPrepared(SpringApplicationRunListeners.java:54)
26-Feb-2019 00:00:51         at org.springframework.boot.SpringApplication.prepareEnvironment(SpringApplication.java:347)
26-Feb-2019 00:00:51         at org.springframework.boot.SpringApplication.run(SpringApplication.java:306)
26-Feb-2019 00:00:51         at org.springframework.boot.test.context.SpringBootContextLoader.loadContext(SpringBootContextLoader.java:127)
26-Feb-2019 00:00:51         at org.springframework.test.context.cache.DefaultCacheAwareContextLoaderDelegate.loadContextInternal(DefaultCacheAwareContextLoaderDelegate.java:99)
26-Feb-2019 00:00:51         at org.springframework.test.context.cache.DefaultCacheAwareContextLoaderDelegate.loadContext(DefaultCacheAwareContextLoaderDelegate.java:117)
26-Feb-2019 00:00:51         at org.springframework.test.context.support.DefaultTestContext.getApplicationContext(DefaultTestContext.java:108)
26-Feb-2019 00:00:51         at org.springframework.test.context.web.ServletTestExecutionListener.setUpRequestContextIfNecessary(ServletTestExecutionListener.java:190)
26-Feb-2019 00:00:51         at org.springframework.test.context.web.ServletTestExecutionListener.prepareTestInstance(ServletTestExecutionListener.java:132)
26-Feb-2019 00:00:51         at org.springframework.test.context.TestContextManager.prepareTestInstance(TestContextManager.java:246)
26-Feb-2019 00:00:51         at org.springframework.test.context.junit4.SpringJUnit4ClassRunner.createTest(SpringJUnit4ClassRunner.java:227)
26-Feb-2019 00:00:51         at org.springframework.test.context.junit4.SpringJUnit4ClassRunner$1.runReflectiveCall(SpringJUnit4ClassRunner.java:289)
26-Feb-2019 00:00:51         at org.junit.internal.runners.model.ReflectiveCallable.run(ReflectiveCallable.java:12)
26-Feb-2019 00:00:51         at org.springframework.test.context.junit4.SpringJUnit4ClassRunner.methodBlock(SpringJUnit4ClassRunner.java:291)
26-Feb-2019 00:00:51         at org.springframework.test.context.junit4.SpringJUnit4ClassRunner.runChild(SpringJUnit4ClassRunner.java:246)
26-Feb-2019 00:00:51         at org.springframework.test.context.junit4.SpringJUnit4ClassRunner.runChild(SpringJUnit4ClassRunner.java:97)
26-Feb-2019 00:00:51         at org.junit.runners.ParentRunner$3.run(ParentRunner.java:290)
26-Feb-2019 00:00:51         at org.junit.runners.ParentRunner$1.schedule(ParentRunner.java:71)
26-Feb-2019 00:00:51         at org.junit.runners.ParentRunner.runChildren(ParentRunner.java:288)
26-Feb-2019 00:00:51         at org.junit.runners.ParentRunner.access$000(ParentRunner.java:58)
26-Feb-2019 00:00:51         at org.junit.runners.ParentRunner$2.evaluate(ParentRunner.java:268)
26-Feb-2019 00:00:51         at org.springframework.test.context.junit4.statements.RunBeforeTestClassCallbacks.evaluate(RunBeforeTestClassCallbacks.java:61)
26-Feb-2019 00:00:51         at org.springframework.test.context.junit4.statements.RunAfterTestClassCallbacks.evaluate(RunAfterTestClassCallbacks.java:70)
26-Feb-2019 00:00:51         at org.junit.runners.ParentRunner.run(ParentRunner.java:363)
26-Feb-2019 00:00:51         at org.springframework.test.context.junit4.SpringJUnit4ClassRunner.run(SpringJUnit4ClassRunner.java:190)
26-Feb-2019 00:00:51         at org.apache.maven.surefire.junit4.JUnit4Provider.execute(JUnit4Provider.java:365)
26-Feb-2019 00:00:51         at org.apache.maven.surefire.junit4.JUnit4Provider.executeWithRerun(JUnit4Provider.java:272)
26-Feb-2019 00:00:51         at org.apache.maven.surefire.junit4.JUnit4Provider.executeTestSet(JUnit4Provider.java:236)
26-Feb-2019 00:00:51         at org.apache.maven.surefire.junit4.JUnit4Provider.invoke(JUnit4Provider.java:159)
26-Feb-2019 00:00:51         at org.apache.maven.surefire.booter.ForkedBooter.invokeProviderInSameClassLoader(ForkedBooter.java:386)
26-Feb-2019 00:00:51         at org.apache.maven.surefire.booter.ForkedBooter.runSuitesInProcess(ForkedBooter.java:323)
26-Feb-2019 00:00:51         at org.apache.maven.surefire.booter.ForkedBooter.main(ForkedBooter.java:143)
26-Feb-2019 00:00:51 Caused by: java.lang.ClassNotFoundException: io.pivotal.cfenv.sso.CfSingleSignOnProcessor
26-Feb-2019 00:00:51         at java.net.URLClassLoader.findClass(URLClassLoader.java:381)
26-Feb-2019 00:00:51         at java.lang.ClassLoader.loadClass(ClassLoader.java:424)
26-Feb-2019 00:00:51         at sun.misc.Launcher$AppClassLoader.loadClass(Launcher.java:335)
26-Feb-2019 00:00:51         at java.lang.ClassLoader.loadClass(ClassLoader.java:357)
26-Feb-2019 00:00:51         at java.lang.Class.forName0(Native Method)
26-Feb-2019 00:00:51         at java.lang.Class.forName(Class.java:348)
26-Feb-2019 00:00:51         at org.springframework.util.ClassUtils.forName(ClassUtils.java:275)
26-Feb-2019 00:00:51         at org.springframework.core.io.support.SpringFactoriesLoader.instantiateFactory(SpringFactoriesLoader.java:159)
26-Feb-2019 00:00:51         ... 52 common frames omitted
26-Feb-2019 00:00:51 00:00:51.701 [main] ERROR org.springframework.test.context.TestContextManager - Caught exception while allowing TestExecutionListener [org.springframework.test.context.web.ServletTestExecutionListener@3368136a] to prepare test instance [org.springframework.cloud.skipper.server.repository.SchemaGenerationTests@96c36db]
26-Feb-2019 00:00:51 java.lang.IllegalStateException: Failed to load ApplicationContext
26-Feb-2019 00:00:51         at org.springframework.test.context.cache.DefaultCacheAwareContextLoaderDelegate.loadContext(DefaultCacheAwareContextLoaderDelegate.java:125)
26-Feb-2019 00:00:51         at org.springframework.test.context.support.DefaultTestContext.getApplicationContext(DefaultTestContext.java:108)
26-Feb-2019 00:00:51         at org.springframework.test.context.web.ServletTestExecutionListener.setUpRequestContextIfNecessary(ServletTestExecutionListener.java:190)
26-Feb-2019 00:00:51         at org.springframework.test.context.web.ServletTestExecutionListener.prepareTestInstance(ServletTestExecutionListener.java:132)
26-Feb-2019 00:00:51         at org.springframework.test.context.TestContextManager.prepareTestInstance(TestContextManager.java:246)
26-Feb-2019 00:00:51         at org.springframework.test.context.junit4.SpringJUnit4ClassRunner.createTest(SpringJUnit4ClassRunner.java:227)
26-Feb-2019 00:00:51         at org.springframework.test.context.junit4.SpringJUnit4ClassRunner$1.runReflectiveCall(SpringJUnit4ClassRunner.java:289)
26-Feb-2019 00:00:51         at org.junit.internal.runners.model.ReflectiveCallable.run(ReflectiveCallable.java:12)
26-Feb-2019 00:00:51         at org.springframework.test.context.junit4.SpringJUnit4ClassRunner.methodBlock(SpringJUnit4ClassRunner.java:291)
26-Feb-2019 00:00:51         at org.springframework.test.context.junit4.SpringJUnit4ClassRunner.runChild(SpringJUnit4ClassRunner.java:246)
26-Feb-2019 00:00:51         at org.springframework.test.context.junit4.SpringJUnit4ClassRunner.runChild(SpringJUnit4ClassRunner.java:97)
26-Feb-2019 00:00:51         at org.junit.runners.ParentRunner$3.run(ParentRunner.java:290)
26-Feb-2019 00:00:51         at org.junit.runners.ParentRunner$1.schedule(ParentRunner.java:71)
26-Feb-2019 00:00:51         at org.junit.runners.ParentRunner.runChildren(ParentRunner.java:288)
26-Feb-2019 00:00:51         at org.junit.runners.ParentRunner.access$000(ParentRunner.java:58)
26-Feb-2019 00:00:51         at org.junit.runners.ParentRunner$2.evaluate(ParentRunner.java:268)
26-Feb-2019 00:00:51         at org.springframework.test.context.junit4.statements.RunBeforeTestClassCallbacks.evaluate(RunBeforeTestClassCallbacks.java:61)
26-Feb-2019 00:00:51         at org.springframework.test.context.junit4.statements.RunAfterTestClassCallbacks.evaluate(RunAfterTestClassCallbacks.java:70)
26-Feb-2019 00:00:51         at org.junit.runners.ParentRunner.run(ParentRunner.java:363)
26-Feb-2019 00:00:51         at org.springframework.test.context.junit4.SpringJUnit4ClassRunner.run(SpringJUnit4ClassRunner.java:190)
26-Feb-2019 00:00:51         at org.apache.maven.surefire.junit4.JUnit4Provider.execute(JUnit4Provider.java:365)
26-Feb-2019 00:00:51         at org.apache.maven.surefire.junit4.JUnit4Provider.executeWithRerun(JUnit4Provider.java:272)
26-Feb-2019 00:00:51         at org.apache.maven.surefire.junit4.JUnit4Provider.executeTestSet(JUnit4Provider.java:236)
26-Feb-2019 00:00:51         at org.apache.maven.surefire.junit4.JUnit4Provider.invoke(JUnit4Provider.java:159)
26-Feb-2019 00:00:51         at org.apache.maven.surefire.booter.ForkedBooter.invokeProviderInSameClassLoader(ForkedBooter.java:386)
26-Feb-2019 00:00:51         at org.apache.maven.surefire.booter.ForkedBooter.runSuitesInProcess(ForkedBooter.java:323)
26-Feb-2019 00:00:51         at org.apache.maven.surefire.booter.ForkedBooter.main(ForkedBooter.java:143)
26-Feb-2019 00:00:51 Caused by: java.lang.IllegalArgumentException: Unable to instantiate factory class: io.pivotal.cfenv.spring.boot.CfEnvProcessor
26-Feb-2019 00:00:51         at org.springframework.core.io.support.SpringFactoriesLoader.instantiateFactory(SpringFactoriesLoader.java:167)
26-Feb-2019 00:00:51         at org.springframework.core.io.support.SpringFactoriesLoader.loadFactories(SpringFactoriesLoader.java:104)
26-Feb-2019 00:00:51         at io.pivotal.cfenv.spring.boot.CfEnvironmentPostProcessor.loadCfEnvProcessors(CfEnvironmentPostProcessor.java:144)
26-Feb-2019 00:00:51         at io.pivotal.cfenv.spring.boot.CfEnvironmentPostProcessor.onApplicationEvent(CfEnvironmentPostProcessor.java:134)
26-Feb-2019 00:00:51         at org.springframework.context.event.SimpleApplicationEventMulticaster.doInvokeListener(SimpleApplicationEventMulticaster.java:172)
26-Feb-2019 00:00:51         at org.springframework.context.event.SimpleApplicationEventMulticaster.invokeListener(SimpleApplicationEventMulticaster.java:165)
26-Feb-2019 00:00:51         at org.springframework.context.event.SimpleApplicationEventMulticaster.multicastEvent(SimpleApplicationEventMulticaster.java:139)
26-Feb-2019 00:00:51         at org.springframework.context.event.SimpleApplicationEventMulticaster.multicastEvent(SimpleApplicationEventMulticaster.java:127)
26-Feb-2019 00:00:51         at org.springframework.boot.context.event.EventPublishingRunListener.environmentPrepared(EventPublishingRunListener.java:75)
26-Feb-2019 00:00:51         at org.springframework.boot.SpringApplicationRunListeners.environmentPrepared(SpringApplicationRunListeners.java:54)
26-Feb-2019 00:00:51         at org.springframework.boot.SpringApplication.prepareEnvironment(SpringApplication.java:347)
26-Feb-2019 00:00:51         at org.springframework.boot.SpringApplication.run(SpringApplication.java:306)
26-Feb-2019 00:00:51         at org.springframework.boot.builder.SpringApplicationBuilder.run(SpringApplicationBuilder.java:139)
26-Feb-2019 00:00:51         at org.springframework.cloud.bootstrap.BootstrapApplicationListener.bootstrapServiceContext(BootstrapApplicationListener.java:191)
26-Feb-2019 00:00:51         at org.springframework.cloud.bootstrap.BootstrapApplicationListener.onApplicationEvent(BootstrapApplicationListener.java:105)
26-Feb-2019 00:00:51         at org.springframework.cloud.bootstrap.BootstrapApplicationListener.onApplicationEvent(BootstrapApplicationListener.java:71)
26-Feb-2019 00:00:51         at org.springframework.context.event.SimpleApplicationEventMulticaster.doInvokeListener(SimpleApplicationEventMulticaster.java:172)
26-Feb-2019 00:00:51         at org.springframework.context.event.SimpleApplicationEventMulticaster.invokeListener(SimpleApplicationEventMulticaster.java:165)
26-Feb-2019 00:00:51         at org.springframework.context.event.SimpleApplicationEventMulticaster.multicastEvent(SimpleApplicationEventMulticaster.java:139)
26-Feb-2019 00:00:51         at org.springframework.context.event.SimpleApplicationEventMulticaster.multicastEvent(SimpleApplicationEventMulticaster.java:127)
26-Feb-2019 00:00:51         at org.springframework.boot.context.event.EventPublishingRunListener.environmentPrepared(EventPublishingRunListener.java:75)
26-Feb-2019 00:00:51         at org.springframework.boot.SpringApplicationRunListeners.environmentPrepared(SpringApplicationRunListeners.java:54)
26-Feb-2019 00:00:51         at org.springframework.boot.SpringApplication.prepareEnvironment(SpringApplication.java:347)
26-Feb-2019 00:00:51         at org.springframework.boot.SpringApplication.run(SpringApplication.java:306)
26-Feb-2019 00:00:51         at org.springframework.boot.test.context.SpringBootContextLoader.loadContext(SpringBootContextLoader.java:127)
26-Feb-2019 00:00:51         at org.springframework.test.context.cache.DefaultCacheAwareContextLoaderDelegate.loadContextInternal(DefaultCacheAwareContextLoaderDelegate.java:99)
26-Feb-2019 00:00:51         at org.springframework.test.context.cache.DefaultCacheAwareContextLoaderDelegate.loadContext(DefaultCacheAwareContextLoaderDelegate.java:117)
26-Feb-2019 00:00:51         ... 26 common frames omitted
26-Feb-2019 00:00:51 Caused by: java.lang.ClassNotFoundException: io.pivotal.cfenv.sso.CfSingleSignOnProcessor
26-Feb-2019 00:00:51         at java.net.URLClassLoader.findClass(URLClassLoader.java:381)
26-Feb-2019 00:00:51         at java.lang.ClassLoader.loadClass(ClassLoader.java:424)
26-Feb-2019 00:00:51         at sun.misc.Launcher$AppClassLoader.loadClass(Launcher.java:335)
26-Feb-2019 00:00:51         at java.lang.ClassLoader.loadClass(ClassLoader.java:357)
26-Feb-2019 00:00:51         at java.lang.Class.forName0(Native Method)
26-Feb-2019 00:00:51         at java.lang.Class.forName(Class.java:348)
26-Feb-2019 00:00:51         at org.springframework.util.ClassUtils.forName(ClassUtils.java:275)
26-Feb-2019 00:00:51         at org.springframework.core.io.support.SpringFactoriesLoader.instantiateFactory(SpringFactoriesLoader.java:159)
26-Feb-2019 00:00:51         ... 52 common frames omitted
26-Feb-2019 00:00:51 00:00:51.701 [main] DEBUG org.springframework.test.context.support.AbstractDirtiesContextTestExecutionListener - After test class: context [DefaultTestContext@337b6760 testClass = SchemaGenerationTests, testInstance = [null], testMethod = [null], testException = [null], mergedContextConfiguration = [WebMergedContextConfiguration@62779497 testClass = SchemaGenerationTests, locations = '{}', classes = '{class org.springframework.cloud.skipper.server.AbstractIntegrationTest$TestConfig, class org.springframework.cloud.skipper.server.AbstractIntegrationTest$TestConfig}', contextInitializerClasses = '[]', activeProfiles = '{repo-test}', propertySourceLocations = '{}', propertySourceProperties = '{spring.main.allow-bean-definition-overriding=true, org.springframework.boot.test.context.SpringBootTestContextBootstrapper=true}', contextCustomizers = set[org.springframework.boot.test.context.filter.ExcludeFilterContextCustomizer@55d58825, org.springframework.boot.test.json.DuplicateJsonObjectContextCustomizerFactory$DuplicateJsonObjectContextCustomizer@663bb8ef, org.springframework.boot.test.mock.mockito.MockitoContextCustomizer@0, org.springframework.boot.test.web.client.TestRestTemplateContextCustomizer@2c88a3e8, org.springframework.boot.test.autoconfigure.properties.PropertyMappingContextCustomizer@0, org.springframework.boot.test.autoconfigure.web.servlet.WebDriverContextCustomizerFactory$Customizer@22a10ac6], resourceBasePath = 'src/main/webapp', contextLoader = 'org.springframework.boot.test.context.SpringBootContextLoader', parent = [null]], attributes = map['org.springframework.test.context.web.ServletTestExecutionListener.activateListener' -> true, 'org.springframework.test.context.support.DependencyInjectionTestExecutionListener.reinjectDependencies' -> true]], class annotated with @DirtiesContext [true] with mode [BEFORE_CLASS].
26-Feb-2019 00:00:51 [ERROR] Tests run: 1, Failures: 0, Errors: 1, Skipped: 0, Time elapsed: 0.001 s <<< FAILURE! - in org.springframework.cloud.skipper.server.repository.SchemaGenerationTests
26-Feb-2019 00:00:51 [ERROR] generateSchemaDdlFiles(org.springframework.cloud.skipper.server.repository.SchemaGenerationTests)  Time elapsed: 0 s  <<< ERROR!
26-Feb-2019 00:00:51 java.lang.IllegalStateException: Failed to load ApplicationContext
26-Feb-2019 00:00:51 Caused by: java.lang.IllegalArgumentException: Unable to instantiate factory class: io.pivotal.cfenv.spring.boot.CfEnvProcessor
26-Feb-2019 00:00:51 Caused by: java.lang.ClassNotFoundException: io.pivotal.cfenv.sso.CfSingleSignOnProcessor
26-Feb-2019 00:00:51
26-Feb-2019 00:00:51 [INFO] Running org.springframework.cloud.skipper.server.repository.PackageMetadataMvcTests
26-Feb-2019 00:00:51 00:00:51.702 [main] DEBUG org.springframework.test.context.junit4.SpringJUnit4ClassRunner - SpringJUnit4ClassRunner constructor called with [class org.springframework.cloud.skipper.server.repository.PackageMetadataMvcTests]
26-Feb-2019 00:00:51 00:00:51.702 [main] DEBUG org.springframework.test.context.BootstrapUtils - Instantiating CacheAwareContextLoaderDelegate from class [org.springframework.test.context.cache.DefaultCacheAwareContextLoaderDelegate]
26-Feb-2019 00:00:51 00:00:51.702 [main] DEBUG org.springframework.test.context.BootstrapUtils - Instantiating BootstrapContext using constructor [public org.springframework.test.context.support.DefaultBootstrapContext(java.lang.Class,org.springframework.test.context.CacheAwareContextLoaderDelegate)]
26-Feb-2019 00:00:51 00:00:51.702 [main] DEBUG org.springframework.test.context.BootstrapUtils - Instantiating TestContextBootstrapper for test class [org.springframework.cloud.skipper.server.repository.PackageMetadataMvcTests] from class [org.springframework.boot.test.context.SpringBootTestContextBootstrapper]
26-Feb-2019 00:00:51 00:00:51.702 [main] INFO org.springframework.boot.test.context.SpringBootTestContextBootstrapper - Neither @ContextConfiguration nor @ContextHierarchy found for test class [org.springframework.cloud.skipper.server.repository.PackageMetadataMvcTests], using SpringBootContextLoader
26-Feb-2019 00:00:51 00:00:51.703 [main] DEBUG org.springframework.test.context.support.AbstractContextLoader - Did not detect default resource location for test class [org.springframework.cloud.skipper.server.repository.PackageMetadataMvcTests]: class path resource [org/springframework/cloud/skipper/server/repository/PackageMetadataMvcTests-context.xml] does not exist
26-Feb-2019 00:00:51 00:00:51.703 [main] DEBUG org.springframework.test.context.support.AbstractContextLoader - Did not detect default resource location for test class [org.springframework.cloud.skipper.server.repository.PackageMetadataMvcTests]: class path resource [org/springframework/cloud/skipper/server/repository/PackageMetadataMvcTestsContext.groovy] does not exist
26-Feb-2019 00:00:51 00:00:51.703 [main] INFO org.springframework.test.context.support.AbstractContextLoader - Could not detect default resource locations for test class [org.springframework.cloud.skipper.server.repository.PackageMetadataMvcTests]: no resource found for suffixes {-context.xml, Context.groovy}.
26-Feb-2019 00:00:51 00:00:51.704 [main] DEBUG org.springframework.test.context.support.ActiveProfilesUtils - Could not find an 'annotation declaring class' for annotation type [org.springframework.test.context.ActiveProfiles] and class [org.springframework.cloud.skipper.server.repository.PackageMetadataMvcTests]
26-Feb-2019 00:00:51 00:00:51.705 [main] DEBUG org.springframework.boot.test.context.SpringBootTestContextBootstrapper - @TestExecutionListeners is not present for class [org.springframework.cloud.skipper.server.repository.PackageMetadataMvcTests]: using defaults.
26-Feb-2019 00:00:51 00:00:51.705 [main] INFO org.springframework.boot.test.context.SpringBootTestContextBootstrapper - Loaded default TestExecutionListener class names from location [META-INF/spring.factories]: [org.springframework.test.context.web.ServletTestExecutionListener, org.springframework.test.context.support.DirtiesContextBeforeModesTestExecutionListener, org.springframework.test.context.support.DependencyInjectionTestExecutionListener, org.springframework.test.context.support.DirtiesContextTestExecutionListener, org.springframework.test.context.transaction.TransactionalTestExecutionListener, org.springframework.test.context.jdbc.SqlScriptsTestExecutionListener, org.springframework.boot.test.mock.mockito.MockitoTestExecutionListener, org.springframework.boot.test.mock.mockito.ResetMocksTestExecutionListener, org.springframework.boot.test.autoconfigure.restdocs.RestDocsTestExecutionListener, org.springframework.boot.test.autoconfigure.web.client.MockRestServiceServerResetTestExecutionListener, org.springframework.boot.test.autoconfigure.web.servlet.MockMvcPrintOnlyOnFailureTestExecutionListener, org.springframework.boot.test.autoconfigure.web.servlet.WebDriverTestExecutionListener]
26-Feb-2019 00:00:51 00:00:51.705 [main] INFO org.springframework.boot.test.context.SpringBootTestContextBootstrapper - Using TestExecutionListeners: [org.springframework.test.context.web.ServletTestExecutionListener@16347545, org.springframework.test.context.support.DirtiesContextBeforeModesTestExecutionListener@7e8653b6, org.springframework.boot.test.mock.mockito.MockitoTestExecutionListener@53f81eeb, org.springframework.boot.test.autoconfigure.SpringBootDependencyInjectionTestExecutionListener@598e7b84, org.springframework.test.context.support.DirtiesContextTestExecutionListener@6c25b3ad, org.springframework.test.context.transaction.TransactionalTestExecutionListener@20f2467c, org.springframework.test.context.jdbc.SqlScriptsTestExecutionListener@336e1bcf, org.springframework.boot.test.mock.mockito.ResetMocksTestExecutionListener@1916147d, org.springframework.boot.test.autoconfigure.restdocs.RestDocsTestExecutionListener@58ef7429, org.springframework.boot.test.autoconfigure.web.client.MockRestServiceServerResetTestExecutionListener@6a1c18ee, org.springframework.boot.test.autoconfigure.web.servlet.MockMvcPrintOnlyOnFailureTestExecutionListener@29efc601, org.springframework.boot.test.autoconfigure.web.servlet.WebDriverTestExecutionListener@f38abd]
26-Feb-2019 00:00:51 00:00:51.705 [main] DEBUG org.springframework.test.annotation.ProfileValueUtils - Retrieved @ProfileValueSourceConfiguration [null] for test class [org.springframework.cloud.skipper.server.repository.PackageMetadataMvcTests]
26-Feb-2019 00:00:51 00:00:51.706 [main] DEBUG org.springframework.test.annotation.ProfileValueUtils - Retrieved ProfileValueSource type [class org.springframework.test.annotation.SystemProfileValueSource] for class [org.springframework.cloud.skipper.server.repository.PackageMetadataMvcTests]
26-Feb-2019 00:00:51 00:00:51.706 [main] DEBUG org.springframework.test.annotation.ProfileValueUtils - Retrieved @ProfileValueSourceConfiguration [null] for test class [org.springframework.cloud.skipper.server.repository.PackageMetadataMvcTests]
26-Feb-2019 00:00:51 00:00:51.706 [main] DEBUG org.springframework.test.annotation.ProfileValueUtils - Retrieved ProfileValueSource type [class org.springframework.test.annotation.SystemProfileValueSource] for class [org.springframework.cloud.skipper.server.repository.PackageMetadataMvcTests]
26-Feb-2019 00:00:51 00:00:51.706 [main] DEBUG org.springframework.test.annotation.ProfileValueUtils - Retrieved @ProfileValueSourceConfiguration [null] for test class [org.springframework.cloud.skipper.server.repository.PackageMetadataMvcTests]
26-Feb-2019 00:00:51 00:00:51.706 [main] DEBUG org.springframework.test.annotation.ProfileValueUtils - Retrieved ProfileValueSource type [class org.springframework.test.annotation.SystemProfileValueSource] for class [org.springframework.cloud.skipper.server.repository.PackageMetadataMvcTests]
26-Feb-2019 00:00:51 00:00:51.706 [main] DEBUG org.springframework.test.context.support.AbstractDirtiesContextTestExecutionListener - Before test class: context [DefaultTestContext@239ee8b6 testClass = PackageMetadataMvcTests, testInstance = [null], testMethod = [null], testException = [null], mergedContextConfiguration = [WebMergedContextConfiguration@29cf4f43 testClass = PackageMetadataMvcTests, locations = '{}', classes = '{class org.springframework.cloud.skipper.server.AbstractMockMvcTests$TestConfig, class org.springframework.cloud.skipper.server.AbstractMockMvcTests$TestConfig}', contextInitializerClasses = '[]', activeProfiles = '{}', propertySourceLocations = '{}', propertySourceProperties = '{spring.main.allow-bean-definition-overriding=true, org.springframework.boot.test.context.SpringBootTestContextBootstrapper=true}', contextCustomizers = set[[ImportsContextCustomizer@7e475bb5 key = [org.springframework.boot.test.autoconfigure.web.servlet.MockMvcAutoConfiguration, org.springframework.boot.test.autoconfigure.web.servlet.MockMvcSecurityAutoConfiguration, org.springframework.boot.test.autoconfigure.web.servlet.MockMvcWebClientAutoConfiguration, org.springframework.boot.test.autoconfigure.web.servlet.MockMvcWebDriverAutoConfiguration]], org.springframework.boot.test.context.filter.ExcludeFilterContextCustomizer@55d58825, org.springframework.boot.test.json.DuplicateJsonObjectContextCustomizerFactory$DuplicateJsonObjectContextCustomizer@663bb8ef, org.springframework.boot.test.mock.mockito.MockitoContextCustomizer@0, org.springframework.boot.test.web.client.TestRestTemplateContextCustomizer@2c88a3e8, org.springframework.boot.test.autoconfigure.properties.PropertyMappingContextCustomizer@e7e8512, org.springframework.boot.test.autoconfigure.web.servlet.WebDriverContextCustomizerFactory$Customizer@22a10ac6], resourceBasePath = 'src/main/webapp', contextLoader = 'org.springframework.boot.test.context.SpringBootContextLoader', parent = [null]], attributes = map['org.springframework.test.context.web.ServletTestExecutionListener.activateListener' -> true]], class annotated with @DirtiesContext [true] with mode [BEFORE_EACH_TEST_METHOD].
26-Feb-2019 00:00:51 00:00:51.706 [main] DEBUG org.springframework.test.annotation.ProfileValueUtils - Retrieved @ProfileValueSourceConfiguration [null] for test class [org.springframework.cloud.skipper.server.repository.PackageMetadataMvcTests]
26-Feb-2019 00:00:51 00:00:51.706 [main] DEBUG org.springframework.test.annotation.ProfileValueUtils - Retrieved ProfileValueSource type [class org.springframework.test.annotation.SystemProfileValueSource] for class [org.springframework.cloud.skipper.server.repository.PackageMetadataMvcTests]
26-Feb-2019 00:00:51 00:00:51.707 [main] DEBUG org.springframework.test.context.support.TestPropertySourceUtils - Adding inlined properties to environment: {spring.jmx.enabled=false, spring.main.allow-bean-definition-overriding=true, org.springframework.boot.test.context.SpringBootTestContextBootstrapper=true, server.port=-1}
26-Feb-2019 00:00:51 00:00:51.713 [main] DEBUG org.springframework.boot.context.logging.ClasspathLoggingApplicationListener - Application failed to start with classpath: [file:/opt/bamboo-home/xml-data/build-dir/SCSKIP-BMASTER-JOB1/spring-cloud-skipper-server-core/target/surefire/surefirebooter3109259931034045945.jar, file:/opt/users/bamboo/.m2/repository/org/jacoco/org.jacoco.agent/0.7.9/org.jacoco.agent-0.7.9-runtime.jar]
26-Feb-2019 00:00:51 00:00:51.713 [main] ERROR org.springframework.boot.SpringApplication - Application run failed
26-Feb-2019 00:00:51 java.lang.IllegalArgumentException: Unable to instantiate factory class: io.pivotal.cfenv.spring.boot.CfEnvProcessor
26-Feb-2019 00:00:51         at org.springframework.core.io.support.SpringFactoriesLoader.instantiateFactory(SpringFactoriesLoader.java:167)
26-Feb-2019 00:00:51         at org.springframework.core.io.support.SpringFactoriesLoader.loadFactories(SpringFactoriesLoader.java:104)
26-Feb-2019 00:00:51         at io.pivotal.cfenv.spring.boot.CfEnvironmentPostProcessor.loadCfEnvProcessors(CfEnvironmentPostProcessor.java:144)
26-Feb-2019 00:00:51         at io.pivotal.cfenv.spring.boot.CfEnvironmentPostProcessor.onApplicationEvent(CfEnvironmentPostProcessor.java:134)
26-Feb-2019 00:00:51         at org.springframework.context.event.SimpleApplicationEventMulticaster.doInvokeListener(SimpleApplicationEventMulticaster.java:172)
26-Feb-2019 00:00:51         at org.springframework.context.event.SimpleApplicationEventMulticaster.invokeListener(SimpleApplicationEventMulticaster.java:165)
26-Feb-2019 00:00:51         at org.springframework.context.event.SimpleApplicationEventMulticaster.multicastEvent(SimpleApplicationEventMulticaster.java:139)
26-Feb-2019 00:00:51         at org.springframework.context.event.SimpleApplicationEventMulticaster.multicastEvent(SimpleApplicationEventMulticaster.java:127)
26-Feb-2019 00:00:51         at org.springframework.boot.context.event.EventPublishingRunListener.environmentPrepared(EventPublishingRunListener.java:75)
26-Feb-2019 00:00:51         at org.springframework.boot.SpringApplicationRunListeners.environmentPrepared(SpringApplicationRunListeners.java:54)
26-Feb-2019 00:00:51         at org.springframework.boot.SpringApplication.prepareEnvironment(SpringApplication.java:347)
26-Feb-2019 00:00:51         at org.springframework.boot.SpringApplication.run(SpringApplication.java:306)
26-Feb-2019 00:00:51         at org.springframework.boot.builder.SpringApplicationBuilder.run(SpringApplicationBuilder.java:139)
26-Feb-2019 00:00:51         at org.springframework.cloud.bootstrap.BootstrapApplicationListener.bootstrapServiceContext(BootstrapApplicationListener.java:191)
26-Feb-2019 00:00:51         at org.springframework.cloud.bootstrap.BootstrapApplicationListener.onApplicationEvent(BootstrapApplicationListener.java:105)
26-Feb-2019 00:00:51         at org.springframework.cloud.bootstrap.BootstrapApplicationListener.onApplicationEvent(BootstrapApplicationListener.java:71)
26-Feb-2019 00:00:51         at org.springframework.context.event.SimpleApplicationEventMulticaster.doInvokeListener(SimpleApplicationEventMulticaster.java:172)
26-Feb-2019 00:00:51         at org.springframework.context.event.SimpleApplicationEventMulticaster.invokeListener(SimpleApplicationEventMulticaster.java:165)
26-Feb-2019 00:00:51         at org.springframework.context.event.SimpleApplicationEventMulticaster.multicastEvent(SimpleApplicationEventMulticaster.java:139)
26-Feb-2019 00:00:51         at org.springframework.context.event.SimpleApplicationEventMulticaster.multicastEvent(SimpleApplicationEventMulticaster.java:127)
26-Feb-2019 00:00:51         at org.springframework.boot.context.event.EventPublishingRunListener.environmentPrepared(EventPublishingRunListener.java:75)
26-Feb-2019 00:00:51         at org.springframework.boot.SpringApplicationRunListeners.environmentPrepared(SpringApplicationRunListeners.java:54)
26-Feb-2019 00:00:51         at org.springframework.boot.SpringApplication.prepareEnvironment(SpringApplication.java:347)
26-Feb-2019 00:00:51         at org.springframework.boot.SpringApplication.run(SpringApplication.java:306)
26-Feb-2019 00:00:51         at org.springframework.boot.test.context.SpringBootContextLoader.loadContext(SpringBootContextLoader.java:127)
26-Feb-2019 00:00:51         at org.springframework.test.context.cache.DefaultCacheAwareContextLoaderDelegate.loadContextInternal(DefaultCacheAwareContextLoaderDelegate.java:99)
26-Feb-2019 00:00:51         at org.springframework.test.context.cache.DefaultCacheAwareContextLoaderDelegate.loadContext(DefaultCacheAwareContextLoaderDelegate.java:117)
26-Feb-2019 00:00:51         at org.springframework.test.context.support.DefaultTestContext.getApplicationContext(DefaultTestContext.java:108)
26-Feb-2019 00:00:51         at org.springframework.test.context.web.ServletTestExecutionListener.setUpRequestContextIfNecessary(ServletTestExecutionListener.java:190)
26-Feb-2019 00:00:51         at org.springframework.test.context.web.ServletTestExecutionListener.prepareTestInstance(ServletTestExecutionListener.java:132)
26-Feb-2019 00:00:51         at org.springframework.test.context.TestContextManager.prepareTestInstance(TestContextManager.java:246)
26-Feb-2019 00:00:51         at org.springframework.test.context.junit4.SpringJUnit4ClassRunner.createTest(SpringJUnit4ClassRunner.java:227)
26-Feb-2019 00:00:51         at org.springframework.test.context.junit4.SpringJUnit4ClassRunner$1.runReflectiveCall(SpringJUnit4ClassRunner.java:289)
26-Feb-2019 00:00:51         at org.junit.internal.runners.model.ReflectiveCallable.run(ReflectiveCallable.java:12)
26-Feb-2019 00:00:51         at org.springframework.test.context.junit4.SpringJUnit4ClassRunner.methodBlock(SpringJUnit4ClassRunner.java:291)
26-Feb-2019 00:00:51         at org.springframework.test.context.junit4.SpringJUnit4ClassRunner.runChild(SpringJUnit4ClassRunner.java:246)
26-Feb-2019 00:00:51         at org.springframework.test.context.junit4.SpringJUnit4ClassRunner.runChild(SpringJUnit4ClassRunner.java:97)
26-Feb-2019 00:00:51         at org.junit.runners.ParentRunner$3.run(ParentRunner.java:290)
26-Feb-2019 00:00:51         at org.junit.runners.ParentRunner$1.schedule(ParentRunner.java:71)
26-Feb-2019 00:00:51         at org.junit.runners.ParentRunner.runChildren(ParentRunner.java:288)
26-Feb-2019 00:00:51         at org.junit.runners.ParentRunner.access$000(ParentRunner.java:58)
26-Feb-2019 00:00:51         at org.junit.runners.ParentRunner$2.evaluate(ParentRunner.java:268)
26-Feb-2019 00:00:51         at org.springframework.test.context.junit4.statements.RunBeforeTestClassCallbacks.evaluate(RunBeforeTestClassCallbacks.java:61)
26-Feb-2019 00:00:51         at org.springframework.test.context.junit4.statements.RunAfterTestClassCallbacks.evaluate(RunAfterTestClassCallbacks.java:70)
26-Feb-2019 00:00:51         at org.junit.runners.ParentRunner.run(ParentRunner.java:363)
26-Feb-2019 00:00:51         at org.springframework.test.context.junit4.SpringJUnit4ClassRunner.run(SpringJUnit4ClassRunner.java:190)
26-Feb-2019 00:00:51         at org.apache.maven.surefire.junit4.JUnit4Provider.execute(JUnit4Provider.java:365)
26-Feb-2019 00:00:51         at org.apache.maven.surefire.junit4.JUnit4Provider.executeWithRerun(JUnit4Provider.java:272)
26-Feb-2019 00:00:51         at org.apache.maven.surefire.junit4.JUnit4Provider.executeTestSet(JUnit4Provider.java:236)
26-Feb-2019 00:00:51         at org.apache.maven.surefire.junit4.JUnit4Provider.invoke(JUnit4Provider.java:159)
26-Feb-2019 00:00:51         at org.apache.maven.surefire.booter.ForkedBooter.invokeProviderInSameClassLoader(ForkedBooter.java:386)
26-Feb-2019 00:00:51         at org.apache.maven.surefire.booter.ForkedBooter.runSuitesInProcess(ForkedBooter.java:323)
26-Feb-2019 00:00:51         at org.apache.maven.surefire.booter.ForkedBooter.main(ForkedBooter.java:143)
26-Feb-2019 00:00:51 Caused by: java.lang.ClassNotFoundException: io.pivotal.cfenv.sso.CfSingleSignOnProcessor
26-Feb-2019 00:00:51         at java.net.URLClassLoader.findClass(URLClassLoader.java:381)
26-Feb-2019 00:00:51         at java.lang.ClassLoader.loadClass(ClassLoader.java:424)
26-Feb-2019 00:00:51         at sun.misc.Launcher$AppClassLoader.loadClass(Launcher.java:335)
26-Feb-2019 00:00:51         at java.lang.ClassLoader.loadClass(ClassLoader.java:357)
26-Feb-2019 00:00:51         at java.lang.Class.forName0(Native Method)
26-Feb-2019 00:00:51         at java.lang.Class.forName(Class.java:348)
26-Feb-2019 00:00:51         at org.springframework.util.ClassUtils.forName(ClassUtils.java:275)
26-Feb-2019 00:00:51         at org.springframework.core.io.support.SpringFactoriesLoader.instantiateFactory(SpringFactoriesLoader.java:159)
26-Feb-2019 00:00:51         ... 52 common frames omitted
26-Feb-2019 00:00:51 00:00:51.713 [main] ERROR org.springframework.test.context.TestContextManager - Caught exception while allowing TestExecutionListener [org.springframework.test.context.web.ServletTestExecutionListener@16347545] to prepare test instance [org.springframework.cloud.skipper.server.repository.PackageMetadataMvcTests@ea4252]
26-Feb-2019 00:00:51 java.lang.IllegalStateException: Failed to load ApplicationContext
26-Feb-2019 00:00:51         at org.springframework.test.context.cache.DefaultCacheAwareContextLoaderDelegate.loadContext(DefaultCacheAwareContextLoaderDelegate.java:125)
26-Feb-2019 00:00:51         at org.springframework.test.context.support.DefaultTestContext.getApplicationContext(DefaultTestContext.java:108)
26-Feb-2019 00:00:51         at org.springframework.test.context.web.ServletTestExecutionListener.setUpRequestContextIfNecessary(ServletTestExecutionListener.java:190)
26-Feb-2019 00:00:51         at org.springframework.test.context.web.ServletTestExecutionListener.prepareTestInstance(ServletTestExecutionListener.java:132)
26-Feb-2019 00:00:51         at org.springframework.test.context.TestContextManager.prepareTestInstance(TestContextManager.java:246)
26-Feb-2019 00:00:51         at org.springframework.test.context.junit4.SpringJUnit4ClassRunner.createTest(SpringJUnit4ClassRunner.java:227)
26-Feb-2019 00:00:51         at org.springframework.test.context.junit4.SpringJUnit4ClassRunner$1.runReflectiveCall(SpringJUnit4ClassRunner.java:289)
26-Feb-2019 00:00:51         at org.junit.internal.runners.model.ReflectiveCallable.run(ReflectiveCallable.java:12)
26-Feb-2019 00:00:51         at org.springframework.test.context.junit4.SpringJUnit4ClassRunner.methodBlock(SpringJUnit4ClassRunner.java:291)
26-Feb-2019 00:00:51         at org.springframework.test.context.junit4.SpringJUnit4ClassRunner.runChild(SpringJUnit4ClassRunner.java:246)
26-Feb-2019 00:00:51         at org.springframework.test.context.junit4.SpringJUnit4ClassRunner.runChild(SpringJUnit4ClassRunner.java:97)
26-Feb-2019 00:00:51         at org.junit.runners.ParentRunner$3.run(ParentRunner.java:290)
26-Feb-2019 00:00:51         at org.junit.runners.ParentRunner$1.schedule(ParentRunner.java:71)
26-Feb-2019 00:00:51         at org.junit.runners.ParentRunner.runChildren(ParentRunner.java:288)
26-Feb-2019 00:00:51         at org.junit.runners.ParentRunner.access$000(ParentRunner.java:58)
26-Feb-2019 00:00:51         at org.junit.runners.ParentRunner$2.evaluate(ParentRunner.java:268)
26-Feb-2019 00:00:51         at org.springframework.test.context.junit4.statements.RunBeforeTestClassCallbacks.evaluate(RunBeforeTestClassCallbacks.java:61)
26-Feb-2019 00:00:51         at org.springframework.test.context.junit4.statements.RunAfterTestClassCallbacks.evaluate(RunAfterTestClassCallbacks.java:70)
26-Feb-2019 00:00:51         at org.junit.runners.ParentRunner.run(ParentRunner.java:363)
26-Feb-2019 00:00:51         at org.springframework.test.context.junit4.SpringJUnit4ClassRunner.run(SpringJUnit4ClassRunner.java:190)
26-Feb-2019 00:00:51         at org.apache.maven.surefire.junit4.JUnit4Provider.execute(JUnit4Provider.java:365)
26-Feb-2019 00:00:51         at org.apache.maven.surefire.junit4.JUnit4Provider.executeWithRerun(JUnit4Provider.java:272)
26-Feb-2019 00:00:51         at org.apache.maven.surefire.junit4.JUnit4Provider.executeTestSet(JUnit4Provider.java:236)
26-Feb-2019 00:00:51         at org.apache.maven.surefire.junit4.JUnit4Provider.invoke(JUnit4Provider.java:159)
26-Feb-2019 00:00:51         at org.apache.maven.surefire.booter.ForkedBooter.invokeProviderInSameClassLoader(ForkedBooter.java:386)
26-Feb-2019 00:00:51         at org.apache.maven.surefire.booter.ForkedBooter.runSuitesInProcess(ForkedBooter.java:323)
26-Feb-2019 00:00:51         at org.apache.maven.surefire.booter.ForkedBooter.main(ForkedBooter.java:143)
26-Feb-2019 00:00:51 Caused by: java.lang.IllegalArgumentException: Unable to instantiate factory class: io.pivotal.cfenv.spring.boot.CfEnvProcessor
26-Feb-2019 00:00:51         at org.springframework.core.io.support.SpringFactoriesLoader.instantiateFactory(SpringFactoriesLoader.java:167)
26-Feb-2019 00:00:51         at org.springframework.core.io.support.SpringFactoriesLoader.loadFactories(SpringFactoriesLoader.java:104)
26-Feb-2019 00:00:51         at io.pivotal.cfenv.spring.boot.CfEnvironmentPostProcessor.loadCfEnvProcessors(CfEnvironmentPostProcessor.java:144)
26-Feb-2019 00:00:51         at io.pivotal.cfenv.spring.boot.CfEnvironmentPostProcessor.onApplicationEvent(CfEnvironmentPostProcessor.java:134)
26-Feb-2019 00:00:51         at org.springframework.context.event.SimpleApplicationEventMulticaster.doInvokeListener(SimpleApplicationEventMulticaster.java:172)
26-Feb-2019 00:00:51         at org.springframework.context.event.SimpleApplicationEventMulticaster.invokeListener(SimpleApplicationEventMulticaster.java:165)
26-Feb-2019 00:00:51         at org.springframework.context.event.SimpleApplicationEventMulticaster.multicastEvent(SimpleApplicationEventMulticaster.java:139)
26-Feb-2019 00:00:51         at org.springframework.context.event.SimpleApplicationEventMulticaster.multicastEvent(SimpleApplicationEventMulticaster.java:127)
26-Feb-2019 00:00:51         at org.springframework.boot.context.event.EventPublishingRunListener.environmentPrepared(EventPublishingRunListener.java:75)
26-Feb-2019 00:00:51         at org.springframework.boot.SpringApplicationRunListeners.environmentPrepared(SpringApplicationRunListeners.java:54)
26-Feb-2019 00:00:51         at org.springframework.boot.SpringApplication.prepareEnvironment(SpringApplication.java:347)
26-Feb-2019 00:00:51         at org.springframework.boot.SpringApplication.run(SpringApplication.java:306)
26-Feb-2019 00:00:51         at org.springframework.boot.builder.SpringApplicationBuilder.run(SpringApplicationBuilder.java:139)
26-Feb-2019 00:00:51         at org.springframework.cloud.bootstrap.BootstrapApplicationListener.bootstrapServiceContext(BootstrapApplicationListener.java:191)
26-Feb-2019 00:00:51         at org.springframework.cloud.bootstrap.BootstrapApplicationListener.onApplicationEvent(BootstrapApplicationListener.java:105)
26-Feb-2019 00:00:51         at org.springframework.cloud.bootstrap.BootstrapApplicationListener.onApplicationEvent(BootstrapApplicationListener.java:71)
26-Feb-2019 00:00:51         at org.springframework.context.event.SimpleApplicationEventMulticaster.doInvokeListener(SimpleApplicationEventMulticaster.java:172)
26-Feb-2019 00:00:51         at org.springframework.context.event.SimpleApplicationEventMulticaster.invokeListener(SimpleApplicationEventMulticaster.java:165)
26-Feb-2019 00:00:51         at org.springframework.context.event.SimpleApplicationEventMulticaster.multicastEvent(SimpleApplicationEventMulticaster.java:139)
26-Feb-2019 00:00:51         at org.springframework.context.event.SimpleApplicationEventMulticaster.multicastEvent(SimpleApplicationEventMulticaster.java:127)
26-Feb-2019 00:00:51         at org.springframework.boot.context.event.EventPublishingRunListener.environmentPrepared(EventPublishingRunListener.java:75)
26-Feb-2019 00:00:51         at org.springframework.boot.SpringApplicationRunListeners.environmentPrepared(SpringApplicationRunListeners.java:54)
26-Feb-2019 00:00:51         at org.springframework.boot.SpringApplication.prepareEnvironment(SpringApplication.java:347)
26-Feb-2019 00:00:51         at org.springframework.boot.SpringApplication.run(SpringApplication.java:306)
26-Feb-2019 00:00:51         at org.springframework.boot.test.context.SpringBootContextLoader.loadContext(SpringBootContextLoader.java:127)
26-Feb-2019 00:00:51         at org.springframework.test.context.cache.DefaultCacheAwareContextLoaderDelegate.loadContextInternal(DefaultCacheAwareContextLoaderDelegate.java:99)
26-Feb-2019 00:00:51         at org.springframework.test.context.cache.DefaultCacheAwareContextLoaderDelegate.loadContext(DefaultCacheAwareContextLoaderDelegate.java:117)
26-Feb-2019 00:00:51         ... 26 common frames omitted
26-Feb-2019 00:00:51 Caused by: java.lang.ClassNotFoundException: io.pivotal.cfenv.sso.CfSingleSignOnProcessor
26-Feb-2019 00:00:51         at java.net.URLClassLoader.findClass(URLClassLoader.java:381)
26-Feb-2019 00:00:51         at java.lang.ClassLoader.loadClass(ClassLoader.java:424)
26-Feb-2019 00:00:51         at sun.misc.Launcher$AppClassLoader.loadClass(Launcher.java:335)
26-Feb-2019 00:00:51         at java.lang.ClassLoader.loadClass(ClassLoader.java:357)
26-Feb-2019 00:00:51         at java.lang.Class.forName0(Native Method)
26-Feb-2019 00:00:51         at java.lang.Class.forName(Class.java:348)
26-Feb-2019 00:00:51         at org.springframework.util.ClassUtils.forName(ClassUtils.java:275)
26-Feb-2019 00:00:51         at org.springframework.core.io.support.SpringFactoriesLoader.instantiateFactory(SpringFactoriesLoader.java:159)
26-Feb-2019 00:00:51         ... 52 common frames omitted
26-Feb-2019 00:00:51 00:00:51.714 [main] DEBUG org.springframework.test.annotation.ProfileValueUtils - Retrieved @ProfileValueSourceConfiguration [null] for test class [org.springframework.cloud.skipper.server.repository.PackageMetadataMvcTests]
26-Feb-2019 00:00:51 00:00:51.714 [main] DEBUG org.springframework.test.annotation.ProfileValueUtils - Retrieved ProfileValueSource type [class org.springframework.test.annotation.SystemProfileValueSource] for class [org.springframework.cloud.skipper.server.repository.PackageMetadataMvcTests]
26-Feb-2019 00:00:51 00:00:51.715 [main] DEBUG org.springframework.test.context.support.TestPropertySourceUtils - Adding inlined properties to environment: {spring.jmx.enabled=false, spring.main.allow-bean-definition-overriding=true, org.springframework.boot.test.context.SpringBootTestContextBootstrapper=true, server.port=-1}
26-Feb-2019 00:00:51 00:00:51.720 [main] DEBUG org.springframework.boot.context.logging.ClasspathLoggingApplicationListener - Application failed to start with classpath: [file:/opt/bamboo-home/xml-data/build-dir/SCSKIP-BMASTER-JOB1/spring-cloud-skipper-server-core/target/surefire/surefirebooter3109259931034045945.jar, file:/opt/users/bamboo/.m2/repository/org/jacoco/org.jacoco.agent/0.7.9/org.jacoco.agent-0.7.9-runtime.jar]
26-Feb-2019 00:00:51 00:00:51.721 [main] ERROR org.springframework.boot.SpringApplication - Application run failed
26-Feb-2019 00:00:51 java.lang.IllegalArgumentException: Unable to instantiate factory class: io.pivotal.cfenv.spring.boot.CfEnvProcessor
26-Feb-2019 00:00:51         at org.springframework.core.io.support.SpringFactoriesLoader.instantiateFactory(SpringFactoriesLoader.java:167)
26-Feb-2019 00:00:51         at org.springframework.core.io.support.SpringFactoriesLoader.loadFactories(SpringFactoriesLoader.java:104)
26-Feb-2019 00:00:51         at io.pivotal.cfenv.spring.boot.CfEnvironmentPostProcessor.loadCfEnvProcessors(CfEnvironmentPostProcessor.java:144)
26-Feb-2019 00:00:51         at io.pivotal.cfenv.spring.boot.CfEnvironmentPostProcessor.onApplicationEvent(CfEnvironmentPostProcessor.java:134)
26-Feb-2019 00:00:51         at org.springframework.context.event.SimpleApplicationEventMulticaster.doInvokeListener(SimpleApplicationEventMulticaster.java:172)
26-Feb-2019 00:00:51         at org.springframework.context.event.SimpleApplicationEventMulticaster.invokeListener(SimpleApplicationEventMulticaster.java:165)
26-Feb-2019 00:00:51         at org.springframework.context.event.SimpleApplicationEventMulticaster.multicastEvent(SimpleApplicationEventMulticaster.java:139)
26-Feb-2019 00:00:51         at org.springframework.context.event.SimpleApplicationEventMulticaster.multicastEvent(SimpleApplicationEventMulticaster.java:127)
26-Feb-2019 00:00:51         at org.springframework.boot.context.event.EventPublishingRunListener.environmentPrepared(EventPublishingRunListener.java:75)
26-Feb-2019 00:00:51         at org.springframework.boot.SpringApplicationRunListeners.environmentPrepared(SpringApplicationRunListeners.java:54)
26-Feb-2019 00:00:51         at org.springframework.boot.SpringApplication.prepareEnvironment(SpringApplication.java:347)
26-Feb-2019 00:00:51         at org.springframework.boot.SpringApplication.run(SpringApplication.java:306)
26-Feb-2019 00:00:51         at org.springframework.boot.builder.SpringApplicationBuilder.run(SpringApplicationBuilder.java:139)
26-Feb-2019 00:00:51         at org.springframework.cloud.bootstrap.BootstrapApplicationListener.bootstrapServiceContext(BootstrapApplicationListener.java:191)
26-Feb-2019 00:00:51         at org.springframework.cloud.bootstrap.BootstrapApplicationListener.onApplicationEvent(BootstrapApplicationListener.java:105)
26-Feb-2019 00:00:51         at org.springframework.cloud.bootstrap.BootstrapApplicationListener.onApplicationEvent(BootstrapApplicationListener.java:71)
26-Feb-2019 00:00:51         at org.springframework.context.event.SimpleApplicationEventMulticaster.doInvokeListener(SimpleApplicationEventMulticaster.java:172)
26-Feb-2019 00:00:51         at org.springframework.context.event.SimpleApplicationEventMulticaster.invokeListener(SimpleApplicationEventMulticaster.java:165)
26-Feb-2019 00:00:51         at org.springframework.context.event.SimpleApplicationEventMulticaster.multicastEvent(SimpleApplicationEventMulticaster.java:139)
26-Feb-2019 00:00:51         at org.springframework.context.event.SimpleApplicationEventMulticaster.multicastEvent(SimpleApplicationEventMulticaster.java:127)
26-Feb-2019 00:00:51         at org.springframework.boot.context.event.EventPublishingRunListener.environmentPrepared(EventPublishingRunListener.java:75)
26-Feb-2019 00:00:51         at org.springframework.boot.SpringApplicationRunListeners.environmentPrepared(SpringApplicationRunListeners.java:54)
26-Feb-2019 00:00:51         at org.springframework.boot.SpringApplication.prepareEnvironment(SpringApplication.java:347)
26-Feb-2019 00:00:51         at org.springframework.boot.SpringApplication.run(SpringApplication.java:306)
26-Feb-2019 00:00:51         at org.springframework.boot.test.context.SpringBootContextLoader.loadContext(SpringBootContextLoader.java:127)
26-Feb-2019 00:00:51         at org.springframework.test.context.cache.DefaultCacheAwareContextLoaderDelegate.loadContextInternal(DefaultCacheAwareContextLoaderDelegate.java:99)
26-Feb-2019 00:00:51         at org.springframework.test.context.cache.DefaultCacheAwareContextLoaderDelegate.loadContext(DefaultCacheAwareContextLoaderDelegate.java:117)
26-Feb-2019 00:00:51         at org.springframework.test.context.support.DefaultTestContext.getApplicationContext(DefaultTestContext.java:108)
26-Feb-2019 00:00:51         at org.springframework.test.context.web.ServletTestExecutionListener.setUpRequestContextIfNecessary(ServletTestExecutionListener.java:190)
26-Feb-2019 00:00:51         at org.springframework.test.context.web.ServletTestExecutionListener.prepareTestInstance(ServletTestExecutionListener.java:132)
26-Feb-2019 00:00:51         at org.springframework.test.context.TestContextManager.prepareTestInstance(TestContextManager.java:246)
26-Feb-2019 00:00:51         at org.springframework.test.context.junit4.SpringJUnit4ClassRunner.createTest(SpringJUnit4ClassRunner.java:227)
26-Feb-2019 00:00:51         at org.springframework.test.context.junit4.SpringJUnit4ClassRunner$1.runReflectiveCall(SpringJUnit4ClassRunner.java:289)
26-Feb-2019 00:00:51         at org.junit.internal.runners.model.ReflectiveCallable.run(ReflectiveCallable.java:12)
26-Feb-2019 00:00:51         at org.springframework.test.context.junit4.SpringJUnit4ClassRunner.methodBlock(SpringJUnit4ClassRunner.java:291)
26-Feb-2019 00:00:51         at org.springframework.test.context.junit4.SpringJUnit4ClassRunner.runChild(SpringJUnit4ClassRunner.java:246)
26-Feb-2019 00:00:51         at org.springframework.test.context.junit4.SpringJUnit4ClassRunner.runChild(SpringJUnit4ClassRunner.java:97)
26-Feb-2019 00:00:51         at org.junit.runners.ParentRunner$3.run(ParentRunner.java:290)
26-Feb-2019 00:00:51         at org.junit.runners.ParentRunner$1.schedule(ParentRunner.java:71)
26-Feb-2019 00:00:51         at org.junit.runners.ParentRunner.runChildren(ParentRunner.java:288)
26-Feb-2019 00:00:51         at org.junit.runners.ParentRunner.access$000(ParentRunner.java:58)
26-Feb-2019 00:00:51         at org.junit.runners.ParentRunner$2.evaluate(ParentRunner.java:268)
26-Feb-2019 00:00:51         at org.springframework.test.context.junit4.statements.RunBeforeTestClassCallbacks.evaluate(RunBeforeTestClassCallbacks.java:61)
26-Feb-2019 00:00:51         at org.springframework.test.context.junit4.statements.RunAfterTestClassCallbacks.evaluate(RunAfterTestClassCallbacks.java:70)
26-Feb-2019 00:00:51         at org.junit.runners.ParentRunner.run(ParentRunner.java:363)
26-Feb-2019 00:00:51         at org.springframework.test.context.junit4.SpringJUnit4ClassRunner.run(SpringJUnit4ClassRunner.java:190)
26-Feb-2019 00:00:51         at org.apache.maven.surefire.junit4.JUnit4Provider.execute(JUnit4Provider.java:365)
26-Feb-2019 00:00:51         at org.apache.maven.surefire.junit4.JUnit4Provider.executeWithRerun(JUnit4Provider.java:272)
26-Feb-2019 00:00:51         at org.apache.maven.surefire.junit4.JUnit4Provider.executeTestSet(JUnit4Provider.java:236)
26-Feb-2019 00:00:51         at org.apache.maven.surefire.junit4.JUnit4Provider.invoke(JUnit4Provider.java:159)
26-Feb-2019 00:00:51         at org.apache.maven.surefire.booter.ForkedBooter.invokeProviderInSameClassLoader(ForkedBooter.java:386)
26-Feb-2019 00:00:51         at org.apache.maven.surefire.booter.ForkedBooter.runSuitesInProcess(ForkedBooter.java:323)
26-Feb-2019 00:00:51         at org.apache.maven.surefire.booter.ForkedBooter.main(ForkedBooter.java:143)
26-Feb-2019 00:00:51 Caused by: java.lang.ClassNotFoundException: io.pivotal.cfenv.sso.CfSingleSignOnProcessor
26-Feb-2019 00:00:51         at java.net.URLClassLoader.findClass(URLClassLoader.java:381)
26-Feb-2019 00:00:51         at java.lang.ClassLoader.loadClass(ClassLoader.java:424)
26-Feb-2019 00:00:51         at sun.misc.Launcher$AppClassLoader.loadClass(Launcher.java:335)
26-Feb-2019 00:00:51         at java.lang.ClassLoader.loadClass(ClassLoader.java:357)
26-Feb-2019 00:00:51         at java.lang.Class.forName0(Native Method)
26-Feb-2019 00:00:51         at java.lang.Class.forName(Class.java:348)
26-Feb-2019 00:00:51         at org.springframework.util.ClassUtils.forName(ClassUtils.java:275)
26-Feb-2019 00:00:51         at org.springframework.core.io.support.SpringFactoriesLoader.instantiateFactory(SpringFactoriesLoader.java:159)
26-Feb-2019 00:00:51         ... 52 common frames omitted
26-Feb-2019 00:00:51 00:00:51.721 [main] ERROR org.springframework.test.context.TestContextManager - Caught exception while allowing TestExecutionListener [org.springframework.test.context.web.ServletTestExecutionListener@16347545] to prepare test instance [org.springframework.cloud.skipper.server.repository.PackageMetadataMvcTests@1c219552]
26-Feb-2019 00:00:51 java.lang.IllegalStateException: Failed to load ApplicationContext
26-Feb-2019 00:00:51         at org.springframework.test.context.cache.DefaultCacheAwareContextLoaderDelegate.loadContext(DefaultCacheAwareContextLoaderDelegate.java:125)
26-Feb-2019 00:00:51         at org.springframework.test.context.support.DefaultTestContext.getApplicationContext(DefaultTestContext.java:108)
26-Feb-2019 00:00:51         at org.springframework.test.context.web.ServletTestExecutionListener.setUpRequestContextIfNecessary(ServletTestExecutionListener.java:190)
26-Feb-2019 00:00:51         at org.springframework.test.context.web.ServletTestExecutionListener.prepareTestInstance(ServletTestExecutionListener.java:132)
26-Feb-2019 00:00:51         at org.springframework.test.context.TestContextManager.prepareTestInstance(TestContextManager.java:246)
26-Feb-2019 00:00:51         at org.springframework.test.context.junit4.SpringJUnit4ClassRunner.createTest(SpringJUnit4ClassRunner.java:227)
26-Feb-2019 00:00:51         at org.springframework.test.context.junit4.SpringJUnit4ClassRunner$1.runReflectiveCall(SpringJUnit4ClassRunner.java:289)
26-Feb-2019 00:00:51         at org.junit.internal.runners.model.ReflectiveCallable.run(ReflectiveCallable.java:12)
26-Feb-2019 00:00:51         at org.springframework.test.context.junit4.SpringJUnit4ClassRunner.methodBlock(SpringJUnit4ClassRunner.java:291)
26-Feb-2019 00:00:51         at org.springframework.test.context.junit4.SpringJUnit4ClassRunner.runChild(SpringJUnit4ClassRunner.java:246)
26-Feb-2019 00:00:51         at org.springframework.test.context.junit4.SpringJUnit4ClassRunner.runChild(SpringJUnit4ClassRunner.java:97)
26-Feb-2019 00:00:51         at org.junit.runners.ParentRunner$3.run(ParentRunner.java:290)
26-Feb-2019 00:00:51         at org.junit.runners.ParentRunner$1.schedule(ParentRunner.java:71)
26-Feb-2019 00:00:51         at org.junit.runners.ParentRunner.runChildren(ParentRunner.java:288)
26-Feb-2019 00:00:51         at org.junit.runners.ParentRunner.access$000(ParentRunner.java:58)
26-Feb-2019 00:00:51         at org.junit.runners.ParentRunner$2.evaluate(ParentRunner.java:268)
26-Feb-2019 00:00:51         at org.springframework.test.context.junit4.statements.RunBeforeTestClassCallbacks.evaluate(RunBeforeTestClassCallbacks.java:61)
26-Feb-2019 00:00:51         at org.springframework.test.context.junit4.statements.RunAfterTestClassCallbacks.evaluate(RunAfterTestClassCallbacks.java:70)
26-Feb-2019 00:00:51         at org.junit.runners.ParentRunner.run(ParentRunner.java:363)
26-Feb-2019 00:00:51         at org.springframework.test.context.junit4.SpringJUnit4ClassRunner.run(SpringJUnit4ClassRunner.java:190)
26-Feb-2019 00:00:51         at org.apache.maven.surefire.junit4.JUnit4Provider.execute(JUnit4Provider.java:365)
26-Feb-2019 00:00:51         at org.apache.maven.surefire.junit4.JUnit4Provider.executeWithRerun(JUnit4Provider.java:272)
26-Feb-2019 00:00:51         at org.apache.maven.surefire.junit4.JUnit4Provider.executeTestSet(JUnit4Provider.java:236)
26-Feb-2019 00:00:51         at org.apache.maven.surefire.junit4.JUnit4Provider.invoke(JUnit4Provider.java:159)
26-Feb-2019 00:00:51         at org.apache.maven.surefire.booter.ForkedBooter.invokeProviderInSameClassLoader(ForkedBooter.java:386)
26-Feb-2019 00:00:51         at org.apache.maven.surefire.booter.ForkedBooter.runSuitesInProcess(ForkedBooter.java:323)
26-Feb-2019 00:00:51         at org.apache.maven.surefire.booter.ForkedBooter.main(ForkedBooter.java:143)
26-Feb-2019 00:00:51 Caused by: java.lang.IllegalArgumentException: Unable to instantiate factory class: io.pivotal.cfenv.spring.boot.CfEnvProcessor
26-Feb-2019 00:00:51         at org.springframework.core.io.support.SpringFactoriesLoader.instantiateFactory(SpringFactoriesLoader.java:167)
26-Feb-2019 00:00:51         at org.springframework.core.io.support.SpringFactoriesLoader.loadFactories(SpringFactoriesLoader.java:104)
26-Feb-2019 00:00:51         at io.pivotal.cfenv.spring.boot.CfEnvironmentPostProcessor.loadCfEnvProcessors(CfEnvironmentPostProcessor.java:144)
26-Feb-2019 00:00:51         at io.pivotal.cfenv.spring.boot.CfEnvironmentPostProcessor.onApplicationEvent(CfEnvironmentPostProcessor.java:134)
26-Feb-2019 00:00:51         at org.springframework.context.event.SimpleApplicationEventMulticaster.doInvokeListener(SimpleApplicationEventMulticaster.java:172)
26-Feb-2019 00:00:51         at org.springframework.context.event.SimpleApplicationEventMulticaster.invokeListener(SimpleApplicationEventMulticaster.java:165)
26-Feb-2019 00:00:51         at org.springframework.context.event.SimpleApplicationEventMulticaster.multicastEvent(SimpleApplicationEventMulticaster.java:139)
26-Feb-2019 00:00:51         at org.springframework.context.event.SimpleApplicationEventMulticaster.multicastEvent(SimpleApplicationEventMulticaster.java:127)
26-Feb-2019 00:00:51         at org.springframework.boot.context.event.EventPublishingRunListener.environmentPrepared(EventPublishingRunListener.java:75)
26-Feb-2019 00:00:51         at org.springframework.boot.SpringApplicationRunListeners.environmentPrepared(SpringApplicationRunListeners.java:54)
26-Feb-2019 00:00:51         at org.springframework.boot.SpringApplication.prepareEnvironment(SpringApplication.java:347)
26-Feb-2019 00:00:51         at org.springframework.boot.SpringApplication.run(SpringApplication.java:306)
26-Feb-2019 00:00:51         at org.springframework.boot.builder.SpringApplicationBuilder.run(SpringApplicationBuilder.java:139)
26-Feb-2019 00:00:51         at org.springframework.cloud.bootstrap.BootstrapApplicationListener.bootstrapServiceContext(BootstrapApplicationListener.java:191)
26-Feb-2019 00:00:51         at org.springframework.cloud.bootstrap.BootstrapApplicationListener.onApplicationEvent(BootstrapApplicationListener.java:105)
26-Feb-2019 00:00:51         at org.springframework.cloud.bootstrap.BootstrapApplicationListener.onApplicationEvent(BootstrapApplicationListener.java:71)
26-Feb-2019 00:00:51         at org.springframework.context.event.SimpleApplicationEventMulticaster.doInvokeListener(SimpleApplicationEventMulticaster.java:172)
26-Feb-2019 00:00:51         at org.springframework.context.event.SimpleApplicationEventMulticaster.invokeListener(SimpleApplicationEventMulticaster.java:165)
26-Feb-2019 00:00:51         at org.springframework.context.event.SimpleApplicationEventMulticaster.multicastEvent(SimpleApplicationEventMulticaster.java:139)
26-Feb-2019 00:00:51         at org.springframework.context.event.SimpleApplicationEventMulticaster.multicastEvent(SimpleApplicationEventMulticaster.java:127)
26-Feb-2019 00:00:51         at org.springframework.boot.context.event.EventPublishingRunListener.environmentPrepared(EventPublishingRunListener.java:75)
26-Feb-2019 00:00:51         at org.springframework.boot.SpringApplicationRunListeners.environmentPrepared(SpringApplicationRunListeners.java:54)
26-Feb-2019 00:00:51         at org.springframework.boot.SpringApplication.prepareEnvironment(SpringApplication.java:347)
26-Feb-2019 00:00:51         at org.springframework.boot.SpringApplication.run(SpringApplication.java:306)
26-Feb-2019 00:00:51         at org.springframework.boot.test.context.SpringBootContextLoader.loadContext(SpringBootContextLoader.java:127)
26-Feb-2019 00:00:51         at org.springframework.test.context.cache.DefaultCacheAwareContextLoaderDelegate.loadContextInternal(DefaultCacheAwareContextLoaderDelegate.java:99)
26-Feb-2019 00:00:51         at org.springframework.test.context.cache.DefaultCacheAwareContextLoaderDelegate.loadContext(DefaultCacheAwareContextLoaderDelegate.java:117)
26-Feb-2019 00:00:51         ... 26 common frames omitted
26-Feb-2019 00:00:51 Caused by: java.lang.ClassNotFoundException: io.pivotal.cfenv.sso.CfSingleSignOnProcessor
26-Feb-2019 00:00:51         at java.net.URLClassLoader.findClass(URLClassLoader.java:381)
26-Feb-2019 00:00:51         at java.lang.ClassLoader.loadClass(ClassLoader.java:424)
26-Feb-2019 00:00:51         at sun.misc.Launcher$AppClassLoader.loadClass(Launcher.java:335)
26-Feb-2019 00:00:51         at java.lang.ClassLoader.loadClass(ClassLoader.java:357)
26-Feb-2019 00:00:51         at java.lang.Class.forName0(Native Method)
26-Feb-2019 00:00:51         at java.lang.Class.forName(Class.java:348)
26-Feb-2019 00:00:51         at org.springframework.util.ClassUtils.forName(ClassUtils.java:275)
26-Feb-2019 00:00:51         at org.springframework.core.io.support.SpringFactoriesLoader.instantiateFactory(SpringFactoriesLoader.java:159)
26-Feb-2019 00:00:51         ... 52 common frames omitted
26-Feb-2019 00:00:51 00:00:51.721 [main] DEBUG org.springframework.test.context.support.AbstractDirtiesContextTestExecutionListener - After test class: context [DefaultTestContext@239ee8b6 testClass = PackageMetadataMvcTests, testInstance = [null], testMethod = [null], testException = [null], mergedContextConfiguration = [WebMergedContextConfiguration@29cf4f43 testClass = PackageMetadataMvcTests, locations = '{}', classes = '{class org.springframework.cloud.skipper.server.AbstractMockMvcTests$TestConfig, class org.springframework.cloud.skipper.server.AbstractMockMvcTests$TestConfig}', contextInitializerClasses = '[]', activeProfiles = '{}', propertySourceLocations = '{}', propertySourceProperties = '{spring.main.allow-bean-definition-overriding=true, org.springframework.boot.test.context.SpringBootTestContextBootstrapper=true}', contextCustomizers = set[[ImportsContextCustomizer@7e475bb5 key = [org.springframework.boot.test.autoconfigure.web.servlet.MockMvcAutoConfiguration, org.springframework.boot.test.autoconfigure.web.servlet.MockMvcSecurityAutoConfiguration, org.springframework.boot.test.autoconfigure.web.servlet.MockMvcWebClientAutoConfiguration, org.springframework.boot.test.autoconfigure.web.servlet.MockMvcWebDriverAutoConfiguration]], org.springframework.boot.test.context.filter.ExcludeFilterContextCustomizer@55d58825, org.springframework.boot.test.json.DuplicateJsonObjectContextCustomizerFactory$DuplicateJsonObjectContextCustomizer@663bb8ef, org.springframework.boot.test.mock.mockito.MockitoContextCustomizer@0, org.springframework.boot.test.web.client.TestRestTemplateContextCustomizer@2c88a3e8, org.springframework.boot.test.autoconfigure.properties.PropertyMappingContextCustomizer@e7e8512, org.springframework.boot.test.autoconfigure.web.servlet.WebDriverContextCustomizerFactory$Customizer@22a10ac6], resourceBasePath = 'src/main/webapp', contextLoader = 'org.springframework.boot.test.context.SpringBootContextLoader', parent = [null]], attributes = map['org.springframework.test.context.web.ServletTestExecutionListener.activateListener' -> true]], class annotated with @DirtiesContext [true] with mode [BEFORE_EACH_TEST_METHOD].
26-Feb-2019 00:00:51 [ERROR] Tests run: 2, Failures: 0, Errors: 2, Skipped: 0, Time elapsed: 0.003 s <<< FAILURE! - in org.springframework.cloud.skipper.server.repository.PackageMetadataMvcTests
26-Feb-2019 00:00:51 [ERROR] testProjection(org.springframework.cloud.skipper.server.repository.PackageMetadataMvcTests)  Time elapsed: 0 s  <<< ERROR!
26-Feb-2019 00:00:51 java.lang.IllegalStateException: Failed to load ApplicationContext
26-Feb-2019 00:00:51 Caused by: java.lang.IllegalArgumentException: Unable to instantiate factory class: io.pivotal.cfenv.spring.boot.CfEnvProcessor
26-Feb-2019 00:00:51 Caused by: java.lang.ClassNotFoundException: io.pivotal.cfenv.sso.CfSingleSignOnProcessor
26-Feb-2019 00:00:51
26-Feb-2019 00:00:51 [ERROR] shouldReturnRepositoryIndex(org.springframework.cloud.skipper.server.repository.PackageMetadataMvcTests)  Time elapsed: 0 s  <<< ERROR!
26-Feb-2019 00:00:51 java.lang.IllegalStateException: Failed to load ApplicationContext
26-Feb-2019 00:00:51 Caused by: java.lang.IllegalArgumentException: Unable to instantiate factory class: io.pivotal.cfenv.spring.boot.CfEnvProcessor
26-Feb-2019 00:00:51 Caused by: java.lang.ClassNotFoundException: io.pivotal.cfenv.sso.CfSingleSignOnProcessor
26-Feb-2019 00:00:51
26-Feb-2019 00:00:51 [INFO] Running org.springframework.cloud.skipper.server.repository.RepositoryMvcTests
26-Feb-2019 00:00:51 00:00:51.722 [main] DEBUG org.springframework.test.context.junit4.SpringJUnit4ClassRunner - SpringJUnit4ClassRunner constructor called with [class org.springframework.cloud.skipper.server.repository.RepositoryMvcTests]
26-Feb-2019 00:00:51 00:00:51.722 [main] DEBUG org.springframework.test.context.BootstrapUtils - Instantiating CacheAwareContextLoaderDelegate from class [org.springframework.test.context.cache.DefaultCacheAwareContextLoaderDelegate]
26-Feb-2019 00:00:51 00:00:51.722 [main] DEBUG org.springframework.test.context.BootstrapUtils - Instantiating BootstrapContext using constructor [public org.springframework.test.context.support.DefaultBootstrapContext(java.lang.Class,org.springframework.test.context.CacheAwareContextLoaderDelegate)]
26-Feb-2019 00:00:51 00:00:51.722 [main] DEBUG org.springframework.test.context.BootstrapUtils - Instantiating TestContextBootstrapper for test class [org.springframework.cloud.skipper.server.repository.RepositoryMvcTests] from class [org.springframework.boot.test.context.SpringBootTestContextBootstrapper]
26-Feb-2019 00:00:51 00:00:51.722 [main] INFO org.springframework.boot.test.context.SpringBootTestContextBootstrapper - Neither @ContextConfiguration nor @ContextHierarchy found for test class [org.springframework.cloud.skipper.server.repository.RepositoryMvcTests], using SpringBootContextLoader
26-Feb-2019 00:00:51 00:00:51.722 [main] DEBUG org.springframework.test.context.support.AbstractContextLoader - Did not detect default resource location for test class [org.springframework.cloud.skipper.server.repository.RepositoryMvcTests]: class path resource [org/springframework/cloud/skipper/server/repository/RepositoryMvcTests-context.xml] does not exist
26-Feb-2019 00:00:51 00:00:51.723 [main] DEBUG org.springframework.test.context.support.AbstractContextLoader - Did not detect default resource location for test class [org.springframework.cloud.skipper.server.repository.RepositoryMvcTests]: class path resource [org/springframework/cloud/skipper/server/repository/RepositoryMvcTestsContext.groovy] does not exist
26-Feb-2019 00:00:51 00:00:51.723 [main] INFO org.springframework.test.context.support.AbstractContextLoader - Could not detect default resource locations for test class [org.springframework.cloud.skipper.server.repository.RepositoryMvcTests]: no resource found for suffixes {-context.xml, Context.groovy}.
26-Feb-2019 00:00:51 00:00:51.724 [main] DEBUG org.springframework.test.context.support.ActiveProfilesUtils - Could not find an 'annotation declaring class' for annotation type [org.springframework.test.context.ActiveProfiles] and class [org.springframework.cloud.skipper.server.repository.RepositoryMvcTests]
26-Feb-2019 00:00:51 00:00:51.725 [main] DEBUG org.springframework.boot.test.context.SpringBootTestContextBootstrapper - @TestExecutionListeners is not present for class [org.springframework.cloud.skipper.server.repository.RepositoryMvcTests]: using defaults.
26-Feb-2019 00:00:51 00:00:51.725 [main] INFO org.springframework.boot.test.context.SpringBootTestContextBootstrapper - Loaded default TestExecutionListener class names from location [META-INF/spring.factories]: [org.springframework.test.context.web.ServletTestExecutionListener, org.springframework.test.context.support.DirtiesContextBeforeModesTestExecutionListener, org.springframework.test.context.support.DependencyInjectionTestExecutionListener, org.springframework.test.context.support.DirtiesContextTestExecutionListener, org.springframework.test.context.transaction.TransactionalTestExecutionListener, org.springframework.test.context.jdbc.SqlScriptsTestExecutionListener, org.springframework.boot.test.mock.mockito.MockitoTestExecutionListener, org.springframework.boot.test.mock.mockito.ResetMocksTestExecutionListener, org.springframework.boot.test.autoconfigure.restdocs.RestDocsTestExecutionListener, org.springframework.boot.test.autoconfigure.web.client.MockRestServiceServerResetTestExecutionListener, org.springframework.boot.test.autoconfigure.web.servlet.MockMvcPrintOnlyOnFailureTestExecutionListener, org.springframework.boot.test.autoconfigure.web.servlet.WebDriverTestExecutionListener]
26-Feb-2019 00:00:51 00:00:51.725 [main] INFO org.springframework.boot.test.context.SpringBootTestContextBootstrapper - Using TestExecutionListeners: [org.springframework.test.context.web.ServletTestExecutionListener@7371f9b7, org.springframework.test.context.support.DirtiesContextBeforeModesTestExecutionListener@583916d3, org.springframework.boot.test.mock.mockito.MockitoTestExecutionListener@48a28383, org.springframework.boot.test.autoconfigure.SpringBootDependencyInjectionTestExecutionListener@3cae42e6, org.springframework.test.context.support.DirtiesContextTestExecutionListener@40eeb885, org.springframework.test.context.transaction.TransactionalTestExecutionListener@5071a1c5, org.springframework.test.context.jdbc.SqlScriptsTestExecutionListener@c139ed3, org.springframework.boot.test.mock.mockito.ResetMocksTestExecutionListener@42e454c5, org.springframework.boot.test.autoconfigure.restdocs.RestDocsTestExecutionListener@777be68c, org.springframework.boot.test.autoconfigure.web.client.MockRestServiceServerResetTestExecutionListener@2a590e2f, org.springframework.boot.test.autoconfigure.web.servlet.MockMvcPrintOnlyOnFailureTestExecutionListener@3a2cf8b1, org.springframework.boot.test.autoconfigure.web.servlet.WebDriverTestExecutionListener@5a0ec14d]
26-Feb-2019 00:00:51 00:00:51.725 [main] DEBUG org.springframework.test.annotation.ProfileValueUtils - Retrieved @ProfileValueSourceConfiguration [null] for test class [org.springframework.cloud.skipper.server.repository.RepositoryMvcTests]
26-Feb-2019 00:00:51 00:00:51.725 [main] DEBUG org.springframework.test.annotation.ProfileValueUtils - Retrieved ProfileValueSource type [class org.springframework.test.annotation.SystemProfileValueSource] for class [org.springframework.cloud.skipper.server.repository.RepositoryMvcTests]
26-Feb-2019 00:00:51 00:00:51.725 [main] DEBUG org.springframework.test.annotation.ProfileValueUtils - Retrieved @ProfileValueSourceConfiguration [null] for test class [org.springframework.cloud.skipper.server.repository.RepositoryMvcTests]
26-Feb-2019 00:00:51 00:00:51.725 [main] DEBUG org.springframework.test.annotation.ProfileValueUtils - Retrieved ProfileValueSource type [class org.springframework.test.annotation.SystemProfileValueSource] for class [org.springframework.cloud.skipper.server.repository.RepositoryMvcTests]
26-Feb-2019 00:00:51 00:00:51.726 [main] DEBUG org.springframework.test.annotation.ProfileValueUtils - Retrieved @ProfileValueSourceConfiguration [null] for test class [org.springframework.cloud.skipper.server.repository.RepositoryMvcTests]
26-Feb-2019 00:00:51 00:00:51.726 [main] DEBUG org.springframework.test.annotation.ProfileValueUtils - Retrieved ProfileValueSource type [class org.springframework.test.annotation.SystemProfileValueSource] for class [org.springframework.cloud.skipper.server.repository.RepositoryMvcTests]
26-Feb-2019 00:00:51 00:00:51.726 [main] DEBUG org.springframework.test.context.support.AbstractDirtiesContextTestExecutionListener - Before test class: context [DefaultTestContext@72690306 testClass = RepositoryMvcTests, testInstance = [null], testMethod = [null], testException = [null], mergedContextConfiguration = [WebMergedContextConfiguration@10235312 testClass = RepositoryMvcTests, locations = '{}', classes = '{class org.springframework.cloud.skipper.server.AbstractMockMvcTests$TestConfig, class org.springframework.cloud.skipper.server.AbstractMockMvcTests$TestConfig}', contextInitializerClasses = '[]', activeProfiles = '{}', propertySourceLocations = '{}', propertySourceProperties = '{spring.main.allow-bean-definition-overriding=true, org.springframework.boot.test.context.SpringBootTestContextBootstrapper=true}', contextCustomizers = set[[ImportsContextCustomizer@4d97c8d7 key = [org.springframework.boot.test.autoconfigure.web.servlet.MockMvcAutoConfiguration, org.springframework.boot.test.autoconfigure.web.servlet.MockMvcSecurityAutoConfiguration, org.springframework.boot.test.autoconfigure.web.servlet.MockMvcWebClientAutoConfiguration, org.springframework.boot.test.autoconfigure.web.servlet.MockMvcWebDriverAutoConfiguration]], org.springframework.boot.test.context.filter.ExcludeFilterContextCustomizer@55d58825, org.springframework.boot.test.json.DuplicateJsonObjectContextCustomizerFactory$DuplicateJsonObjectContextCustomizer@663bb8ef, org.springframework.boot.test.mock.mockito.MockitoContextCustomizer@0, org.springframework.boot.test.web.client.TestRestTemplateContextCustomizer@2c88a3e8, org.springframework.boot.test.autoconfigure.properties.PropertyMappingContextCustomizer@e7e8512, org.springframework.boot.test.autoconfigure.web.servlet.WebDriverContextCustomizerFactory$Customizer@22a10ac6], resourceBasePath = 'src/main/webapp', contextLoader = 'org.springframework.boot.test.context.SpringBootContextLoader', parent = [null]], attributes = map['org.springframework.test.context.web.ServletTestExecutionListener.activateListener' -> true]], class annotated with @DirtiesContext [false] with mode [null].
26-Feb-2019 00:00:51 00:00:51.726 [main] DEBUG org.springframework.test.annotation.ProfileValueUtils - Retrieved @ProfileValueSourceConfiguration [null] for test class [org.springframework.cloud.skipper.server.repository.RepositoryMvcTests]
26-Feb-2019 00:00:51 00:00:51.726 [main] DEBUG org.springframework.test.annotation.ProfileValueUtils - Retrieved ProfileValueSource type [class org.springframework.test.annotation.SystemProfileValueSource] for class [org.springframework.cloud.skipper.server.repository.RepositoryMvcTests]
26-Feb-2019 00:00:51 00:00:51.727 [main] DEBUG org.springframework.test.context.support.TestPropertySourceUtils - Adding inlined properties to environment: {spring.jmx.enabled=false, spring.main.allow-bean-definition-overriding=true, org.springframework.boot.test.context.SpringBootTestContextBootstrapper=true, server.port=-1}
26-Feb-2019 00:00:51 00:00:51.733 [main] DEBUG org.springframework.boot.context.logging.ClasspathLoggingApplicationListener - Application failed to start with classpath: [file:/opt/bamboo-home/xml-data/build-dir/SCSKIP-BMASTER-JOB1/spring-cloud-skipper-server-core/target/surefire/surefirebooter3109259931034045945.jar, file:/opt/users/bamboo/.m2/repository/org/jacoco/org.jacoco.agent/0.7.9/org.jacoco.agent-0.7.9-runtime.jar]
26-Feb-2019 00:00:51 00:00:51.733 [main] ERROR org.springframework.boot.SpringApplication - Application run failed
26-Feb-2019 00:00:51 java.lang.IllegalArgumentException: Unable to instantiate factory class: io.pivotal.cfenv.spring.boot.CfEnvProcessor
26-Feb-2019 00:00:51         at org.springframework.core.io.support.SpringFactoriesLoader.instantiateFactory(SpringFactoriesLoader.java:167)
26-Feb-2019 00:00:51         at org.springframework.core.io.support.SpringFactoriesLoader.loadFactories(SpringFactoriesLoader.java:104)
26-Feb-2019 00:00:51         at io.pivotal.cfenv.spring.boot.CfEnvironmentPostProcessor.loadCfEnvProcessors(CfEnvironmentPostProcessor.java:144)
26-Feb-2019 00:00:51         at io.pivotal.cfenv.spring.boot.CfEnvironmentPostProcessor.onApplicationEvent(CfEnvironmentPostProcessor.java:134)
26-Feb-2019 00:00:51         at org.springframework.context.event.SimpleApplicationEventMulticaster.doInvokeListener(SimpleApplicationEventMulticaster.java:172)
26-Feb-2019 00:00:51         at org.springframework.context.event.SimpleApplicationEventMulticaster.invokeListener(SimpleApplicationEventMulticaster.java:165)
26-Feb-2019 00:00:51         at org.springframework.context.event.SimpleApplicationEventMulticaster.multicastEvent(SimpleApplicationEventMulticaster.java:139)
26-Feb-2019 00:00:51         at org.springframework.context.event.SimpleApplicationEventMulticaster.multicastEvent(SimpleApplicationEventMulticaster.java:127)
26-Feb-2019 00:00:51         at org.springframework.boot.context.event.EventPublishingRunListener.environmentPrepared(EventPublishingRunListener.java:75)
26-Feb-2019 00:00:51         at org.springframework.boot.SpringApplicationRunListeners.environmentPrepared(SpringApplicationRunListeners.java:54)
26-Feb-2019 00:00:51         at org.springframework.boot.SpringApplication.prepareEnvironment(SpringApplication.java:347)
26-Feb-2019 00:00:51         at org.springframework.boot.SpringApplication.run(SpringApplication.java:306)
26-Feb-2019 00:00:51         at org.springframework.boot.builder.SpringApplicationBuilder.run(SpringApplicationBuilder.java:139)
26-Feb-2019 00:00:51         at org.springframework.cloud.bootstrap.BootstrapApplicationListener.bootstrapServiceContext(BootstrapApplicationListener.java:191)
26-Feb-2019 00:00:51         at org.springframework.cloud.bootstrap.BootstrapApplicationListener.onApplicationEvent(BootstrapApplicationListener.java:105)
26-Feb-2019 00:00:51         at org.springframework.cloud.bootstrap.BootstrapApplicationListener.onApplicationEvent(BootstrapApplicationListener.java:71)
26-Feb-2019 00:00:51         at org.springframework.context.event.SimpleApplicationEventMulticaster.doInvokeListener(SimpleApplicationEventMulticaster.java:172)
26-Feb-2019 00:00:51         at org.springframework.context.event.SimpleApplicationEventMulticaster.invokeListener(SimpleApplicationEventMulticaster.java:165)
26-Feb-2019 00:00:51         at org.springframework.context.event.SimpleApplicationEventMulticaster.multicastEvent(SimpleApplicationEventMulticaster.java:139)
26-Feb-2019 00:00:51         at org.springframework.context.event.SimpleApplicationEventMulticaster.multicastEvent(SimpleApplicationEventMulticaster.java:127)
26-Feb-2019 00:00:51         at org.springframework.boot.context.event.EventPublishingRunListener.environmentPrepared(EventPublishingRunListener.java:75)
26-Feb-2019 00:00:51         at org.springframework.boot.SpringApplicationRunListeners.environmentPrepared(SpringApplicationRunListeners.java:54)
26-Feb-2019 00:00:51         at org.springframework.boot.SpringApplication.prepareEnvironment(SpringApplication.java:347)
26-Feb-2019 00:00:51         at org.springframework.boot.SpringApplication.run(SpringApplication.java:306)
26-Feb-2019 00:00:51         at org.springframework.boot.test.context.SpringBootContextLoader.loadContext(SpringBootContextLoader.java:127)
26-Feb-2019 00:00:51         at org.springframework.test.context.cache.DefaultCacheAwareContextLoaderDelegate.loadContextInternal(DefaultCacheAwareContextLoaderDelegate.java:99)
26-Feb-2019 00:00:51         at org.springframework.test.context.cache.DefaultCacheAwareContextLoaderDelegate.loadContext(DefaultCacheAwareContextLoaderDelegate.java:117)
26-Feb-2019 00:00:51         at org.springframework.test.context.support.DefaultTestContext.getApplicationContext(DefaultTestContext.java:108)
26-Feb-2019 00:00:51         at org.springframework.test.context.web.ServletTestExecutionListener.setUpRequestContextIfNecessary(ServletTestExecutionListener.java:190)
26-Feb-2019 00:00:51         at org.springframework.test.context.web.ServletTestExecutionListener.prepareTestInstance(ServletTestExecutionListener.java:132)
26-Feb-2019 00:00:51         at org.springframework.test.context.TestContextManager.prepareTestInstance(TestContextManager.java:246)
26-Feb-2019 00:00:51         at org.springframework.test.context.junit4.SpringJUnit4ClassRunner.createTest(SpringJUnit4ClassRunner.java:227)
26-Feb-2019 00:00:51         at org.springframework.test.context.junit4.SpringJUnit4ClassRunner$1.runReflectiveCall(SpringJUnit4ClassRunner.java:289)
26-Feb-2019 00:00:51         at org.junit.internal.runners.model.ReflectiveCallable.run(ReflectiveCallable.java:12)
26-Feb-2019 00:00:51         at org.springframework.test.context.junit4.SpringJUnit4ClassRunner.methodBlock(SpringJUnit4ClassRunner.java:291)
26-Feb-2019 00:00:51         at org.springframework.test.context.junit4.SpringJUnit4ClassRunner.runChild(SpringJUnit4ClassRunner.java:246)
26-Feb-2019 00:00:51         at org.springframework.test.context.junit4.SpringJUnit4ClassRunner.runChild(SpringJUnit4ClassRunner.java:97)
26-Feb-2019 00:00:51         at org.junit.runners.ParentRunner$3.run(ParentRunner.java:290)
26-Feb-2019 00:00:51         at org.junit.runners.ParentRunner$1.schedule(ParentRunner.java:71)
26-Feb-2019 00:00:51         at org.junit.runners.ParentRunner.runChildren(ParentRunner.java:288)
26-Feb-2019 00:00:51         at org.junit.runners.ParentRunner.access$000(ParentRunner.java:58)
26-Feb-2019 00:00:51         at org.junit.runners.ParentRunner$2.evaluate(ParentRunner.java:268)
26-Feb-2019 00:00:51         at org.springframework.test.context.junit4.statements.RunBeforeTestClassCallbacks.evaluate(RunBeforeTestClassCallbacks.java:61)
26-Feb-2019 00:00:51         at org.springframework.test.context.junit4.statements.RunAfterTestClassCallbacks.evaluate(RunAfterTestClassCallbacks.java:70)
26-Feb-2019 00:00:51         at org.junit.runners.ParentRunner.run(ParentRunner.java:363)
26-Feb-2019 00:00:51         at org.springframework.test.context.junit4.SpringJUnit4ClassRunner.run(SpringJUnit4ClassRunner.java:190)
26-Feb-2019 00:00:51         at org.apache.maven.surefire.junit4.JUnit4Provider.execute(JUnit4Provider.java:365)
26-Feb-2019 00:00:51         at org.apache.maven.surefire.junit4.JUnit4Provider.executeWithRerun(JUnit4Provider.java:272)
26-Feb-2019 00:00:51         at org.apache.maven.surefire.junit4.JUnit4Provider.executeTestSet(JUnit4Provider.java:236)
26-Feb-2019 00:00:51         at org.apache.maven.surefire.junit4.JUnit4Provider.invoke(JUnit4Provider.java:159)
26-Feb-2019 00:00:51         at org.apache.maven.surefire.booter.ForkedBooter.invokeProviderInSameClassLoader(ForkedBooter.java:386)
26-Feb-2019 00:00:51         at org.apache.maven.surefire.booter.ForkedBooter.runSuitesInProcess(ForkedBooter.java:323)
26-Feb-2019 00:00:51         at org.apache.maven.surefire.booter.ForkedBooter.main(ForkedBooter.java:143)
26-Feb-2019 00:00:51 Caused by: java.lang.ClassNotFoundException: io.pivotal.cfenv.sso.CfSingleSignOnProcessor
26-Feb-2019 00:00:51         at java.net.URLClassLoader.findClass(URLClassLoader.java:381)
26-Feb-2019 00:00:51         at java.lang.ClassLoader.loadClass(ClassLoader.java:424)
26-Feb-2019 00:00:51         at sun.misc.Launcher$AppClassLoader.loadClass(Launcher.java:335)
26-Feb-2019 00:00:51         at java.lang.ClassLoader.loadClass(ClassLoader.java:357)
26-Feb-2019 00:00:51         at java.lang.Class.forName0(Native Method)
26-Feb-2019 00:00:51         at java.lang.Class.forName(Class.java:348)
26-Feb-2019 00:00:51         at org.springframework.util.ClassUtils.forName(ClassUtils.java:275)
26-Feb-2019 00:00:51         at org.springframework.core.io.support.SpringFactoriesLoader.instantiateFactory(SpringFactoriesLoader.java:159)
26-Feb-2019 00:00:51         ... 52 common frames omitted
26-Feb-2019 00:00:51 00:00:51.733 [main] ERROR org.springframework.test.context.TestContextManager - Caught exception while allowing TestExecutionListener [org.springframework.test.context.web.ServletTestExecutionListener@7371f9b7] to prepare test instance [org.springframework.cloud.skipper.server.repository.RepositoryMvcTests@7e15d4ff]
26-Feb-2019 00:00:51 java.lang.IllegalStateException: Failed to load ApplicationContext
26-Feb-2019 00:00:51         at org.springframework.test.context.cache.DefaultCacheAwareContextLoaderDelegate.loadContext(DefaultCacheAwareContextLoaderDelegate.java:125)
26-Feb-2019 00:00:51         at org.springframework.test.context.support.DefaultTestContext.getApplicationContext(DefaultTestContext.java:108)
26-Feb-2019 00:00:51         at org.springframework.test.context.web.ServletTestExecutionListener.setUpRequestContextIfNecessary(ServletTestExecutionListener.java:190)
26-Feb-2019 00:00:51         at org.springframework.test.context.web.ServletTestExecutionListener.prepareTestInstance(ServletTestExecutionListener.java:132)
26-Feb-2019 00:00:51         at org.springframework.test.context.TestContextManager.prepareTestInstance(TestContextManager.java:246)
26-Feb-2019 00:00:51         at org.springframework.test.context.junit4.SpringJUnit4ClassRunner.createTest(SpringJUnit4ClassRunner.java:227)
26-Feb-2019 00:00:51         at org.springframework.test.context.junit4.SpringJUnit4ClassRunner$1.runReflectiveCall(SpringJUnit4ClassRunner.java:289)
26-Feb-2019 00:00:51         at org.junit.internal.runners.model.ReflectiveCallable.run(ReflectiveCallable.java:12)
26-Feb-2019 00:00:51         at org.springframework.test.context.junit4.SpringJUnit4ClassRunner.methodBlock(SpringJUnit4ClassRunner.java:291)
26-Feb-2019 00:00:51         at org.springframework.test.context.junit4.SpringJUnit4ClassRunner.runChild(SpringJUnit4ClassRunner.java:246)
26-Feb-2019 00:00:51         at org.springframework.test.context.junit4.SpringJUnit4ClassRunner.runChild(SpringJUnit4ClassRunner.java:97)
26-Feb-2019 00:00:51         at org.junit.runners.ParentRunner$3.run(ParentRunner.java:290)
26-Feb-2019 00:00:51         at org.junit.runners.ParentRunner$1.schedule(ParentRunner.java:71)
26-Feb-2019 00:00:51         at org.junit.runners.ParentRunner.runChildren(ParentRunner.java:288)
26-Feb-2019 00:00:51         at org.junit.runners.ParentRunner.access$000(ParentRunner.java:58)
26-Feb-2019 00:00:51         at org.junit.runners.ParentRunner$2.evaluate(ParentRunner.java:268)
26-Feb-2019 00:00:51         at org.springframework.test.context.junit4.statements.RunBeforeTestClassCallbacks.evaluate(RunBeforeTestClassCallbacks.java:61)
26-Feb-2019 00:00:51         at org.springframework.test.context.junit4.statements.RunAfterTestClassCallbacks.evaluate(RunAfterTestClassCallbacks.java:70)
26-Feb-2019 00:00:51         at org.junit.runners.ParentRunner.run(ParentRunner.java:363)
26-Feb-2019 00:00:51         at org.springframework.test.context.junit4.SpringJUnit4ClassRunner.run(SpringJUnit4ClassRunner.java:190)
26-Feb-2019 00:00:51         at org.apache.maven.surefire.junit4.JUnit4Provider.execute(JUnit4Provider.java:365)
26-Feb-2019 00:00:51         at org.apache.maven.surefire.junit4.JUnit4Provider.executeWithRerun(JUnit4Provider.java:272)
26-Feb-2019 00:00:51         at org.apache.maven.surefire.junit4.JUnit4Provider.executeTestSet(JUnit4Provider.java:236)
26-Feb-2019 00:00:51         at org.apache.maven.surefire.junit4.JUnit4Provider.invoke(JUnit4Provider.java:159)
26-Feb-2019 00:00:51         at org.apache.maven.surefire.booter.ForkedBooter.invokeProviderInSameClassLoader(ForkedBooter.java:386)
26-Feb-2019 00:00:51         at org.apache.maven.surefire.booter.ForkedBooter.runSuitesInProcess(ForkedBooter.java:323)
26-Feb-2019 00:00:51         at org.apache.maven.surefire.booter.ForkedBooter.main(ForkedBooter.java:143)
26-Feb-2019 00:00:51 Caused by: java.lang.IllegalArgumentException: Unable to instantiate factory class: io.pivotal.cfenv.spring.boot.CfEnvProcessor
26-Feb-2019 00:00:51         at org.springframework.core.io.support.SpringFactoriesLoader.instantiateFactory(SpringFactoriesLoader.java:167)
26-Feb-2019 00:00:51         at org.springframework.core.io.support.SpringFactoriesLoader.loadFactories(SpringFactoriesLoader.java:104)
26-Feb-2019 00:00:51         at io.pivotal.cfenv.spring.boot.CfEnvironmentPostProcessor.loadCfEnvProcessors(CfEnvironmentPostProcessor.java:144)
26-Feb-2019 00:00:51         at io.pivotal.cfenv.spring.boot.CfEnvironmentPostProcessor.onApplicationEvent(CfEnvironmentPostProcessor.java:134)
26-Feb-2019 00:00:51         at org.springframework.context.event.SimpleApplicationEventMulticaster.doInvokeListener(SimpleApplicationEventMulticaster.java:172)
26-Feb-2019 00:00:51         at org.springframework.context.event.SimpleApplicationEventMulticaster.invokeListener(SimpleApplicationEventMulticaster.java:165)
26-Feb-2019 00:00:51         at org.springframework.context.event.SimpleApplicationEventMulticaster.multicastEvent(SimpleApplicationEventMulticaster.java:139)
26-Feb-2019 00:00:51         at org.springframework.context.event.SimpleApplicationEventMulticaster.multicastEvent(SimpleApplicationEventMulticaster.java:127)
26-Feb-2019 00:00:51         at org.springframework.boot.context.event.EventPublishingRunListener.environmentPrepared(EventPublishingRunListener.java:75)
26-Feb-2019 00:00:51         at org.springframework.boot.SpringApplicationRunListeners.environmentPrepared(SpringApplicationRunListeners.java:54)
26-Feb-2019 00:00:51         at org.springframework.boot.SpringApplication.prepareEnvironment(SpringApplication.java:347)
26-Feb-2019 00:00:51         at org.springframework.boot.SpringApplication.run(SpringApplication.java:306)
26-Feb-2019 00:00:51         at org.springframework.boot.builder.SpringApplicationBuilder.run(SpringApplicationBuilder.java:139)
26-Feb-2019 00:00:51         at org.springframework.cloud.bootstrap.BootstrapApplicationListener.bootstrapServiceContext(BootstrapApplicationListener.java:191)
26-Feb-2019 00:00:51         at org.springframework.cloud.bootstrap.BootstrapApplicationListener.onApplicationEvent(BootstrapApplicationListener.java:105)
26-Feb-2019 00:00:51         at org.springframework.cloud.bootstrap.BootstrapApplicationListener.onApplicationEvent(BootstrapApplicationListener.java:71)
26-Feb-2019 00:00:51         at org.springframework.context.event.SimpleApplicationEventMulticaster.doInvokeListener(SimpleApplicationEventMulticaster.java:172)
26-Feb-2019 00:00:51         at org.springframework.context.event.SimpleApplicationEventMulticaster.invokeListener(SimpleApplicationEventMulticaster.java:165)
26-Feb-2019 00:00:51         at org.springframework.context.event.SimpleApplicationEventMulticaster.multicastEvent(SimpleApplicationEventMulticaster.java:139)
26-Feb-2019 00:00:51         at org.springframework.context.event.SimpleApplicationEventMulticaster.multicastEvent(SimpleApplicationEventMulticaster.java:127)
26-Feb-2019 00:00:51         at org.springframework.boot.context.event.EventPublishingRunListener.environmentPrepared(EventPublishingRunListener.java:75)
26-Feb-2019 00:00:51         at org.springframework.boot.SpringApplicationRunListeners.environmentPrepared(SpringApplicationRunListeners.java:54)
26-Feb-2019 00:00:51         at org.springframework.boot.SpringApplication.prepareEnvironment(SpringApplication.java:347)
26-Feb-2019 00:00:51         at org.springframework.boot.SpringApplication.run(SpringApplication.java:306)
26-Feb-2019 00:00:51         at org.springframework.boot.test.context.SpringBootContextLoader.loadContext(SpringBootContextLoader.java:127)
26-Feb-2019 00:00:51         at org.springframework.test.context.cache.DefaultCacheAwareContextLoaderDelegate.loadContextInternal(DefaultCacheAwareContextLoaderDelegate.java:99)
26-Feb-2019 00:00:51         at org.springframework.test.context.cache.DefaultCacheAwareContextLoaderDelegate.loadContext(DefaultCacheAwareContextLoaderDelegate.java:117)
26-Feb-2019 00:00:51         ... 26 common frames omitted
26-Feb-2019 00:00:51 Caused by: java.lang.ClassNotFoundException: io.pivotal.cfenv.sso.CfSingleSignOnProcessor
26-Feb-2019 00:00:51         at java.net.URLClassLoader.findClass(URLClassLoader.java:381)
26-Feb-2019 00:00:51         at java.lang.ClassLoader.loadClass(ClassLoader.java:424)
26-Feb-2019 00:00:51         at sun.misc.Launcher$AppClassLoader.loadClass(Launcher.java:335)
26-Feb-2019 00:00:51         at java.lang.ClassLoader.loadClass(ClassLoader.java:357)
26-Feb-2019 00:00:51         at java.lang.Class.forName0(Native Method)
26-Feb-2019 00:00:51         at java.lang.Class.forName(Class.java:348)
26-Feb-2019 00:00:51         at org.springframework.util.ClassUtils.forName(ClassUtils.java:275)
26-Feb-2019 00:00:51         at org.springframework.core.io.support.SpringFactoriesLoader.instantiateFactory(SpringFactoriesLoader.java:159)
26-Feb-2019 00:00:51         ... 52 common frames omitted
26-Feb-2019 00:00:51 00:00:51.734 [main] DEBUG org.springframework.test.context.support.AbstractDirtiesContextTestExecutionListener - After test class: context [DefaultTestContext@72690306 testClass = RepositoryMvcTests, testInstance = [null], testMethod = [null], testException = [null], mergedContextConfiguration = [WebMergedContextConfiguration@10235312 testClass = RepositoryMvcTests, locations = '{}', classes = '{class org.springframework.cloud.skipper.server.AbstractMockMvcTests$TestConfig, class org.springframework.cloud.skipper.server.AbstractMockMvcTests$TestConfig}', contextInitializerClasses = '[]', activeProfiles = '{}', propertySourceLocations = '{}', propertySourceProperties = '{spring.main.allow-bean-definition-overriding=true, org.springframework.boot.test.context.SpringBootTestContextBootstrapper=true}', contextCustomizers = set[[ImportsContextCustomizer@4d97c8d7 key = [org.springframework.boot.test.autoconfigure.web.servlet.MockMvcAutoConfiguration, org.springframework.boot.test.autoconfigure.web.servlet.MockMvcSecurityAutoConfiguration, org.springframework.boot.test.autoconfigure.web.servlet.MockMvcWebClientAutoConfiguration, org.springframework.boot.test.autoconfigure.web.servlet.MockMvcWebDriverAutoConfiguration]], org.springframework.boot.test.context.filter.ExcludeFilterContextCustomizer@55d58825, org.springframework.boot.test.json.DuplicateJsonObjectContextCustomizerFactory$DuplicateJsonObjectContextCustomizer@663bb8ef, org.springframework.boot.test.mock.mockito.MockitoContextCustomizer@0, org.springframework.boot.test.web.client.TestRestTemplateContextCustomizer@2c88a3e8, org.springframework.boot.test.autoconfigure.properties.PropertyMappingContextCustomizer@e7e8512, org.springframework.boot.test.autoconfigure.web.servlet.WebDriverContextCustomizerFactory$Customizer@22a10ac6], resourceBasePath = 'src/main/webapp', contextLoader = 'org.springframework.boot.test.context.SpringBootContextLoader', parent = [null]], attributes = map['org.springframework.test.context.web.ServletTestExecutionListener.activateListener' -> true]], class annotated with @DirtiesContext [false] with mode [null].
26-Feb-2019 00:00:51 [ERROR] Tests run: 1, Failures: 0, Errors: 1, Skipped: 0, Time elapsed: 0.002 s <<< FAILURE! - in org.springframework.cloud.skipper.server.repository.RepositoryMvcTests
26-Feb-2019 00:00:51 [ERROR] shouldReturnRepositoryIndex(org.springframework.cloud.skipper.server.repository.RepositoryMvcTests)  Time elapsed: 0 s  <<< ERROR!
26-Feb-2019 00:00:51 java.lang.IllegalStateException: Failed to load ApplicationContext
26-Feb-2019 00:00:51 Caused by: java.lang.IllegalArgumentException: Unable to instantiate factory class: io.pivotal.cfenv.spring.boot.CfEnvProcessor
26-Feb-2019 00:00:51 Caused by: java.lang.ClassNotFoundException: io.pivotal.cfenv.sso.CfSingleSignOnProcessor
26-Feb-2019 00:00:51
26-Feb-2019 00:00:51 00:00:51.768 [pool-6-thread-1] DEBUG org.springframework.statemachine.support.DefaultStateMachineExecutor - TimedTrigger triggered org.springframework.statemachine.trigger.TimerTrigger@16ced6ac
26-Feb-2019 00:00:51 00:00:51.887 [pool-8-thread-1] DEBUG org.springframework.statemachine.support.DefaultStateMachineExecutor - TimedTrigger triggered org.springframework.statemachine.trigger.TimerTrigger@c77f6b0
26-Feb-2019 00:00:51 00:00:51.971 [pool-10-thread-1] DEBUG org.springframework.statemachine.support.DefaultStateMachineExecutor - TimedTrigger triggered org.springframework.statemachine.trigger.TimerTrigger@6f99ed9f
26-Feb-2019 00:00:52 [INFO]
26-Feb-2019 00:00:52 [INFO] Results:
26-Feb-2019 00:00:52 [INFO]
26-Feb-2019 00:00:52 [ERROR] Errors:
26-Feb-2019 00:00:52 [ERROR]   PlatformPropertiesTests.deserializationTest » IllegalState Failed to load Appl...
26-Feb-2019 00:00:52 [ERROR]   SkipperServerPlatformConfigurationTests$AllPlatformsConfigurationTest.allPlatformsConfiguredTest » IllegalState
26-Feb-2019 00:00:52 [ERROR]   SkipperServerPlatformConfigurationTests$ExternalPlatformsOnlyConfigurationTest.localPlatformDisabledTest » IllegalState
26-Feb-2019 00:00:52 [ERROR]   SkipperServerPlatformConfigurationTests$SinglePlatformConfigurationTest.singlePlatformsConfiguredTest » IllegalState
26-Feb-2019 00:00:52 [ERROR]   ReleaseControllerTests.cancelNonExistingRelease » IllegalState Failed to load ...
26-Feb-2019 00:00:52 [ERROR]   ReleaseControllerTests.checkDeleteReleaseWithPackage » IllegalState Failed to ...
26-Feb-2019 00:00:52 [ERROR]   ReleaseControllerTests.checkDeployStatus » IllegalState Failed to load Applica...
26-Feb-2019 00:00:52 [ERROR]   ReleaseControllerTests.deployTickTock » IllegalState Failed to load Applicatio...
26-Feb-2019 00:00:52 [ERROR]   ReleaseControllerTests.packageDeployAndUpgrade » IllegalState Failed to load A...
26-Feb-2019 00:00:52 [ERROR]   ReleaseControllerTests.packageDeployAndUpgradeAndCancel » IllegalState Failed ...
26-Feb-2019 00:00:52 [ERROR]   ReleaseControllerTests.packageDeployRequest » IllegalState Failed to load Appl...
26-Feb-2019 00:00:52 [ERROR]   ReleaseControllerTests.releaseRollbackAndUndeploy » IllegalState Failed to loa...
26-Feb-2019 00:00:52 [ERROR]   ReleaseControllerTests.testMutableAttributesAppInstanceStatus » IllegalState F...
26-Feb-2019 00:00:52 [ERROR]   ReleaseControllerTests.testStatusReportsErrorForMissingRelease » IllegalState ...
26-Feb-2019 00:00:52 [ERROR]   RootControllerTests.indexUrlShouldRedirect » IllegalState Failed to load Appli...
26-Feb-2019 00:00:52 [ERROR]   AboutDocumentation.getMetaInformation » IllegalState Failed to load Applicatio...
26-Feb-2019 00:00:52 [ERROR]   ApiDocumentation.errors » IllegalState Failed to load ApplicationContext
26-Feb-2019 00:00:52 [ERROR]   ApiDocumentation.headers » IllegalState Failed to load ApplicationContext
26-Feb-2019 00:00:52 [ERROR]   ApiDocumentation.index » IllegalState Failed to load ApplicationContext
26-Feb-2019 00:00:52 [ERROR]   CancelDocumentation.cancelRelease » IllegalState Failed to load ApplicationCon...
26-Feb-2019 00:00:52 [ERROR]   DeleteDocumentation.deleteRelease » IllegalState Failed to load ApplicationCon...
26-Feb-2019 00:00:52 [ERROR]   DeleteDocumentation.deleteReleaseDefault » IllegalState Failed to load Applica...
26-Feb-2019 00:00:52 [ERROR]   DeployersDocumentation.getAllDeployers » IllegalState Failed to load Applicati...
26-Feb-2019 00:00:52 [ERROR]   HistoryDocumentation.showVersionHistoryForRelease » IllegalState Failed to loa...
26-Feb-2019 00:00:52 [ERROR]   InstallDocumentation.installPackage » IllegalState Failed to load ApplicationC...
26-Feb-2019 00:00:52 [ERROR]   InstallDocumentation.installPackageWithId » IllegalState Failed to load Applic...
26-Feb-2019 00:00:52 [ERROR]   ListDocumentation.listRelease » IllegalState Failed to load ApplicationContext
26-Feb-2019 00:00:52 [ERROR]   ListDocumentation.listReleasesByReleaseName » IllegalState Failed to load Appl...
26-Feb-2019 00:00:52 [ERROR]   ManifestDocumentation.getManifestOfRelease » IllegalState Failed to load Appli...
26-Feb-2019 00:00:52 [ERROR]   ManifestDocumentation.getManifestOfReleaseForVersion » IllegalState Failed to ...
26-Feb-2019 00:00:52 [ERROR]   PackageMetadataDocumentation.getAllPackageMetadata » IllegalState Failed to lo...
26-Feb-2019 00:00:52 [ERROR]   PackageMetadataDocumentation.getPackageMetadataDetails » IllegalState Failed t...
26-Feb-2019 00:00:52 [ERROR]   PackageMetadataDocumentation.getPackageMetadataSearchFindByName » IllegalState
26-Feb-2019 00:00:52 [ERROR]   PackageMetadataDocumentation.getPackageMetadataSearchFindByNameContainingIgnoreCase » IllegalState
26-Feb-2019 00:00:52 [ERROR]   PackageMetadataDocumentation.getPackageMetadataSummary » IllegalState Failed t...
26-Feb-2019 00:00:52 [ERROR]   ReleasesDocumentation.getAllReleases » IllegalState Failed to load Application...
26-Feb-2019 00:00:52 [ERROR]   RepositoriesDocumentation.getAllRepositories » IllegalState Failed to load App...
26-Feb-2019 00:00:52 [ERROR]   RepositoriesDocumentation.getSingleRepository » IllegalState Failed to load Ap...
26-Feb-2019 00:00:52 [ERROR]   RollbackDocumentation.rollbackRelease » IllegalState Failed to load Applicatio...
26-Feb-2019 00:00:52 [ERROR]   RollbackDocumentation.rollbackReleaseRequest » IllegalState Failed to load App...
26-Feb-2019 00:00:52 [ERROR]   StatusDocumentation.getStatusOfRelease » IllegalState Failed to load Applicati...
26-Feb-2019 00:00:52 [ERROR]   StatusDocumentation.getStatusOfReleaseForVersion » IllegalState Failed to load...
26-Feb-2019 00:00:52 [ERROR]   UpgradeDocumentation.upgradeRelease » IllegalState Failed to load ApplicationC...
26-Feb-2019 00:00:52 [ERROR]   UploadDocumentation.uploadRelease » IllegalState Failed to load ApplicationCon...
26-Feb-2019 00:00:52 [ERROR]   DeployerRepositoryTests.basicCrud » IllegalState Failed to load ApplicationCon...
26-Feb-2019 00:00:52 [ERROR]   PackageMetadataMvcTests.shouldReturnRepositoryIndex » IllegalState Failed to l...
26-Feb-2019 00:00:52 [ERROR]   PackageMetadataMvcTests.testProjection » IllegalState Failed to load Applicati...
26-Feb-2019 00:00:52 [ERROR]   PackageMetadataRepositoryTests.basicCrud » IllegalState Failed to load Applica...
26-Feb-2019 00:00:52 [ERROR]   PackageMetadataRepositoryTests.findByNameAndVersionWithMultipleRepos » IllegalState
26-Feb-2019 00:00:52 [ERROR]   PackageMetadataRepositoryTests.findByNameQueries » IllegalState Failed to load...
26-Feb-2019 00:00:52 [ERROR]   PackageMetadataRepositoryTests.verifyMultipleVersions » IllegalState Failed to...
26-Feb-2019 00:00:52 [ERROR]   ReleaseRepositoryTests.verifyFindByMethods » IllegalState Failed to load Appli...
26-Feb-2019 00:00:52 [ERROR]   ReleaseRepositoryTests.verifyReleaseNotFoundByName » IllegalState Failed to lo...
26-Feb-2019 00:00:52 [ERROR]   ReleaseRepositoryTests.verifyReleaseNotFoundByNameAndVersion » IllegalState Fa...
26-Feb-2019 00:00:52 [ERROR]   ReleaseRepositoryTests.verifydeleteIfAllReleasesDeleted » IllegalState Failed ...
26-Feb-2019 00:00:52 [ERROR]   ReleaseRepositoryTests.verifydeletePackageFromRemoteRepository » IllegalState ...
26-Feb-2019 00:00:52 [ERROR]   RepositoryMvcTests.shouldReturnRepositoryIndex » IllegalState Failed to load A...
26-Feb-2019 00:00:52 [ERROR]   RepositoryRepositoryTests.basicCrud » IllegalState Failed to load ApplicationC...
26-Feb-2019 00:00:52 [ERROR]   SchemaGenerationTests.generateSchemaDdlFiles » IllegalState Failed to load App...
26-Feb-2019 00:00:52 [ERROR]   ConfigValueUtilsTests.testYamlMerge » IllegalState Failed to load ApplicationC...
26-Feb-2019 00:00:52 [ERROR]   PackageMetadataServiceTests.calculateFilename » IllegalState Failed to load Ap...
26-Feb-2019 00:00:52 [ERROR]   PackageServiceTests.deserializeNestedPackage » IllegalState Failed to load App...
26-Feb-2019 00:00:52 [ERROR]   PackageServiceTests.deserializePackage » IllegalState Failed to load Applicati...
26-Feb-2019 00:00:52 [ERROR]   PackageServiceTests.download » IllegalState Failed to load ApplicationContext
26-Feb-2019 00:00:52 [ERROR]   PackageServiceTests.testExceptions » IllegalState Failed to load ApplicationCo...
26-Feb-2019 00:00:52 [ERROR]   PackageServiceTests.testInvalidVersions » IllegalState Failed to load Applicat...
26-Feb-2019 00:00:52 [ERROR]   PackageServiceTests.testPackageNameVersionMismatch » IllegalState Failed to lo...
26-Feb-2019 00:00:52 [ERROR]   PackageServiceTests.upload » IllegalState Failed to load ApplicationContext
26-Feb-2019 00:00:52 [ERROR]   ReleaseAnalyzerTests.releaseAnalyzerAndAdditiveUpgradeTest » IllegalState Fail...
26-Feb-2019 00:00:52 [ERROR]   ReleaseServiceTests.testBadArguments » IllegalState Failed to load Application...
26-Feb-2019 00:00:52 [ERROR]   ReleaseServiceTests.testDeletedReleaseWithPackage » IllegalState Failed to loa...
26-Feb-2019 00:00:52 [ERROR]   ReleaseServiceTests.testDeletedReleaseWithPackageNonLocalRepo » IllegalState F...
26-Feb-2019 00:00:52 [ERROR]   ReleaseServiceTests.testInstallAndUpdatePackageNotFound » IllegalState Failed ...
26-Feb-2019 00:00:52 [ERROR]   ReleaseServiceTests.testInstallByLatestPackage » IllegalState Failed to load A...
26-Feb-2019 00:00:52 [ERROR]   ReleaseServiceTests.testInstallDeleteOfdMultipleReleasesFromSingePackage » IllegalState
26-Feb-2019 00:00:52 [ERROR]   ReleaseServiceTests.testInstallDeletedRelease » IllegalState Failed to load Ap...
26-Feb-2019 00:00:52 [ERROR]   ReleaseServiceTests.testInstallPackageNotFound » IllegalState Failed to load A...
26-Feb-2019 00:00:52 [ERROR]   ReleaseServiceTests.testInstallReleaseThatIsNotDeleted » IllegalState Failed t...
26-Feb-2019 00:00:52 [ERROR]   ReleaseServiceTests.testLatestPackageByName » IllegalState Failed to load Appl...
26-Feb-2019 00:00:52 [ERROR]   ReleaseServiceTests.testPackageNotFound » IllegalState Failed to load Applicat...
26-Feb-2019 00:00:52 [ERROR]   ReleaseServiceTests.testRollbackDeletedRelease » IllegalState Failed to load A...
26-Feb-2019 00:00:52 [ERROR]   ReleaseServiceTests.testStatus » IllegalState Failed to load ApplicationContex...
26-Feb-2019 00:00:52 [ERROR]   ReleaseServiceTests.testStatusReleaseDoesNotExist » IllegalState Failed to loa...
26-Feb-2019 00:00:52 [ERROR]   PackageTemplateTests.testMustasche » IllegalState Failed to load ApplicationCo...
26-Feb-2019 00:00:52 [INFO]
26-Feb-2019 00:00:52 [ERROR] Tests run: 105, Failures: 0, Errors: 84, Skipped: 0
26-Feb-2019 00:00:52 [INFO]
26-Feb-2019 00:00:52 [INFO] ------------------------------------------------------------------------
26-Feb-2019 00:00:52 [INFO] Reactor Summary:
26-Feb-2019 00:00:52 [INFO]
26-Feb-2019 00:00:52 [INFO] Spring Cloud Skipper ............................... SUCCESS [  1.778 s]
26-Feb-2019 00:00:52 [INFO] Spring Cloud Skipper :: Skipper .................... SUCCESS [  8.513 s]
26-Feb-2019 00:00:52 [INFO] Spring Cloud Skipper :: Server Core ................ FAILURE [ 24.490 s]
26-Feb-2019 00:00:52 [INFO] Spring Cloud Skipper :: Kubernetes Platform ........ SKIPPED
26-Feb-2019 00:00:52 [INFO] Spring Cloud Skipper :: CloudFoundry Platform ...... SKIPPED
26-Feb-2019 00:00:52 [INFO] Spring Cloud Skipper :: Autoconfigure .............. SKIPPED
26-Feb-2019 00:00:52 [INFO] Spring Cloud Skipper :: Server ..................... SKIPPED
26-Feb-2019 00:00:52 [INFO] Spring Cloud Skipper :: Client ..................... SKIPPED
26-Feb-2019 00:00:52 [INFO] Spring Cloud Skipper :: Shell Commands ............. SKIPPED
26-Feb-2019 00:00:52 [INFO] Spring Cloud Skipper :: Shell ...................... SKIPPED
26-Feb-2019 00:00:52 [INFO] Spring Cloud Skipper :: Docs ....................... SKIPPED
26-Feb-2019 00:00:52 [INFO] Spring Cloud Skipper :: Dependencies ............... SKIPPED
26-Feb-2019 00:00:52 [INFO] Spring Cloud Starter :: Skipper Server ............. SKIPPED
26-Feb-2019 00:00:52 [INFO] ------------------------------------------------------------------------
26-Feb-2019 00:00:52 [INFO] BUILD FAILURE
26-Feb-2019 00:00:52 [INFO] ------------------------------------------------------------------------
26-Feb-2019 00:00:52 [INFO] Total time: 35.617 s
26-Feb-2019 00:00:52 [INFO] Finished at: 2019-02-26T00:00:52Z
26-Feb-2019 00:00:52 [INFO] Final Memory: 97M/830M
26-Feb-2019 00:00:52 [INFO] ------------------------------------------------------------------------
26-Feb-2019 00:00:52 [ERROR] Failed to execute goal org.apache.maven.plugins:maven-surefire-plugin:2.20:test (default-test) on project spring-cloud-skipper-server-core: There are test failures.
26-Feb-2019 00:00:52 [ERROR]
26-Feb-2019 00:00:52 [ERROR] Please refer to /opt/bamboo-home/xml-data/build-dir/SCSKIP-BMASTER-JOB1/spring-cloud-skipper-server-core/target/surefire-reports for the individual test results.
26-Feb-2019 00:00:52 [ERROR] Please refer to dump files (if any exist) [date]-jvmRun[N].dump, [date].dumpstream and [date]-jvmRun[N].dumpstream.
26-Feb-2019 00:00:52 [ERROR] -> [Help 1]
26-Feb-2019 00:00:52 [ERROR]
26-Feb-2019 00:00:52 [ERROR] To see the full stack trace of the errors, re-run Maven with the -e switch.
26-Feb-2019 00:00:52 [ERROR] Re-run Maven using the -X switch to enable full debug logging.
26-Feb-2019 00:00:52 [ERROR]
26-Feb-2019 00:00:52 [ERROR] For more information about the errors and possible solutions, please read the following articles:
26-Feb-2019 00:00:52 [ERROR] [Help 1] http://cwiki.apache.org/confluence/display/MAVEN/MojoFailureException
26-Feb-2019 00:00:52 [ERROR]
26-Feb-2019 00:00:52 [ERROR] After correcting the problems, you can resume the build with the command
26-Feb-2019 00:00:52 [ERROR]   mvn <goals> -rf :spring-cloud-skipper-server-core
26-Feb-2019 00:00:52
26-Feb-2019 00:00:52 Failing task since return code of [/opt/jdk-8/bin/java -cp /opt/maven-3.5/boot/plexus-classworlds-2.5.2.jar -Dclassworlds.conf=/tmp/artifactoryM22657471448032707511conf -DbuildInfoConfig.propertiesFile=/tmp/buildInfo3576558055005614863.properties -Xmx2048m -XX:MaxPermSize=1024m -Dmaven.home=/opt/maven-3.5 -Dmaven.multiModuleProjectDirectory=/opt/bamboo-home/xml-data/build-dir/SCSKIP-BMASTER-JOB1 org.codehaus.plexus.classworlds.launcher.Launcher clean install -Pspring -Pfull --batch-mode -U -Dartifactory.publish.password=********] was 1 while expected 0
26-Feb-2019 00:00:52 Parsing test results under /opt/bamboo-home/xml-data/build-dir/SCSKIP-BMASTER-JOB1...
26-Feb-2019 00:00:52 Finished task 'Build and publish Spring Cloud Skipper' with result: Failed
26-Feb-2019 00:00:52 Running post build plugin 'Docker Container Cleanup'
26-Feb-2019 00:00:52 Running post build plugin 'NCover Results Collector'
26-Feb-2019 00:00:52 Running post build plugin 'Artifactory Release Management Staging'
26-Feb-2019 00:00:52 Running post build plugin 'Artifactory Build Info Copier'
26-Feb-2019 00:00:52 Running post build plugin 'Artifactory Gradle Properties Info Copier'
26-Feb-2019 00:00:52 Running post build plugin 'Clover Results Collector'
26-Feb-2019 00:00:52 Running post build plugin 'npm Cache Cleanup'
26-Feb-2019 00:00:52 Running post build plugin 'Artifact Copier'
26-Feb-2019 00:00:52 Publishing an artifact: Test Results
26-Feb-2019 00:00:52 Finished publishing of artifact Shared artifact: [Test Results], pattern: [**/target/surefire-reports/**/*.*] in 111.6 ms
26-Feb-2019 00:00:53 Successfully removed working directory at '/opt/bamboo-home/xml-data/build-dir/SCSKIP-BMASTER-JOB1'
26-Feb-2019 00:00:53 Finalising the build...
26-Feb-2019 00:00:53 Stopping timer.
26-Feb-2019 00:00:53 Build SCSKIP-BMASTER-JOB1-578 completed.
26-Feb-2019 00:00:53 Running on server: post build plugin 'NCover Results Collector'
26-Feb-2019 00:00:53 Running on server: post build plugin 'Build Hanging Detection Configuration'
26-Feb-2019 00:00:53 Running on server: post build plugin 'Clover Delta Calculator'
26-Feb-2019 00:00:53 Running on server: post build plugin 'Maven Dependencies Postprocessor'
26-Feb-2019 00:00:53 All post build plugins have finished
26-Feb-2019 00:00:53 Generating build results summary...
26-Feb-2019 00:00:53 Saving build results to disk...
26-Feb-2019 00:00:53 Logging substituted variables...
26-Feb-2019 00:00:53 Indexing build results...
26-Feb-2019 00:00:53 Finished building SCSKIP-BMASTER-JOB1-578.