A CI plan to test SCT against the latest JVM

Build: #167 failed Changes by Glenn Renfro

Logs

The following logs have been generated by the jobs in this plan.
  • Expand all
  • Collapse all
Job Logs
Collapse Build Spring Cloud Task Project Default Stage Download or View
30-Jul-2020 17:36:18                    
30-Jul-2020 17:36:18 Downloaded from spring-snapshots: https://repo.spring.io/libs-snapshot-local/org/springframework/spring-framework-bom/5.3.0-SNAPSHOT/maven-metadata.xml (798 B at 4.7 kB/s)
30-Jul-2020 17:36:18 Downloading from spring-snapshots: https://repo.spring.io/libs-snapshot-local/org/springframework/spring-framework-bom/5.3.0-SNAPSHOT/spring-framework-bom-5.3.0-20200730.163649-282.pom
30-Jul-2020 17:36:18 Progress (1): 0.7/5.8 kB
30-Jul-2020 17:36:18 Progress (1): 2.1/5.8 kB
30-Jul-2020 17:36:18 Progress (1): 3.4/5.8 kB
30-Jul-2020 17:36:18 Progress (1): 4.8/5.8 kB
30-Jul-2020 17:36:18 Progress (1): 5.8 kB   
30-Jul-2020 17:36:19                    
30-Jul-2020 17:36:19 Downloaded from spring-snapshots: https://repo.spring.io/libs-snapshot-local/org/springframework/spring-framework-bom/5.3.0-SNAPSHOT/spring-framework-bom-5.3.0-20200730.163649-282.pom (5.8 kB at 37 kB/s)
30-Jul-2020 17:36:19 [ERROR] [ERROR] Some problems were encountered while processing the POMs:
30-Jul-2020 17:36:19 [ERROR] Non-resolvable import POM: Could not find artifact io.rsocket:rsocket-bom:pom:1.1.0-SNAPSHOT in spring-snapshots (https://repo.spring.io/libs-snapshot-local) @ org.springframework.boot:spring-boot-dependencies:2.4.0-SNAPSHOT, /home/bamboo/.m2/repository/org/springframework/boot/spring-boot-dependencies/2.4.0-SNAPSHOT/spring-boot-dependencies-2.4.0-SNAPSHOT.pom, line 2674, column 19
30-Jul-2020 17:36:19 @
30-Jul-2020 17:36:19 [ERROR] The build could not read 1 project -> [Help 1]
30-Jul-2020 17:36:19 [ERROR]   
30-Jul-2020 17:36:19 [ERROR]   The project org.springframework.cloud:spring-cloud-task-parent:2.3.0-SNAPSHOT (/opt/bamboo-home/xml-data/build-dir/SCT-SLJ-JOB1/pom.xml) has 1 error
30-Jul-2020 17:36:19 [ERROR]     Non-resolvable import POM: Could not find artifact io.rsocket:rsocket-bom:pom:1.1.0-SNAPSHOT in spring-snapshots (https://repo.spring.io/libs-snapshot-local) @ org.springframework.boot:spring-boot-dependencies:2.4.0-SNAPSHOT, /home/bamboo/.m2/repository/org/springframework/boot/spring-boot-dependencies/2.4.0-SNAPSHOT/spring-boot-dependencies-2.4.0-SNAPSHOT.pom, line 2674, column 19 -> [Help 2]
30-Jul-2020 17:36:19 [ERROR]
30-Jul-2020 17:36:19 [ERROR] To see the full stack trace of the errors, re-run Maven with the -e switch.
30-Jul-2020 17:36:19 [ERROR] Re-run Maven using the -X switch to enable full debug logging.
30-Jul-2020 17:36:19 [ERROR]
30-Jul-2020 17:36:19 [ERROR] For more information about the errors and possible solutions, please read the following articles:
30-Jul-2020 17:36:19 [ERROR] [Help 1] http://cwiki.apache.org/confluence/display/MAVEN/ProjectBuildingException
30-Jul-2020 17:36:19 [ERROR] [Help 2] http://cwiki.apache.org/confluence/display/MAVEN/UnresolvableModelException
30-Jul-2020 17:36:19 Unable to publish artifact [Test Results]: