A CI plan to test SCT against the latest JVM

Build: #40 failed Manual run by Glenn Renfro

Logs

The following logs have been generated by the jobs in this plan.
  • Expand all
  • Collapse all
Job Logs
Collapse Build Spring Cloud Task Project Default Stage Download or View
11-Apr-2019 17:50:43 [INFO] Partitioned Batch Job .............................. SKIPPED
11-Apr-2019 17:50:43 [INFO] Task Events ........................................ SKIPPED
11-Apr-2019 17:50:43 [INFO] Batch Events Sample Application .................... SKIPPED
11-Apr-2019 17:50:43 [INFO] Spring Cloud Task JPA Sample Application ........... SKIPPED
11-Apr-2019 17:50:43 [INFO] Spring Cloud Task Multiple DataSources Application . SKIPPED
11-Apr-2019 17:50:43 [INFO] Spring Cloud Task Samples .......................... SKIPPED
11-Apr-2019 17:50:43 [INFO] Spring Cloud Task Integration Tests ................ SKIPPED
11-Apr-2019 17:50:43 [INFO] Spring Cloud Task Docs ............................. SKIPPED
11-Apr-2019 17:50:43 [INFO] ------------------------------------------------------------------------
11-Apr-2019 17:50:43 [INFO] BUILD FAILURE
11-Apr-2019 17:50:43 [INFO] ------------------------------------------------------------------------
11-Apr-2019 17:50:43 [INFO] Total time: 01:06 min
11-Apr-2019 17:50:43 [INFO] Finished at: 2019-04-11T17:50:43Z
11-Apr-2019 17:50:43 [INFO] Final Memory: 161M/407M
11-Apr-2019 17:50:43 [INFO] ------------------------------------------------------------------------
11-Apr-2019 17:50:43 [ERROR] Failed to execute goal org.asciidoctor:asciidoctor-maven-plugin:1.5.6:process-asciidoc (generate-pdf) on project spring-cloud-task-docs: Execution generate-pdf of goal org.asciidoctor:asciidoctor-maven-plugin:1.5.6:process-asciidoc failed: (LoadError) load error: jopenssl/load -- java.lang.ExceptionInInitializerError: null -> [Help 1]
11-Apr-2019 17:50:43 [ERROR]
11-Apr-2019 17:50:43 [ERROR] To see the full stack trace of the errors, re-run Maven with the -e switch.
11-Apr-2019 17:50:43 [ERROR] Re-run Maven using the -X switch to enable full debug logging.
11-Apr-2019 17:50:43 [ERROR]
11-Apr-2019 17:50:43 [ERROR] For more information about the errors and possible solutions, please read the following articles:
11-Apr-2019 17:50:43 [ERROR] [Help 1] http://cwiki.apache.org/confluence/display/MAVEN/PluginExecutionException
11-Apr-2019 17:50:43 [ERROR]
11-Apr-2019 17:50:43 [ERROR] After correcting the problems, you can resume the build with the command
11-Apr-2019 17:50:43 [ERROR]   mvn <goals> -rf :spring-cloud-task-docs